You are viewing a plain text version of this content. The canonical link for it is here.
Posted to builds@beam.apache.org by Apache Jenkins Server <je...@builds.apache.org> on 2023/08/22 06:01:44 UTC

Build failed in Jenkins: beam_PostCommit_Java_PVR_Spark_Batch #2408

See <https://ci-beam.apache.org/job/beam_PostCommit_Java_PVR_Spark_Batch/2408/display/redirect>

Changes:


------------------------------------------
[...truncated 58.07 KB...]
#16 DONE 0.2s

#17 [13/16] COPY target/LICENSE target/options/* /opt/apache/beam/options/
#17 DONE 0.2s

#18 [14/16] COPY target/go-licenses/* /opt/apache/beam/third_party_licenses/golang/
#18 DONE 0.1s

#19 [15/16] RUN if [ "true" = "false" ] ; then     rm -rf /opt/apache/beam/third_party_licenses ;    fi
#19 DONE 1.0s

#20 [16/16] COPY target/profiler/* /opt/google_cloud_profiler/
#20 DONE 0.1s

#21 exporting to image
#21 exporting layers
#21 exporting layers 0.5s done
#21 writing image sha256:eed28dba12d1435c718f9667014a80fdb3671152b7063e9824b99af31cca1bb4 done
#21 naming to docker.io/apache/beam_java8_sdk:2.51.0.dev done
#21 DONE 0.5s

> Task :runners:spark:3:job-server:validatesPortableRunnerBatch

org.apache.beam.sdk.transforms.CombineTest$WindowingTests > testCombineGloballyAsSingletonView FAILED
    java.lang.RuntimeException at CombineTest.java:1359

org.apache.beam.sdk.transforms.CombineTest$WindowingTests > testSlidingWindowsCombine FAILED
    java.lang.RuntimeException at CombineTest.java:1164

org.apache.beam.sdk.transforms.CombineTest$WindowingTests > testWindowedCombineGloballyAsSingletonView FAILED
    java.lang.RuntimeException at CombineTest.java:1402

org.apache.beam.sdk.transforms.ParDoTest$MultipleInputsAndOutputTests > testParDoEmptyWithTaggedOutput FAILED
    java.lang.RuntimeException at ParDoTest.java:765
[shutdown-hook-0] INFO org.apache.spark.util.ShutdownHookManager - Shutdown hook called
[shutdown-hook-0] INFO org.apache.spark.util.ShutdownHookManager - Deleting directory /tmp/spark-150065c0-2f5a-4f8a-bc27-fd3aca171c2a

org.apache.beam.sdk.transforms.ParDoTest$MultipleInputsAndOutputTests > testParDoWithTaggedOutput FAILED
    java.lang.RuntimeException at ParDoTest.java:723

org.apache.beam.sdk.transforms.ParDoTest$MultipleInputsAndOutputTests > testMultiOutputParDoWithSideInputsIsCumulative FAILED
    java.lang.RuntimeException at ParDoTest.java:1289

org.apache.beam.sdk.transforms.ParDoTest$MultipleInputsAndOutputTests > testSideInputAnnotationWithMultipleSideInputs FAILED
    java.lang.RuntimeException at ParDoTest.java:1179

org.apache.beam.sdk.transforms.ParDoTest$MultipleInputsAndOutputTests > testSideInputAnnotation FAILED
    java.lang.RuntimeException at ParDoTest.java:1076

org.apache.beam.sdk.transforms.ParDoTest$MultipleInputsAndOutputTests > testParDoWithEmptyTaggedOutput FAILED
    java.lang.RuntimeException at ParDoTest.java:789

org.apache.beam.sdk.transforms.ParDoTest$StateTests > testBagState FAILED
    java.lang.RuntimeException at ParDoTest.java:2627

org.apache.beam.sdk.transforms.ParDoTest$StateTests > testCombiningState FAILED
    java.lang.RuntimeException at ParDoTest.java:3497

org.apache.beam.sdk.transforms.ParDoTest$StateTests > testValueStateSameId FAILED
    java.lang.RuntimeException at ParDoTest.java:2528

org.apache.beam.sdk.transforms.ParDoTest$StateTests > testValueStateSimple FAILED
    java.lang.RuntimeException at ParDoTest.java:2292

org.apache.beam.sdk.transforms.ParDoTest$StateTests > testValueStateTaggedOutput FAILED
    java.lang.RuntimeException at ParDoTest.java:2579

org.apache.beam.sdk.transforms.ParDoTest$StateTests > testBagStateSideInput FAILED
    java.lang.RuntimeException at ParDoTest.java:3583

org.apache.beam.sdk.transforms.ParDoTest$StateTests > testCombiningStateParameterSuperclass FAILED
    java.lang.RuntimeException at ParDoTest.java:3533

org.apache.beam.sdk.transforms.ParDoTest$StateTests > testCoderInferenceOfList FAILED
    java.lang.RuntimeException at ParDoTest.java:2429

org.apache.beam.sdk.transforms.ParDoTest$StateTests > testValueStateDedup FAILED
    java.lang.RuntimeException at ParDoTest.java:2342

org.apache.beam.sdk.transforms.ParDoTest$StateTests > testValueStateFixedWindows FAILED
    java.lang.RuntimeException at ParDoTest.java:2473

org.apache.beam.sdk.transforms.ParDoTest$TimestampTests > testParDoTaggedOutputWithTimestamp FAILED
    java.lang.RuntimeException at ParDoTest.java:2030
[shutdown-hook-0] INFO org.apache.spark.util.ShutdownHookManager - Shutdown hook called
[shutdown-hook-0] INFO org.apache.spark.util.ShutdownHookManager - Deleting directory /tmp/spark-51453a7e-a4af-4dfb-bb8c-de5fc2d43ed7

org.apache.beam.sdk.transforms.ParDoTest$TimestampTests > testParDoShiftTimestampUnlimited FAILED
    java.lang.RuntimeException at ParDoTest.java:2142
[shutdown-hook-0] INFO org.apache.spark.util.ShutdownHookManager - Shutdown hook called
[shutdown-hook-0] INFO org.apache.spark.util.ShutdownHookManager - Deleting directory /tmp/spark-fa3adf7d-9da2-4b27-a6f8-dafd27b02697
[shutdown-hook-0] INFO org.apache.spark.util.ShutdownHookManager - Shutdown hook called
[shutdown-hook-0] INFO org.apache.spark.util.ShutdownHookManager - Deleting directory /tmp/spark-866f4d63-ee6f-420b-8e25-d6f5337ed5f7
[pool-786-thread-2] WARN org.apache.beam.fn.harness.control.ExecutionStateSampler - Operation ongoing in bundle 1 for at least 01h24m35s without outputting or completing:
  at sun.misc.Unsafe.park(Native Method)
  at java.util.concurrent.locks.LockSupport.park(LockSupport.java:175)
  at java.util.concurrent.locks.AbstractQueuedSynchronizer$ConditionObject.await(AbstractQueuedSynchronizer.java:2039)
  at org.apache.beam.sdk.fn.CancellableQueue.take(CancellableQueue.java:95)
  at org.apache.beam.sdk.fn.data.BeamFnDataInboundObserver.awaitCompletion(BeamFnDataInboundObserver.java:122)
  at org.apache.beam.fn.harness.control.ProcessBundleHandler.processBundle(ProcessBundleHandler.java:550)
  at org.apache.beam.fn.harness.FnHarness$$Lambda$1537/2029604552.apply(Unknown Source)
  at org.apache.beam.fn.harness.control.BeamFnControlClient.delegateOnInstructionRequestType(BeamFnControlClient.java:150)
  at org.apache.beam.fn.harness.control.BeamFnControlClient$InboundObserver.lambda$onNext$0(BeamFnControlClient.java:115)
  at org.apache.beam.fn.harness.control.BeamFnControlClient$InboundObserver$$Lambda$1561/1042746376.run(Unknown Source)
  at java.util.concurrent.Executors$RunnableAdapter.call(Executors.java:511)
  at java.util.concurrent.FutureTask.run(FutureTask.java:266)
  at org.apache.beam.sdk.util.UnboundedScheduledExecutorService$ScheduledFutureTask.run(UnboundedScheduledExecutorService.java:163)
  at java.util.concurrent.ThreadPoolExecutor.runWorker(ThreadPoolExecutor.java:1149)
  at java.util.concurrent.ThreadPoolExecutor$Worker.run(ThreadPoolExecutor.java:624)
  at java.lang.Thread.run(Thread.java:750)
[pool-1029-thread-2] WARN org.apache.beam.fn.harness.control.ExecutionStateSampler - Operation ongoing in bundle 6 for at least 01h18m38s without outputting or completing:
  at sun.misc.Unsafe.park(Native Method)
  at java.util.concurrent.locks.LockSupport.park(LockSupport.java:175)
  at java.util.concurrent.locks.AbstractQueuedSynchronizer$ConditionObject.await(AbstractQueuedSynchronizer.java:2039)
  at org.apache.beam.sdk.fn.CancellableQueue.take(CancellableQueue.java:95)
  at org.apache.beam.sdk.fn.data.BeamFnDataInboundObserver.awaitCompletion(BeamFnDataInboundObserver.java:122)
  at org.apache.beam.fn.harness.control.ProcessBundleHandler.processBundle(ProcessBundleHandler.java:550)
  at org.apache.beam.fn.harness.FnHarness$$Lambda$1537/2029604552.apply(Unknown Source)
  at org.apache.beam.fn.harness.control.BeamFnControlClient.delegateOnInstructionRequestType(BeamFnControlClient.java:150)
  at org.apache.beam.fn.harness.control.BeamFnControlClient$InboundObserver.lambda$onNext$0(BeamFnControlClient.java:115)
  at org.apache.beam.fn.harness.control.BeamFnControlClient$InboundObserver$$Lambda$1561/1042746376.run(Unknown Source)
  at java.util.concurrent.Executors$RunnableAdapter.call(Executors.java:511)
  at java.util.concurrent.FutureTask.run(FutureTask.java:266)
  at org.apache.beam.sdk.util.UnboundedScheduledExecutorService$ScheduledFutureTask.run(UnboundedScheduledExecutorService.java:163)
  at java.util.concurrent.ThreadPoolExecutor.runWorker(ThreadPoolExecutor.java:1149)
  at java.util.concurrent.ThreadPoolExecutor$Worker.run(ThreadPoolExecutor.java:624)
  at java.lang.Thread.run(Thread.java:750)
[pool-975-thread-2] WARN org.apache.beam.fn.harness.control.ExecutionStateSampler - Operation ongoing in bundle 5 for at least 01h20m08s without outputting or completing:
  at sun.misc.Unsafe.park(Native Method)
  at java.util.concurrent.locks.LockSupport.park(LockSupport.java:175)
  at java.util.concurrent.locks.AbstractQueuedSynchronizer$ConditionObject.await(AbstractQueuedSynchronizer.java:2039)
  at org.apache.beam.sdk.fn.CancellableQueue.take(CancellableQueue.java:95)
  at org.apache.beam.sdk.fn.data.BeamFnDataInboundObserver.awaitCompletion(BeamFnDataInboundObserver.java:122)
  at org.apache.beam.fn.harness.control.ProcessBundleHandler.processBundle(ProcessBundleHandler.java:550)
  at org.apache.beam.fn.harness.FnHarness$$Lambda$1537/2029604552.apply(Unknown Source)
  at org.apache.beam.fn.harness.control.BeamFnControlClient.delegateOnInstructionRequestType(BeamFnControlClient.java:150)
  at org.apache.beam.fn.harness.control.BeamFnControlClient$InboundObserver.lambda$onNext$0(BeamFnControlClient.java:115)
  at org.apache.beam.fn.harness.control.BeamFnControlClient$InboundObserver$$Lambda$1561/1042746376.run(Unknown Source)
  at java.util.concurrent.Executors$RunnableAdapter.call(Executors.java:511)
  at java.util.concurrent.FutureTask.run(FutureTask.java:266)
  at org.apache.beam.sdk.util.UnboundedScheduledExecutorService$ScheduledFutureTask.run(UnboundedScheduledExecutorService.java:163)
  at java.util.concurrent.ThreadPoolExecutor.runWorker(ThreadPoolExecutor.java:1149)
  at java.util.concurrent.ThreadPoolExecutor$Worker.run(ThreadPoolExecutor.java:624)
  at java.lang.Thread.run(Thread.java:750)
[pool-894-thread-2] WARN org.apache.beam.fn.harness.control.ExecutionStateSampler - Operation ongoing in bundle 4 for at least 01h22m11s without outputting or completing:
  at sun.misc.Unsafe.park(Native Method)
  at java.util.concurrent.locks.LockSupport.park(LockSupport.java:175)
  at java.util.concurrent.locks.AbstractQueuedSynchronizer$ConditionObject.await(AbstractQueuedSynchronizer.java:2039)
  at org.apache.beam.sdk.fn.CancellableQueue.take(CancellableQueue.java:95)
  at org.apache.beam.sdk.fn.data.BeamFnDataInboundObserver.awaitCompletion(BeamFnDataInboundObserver.java:122)
  at org.apache.beam.fn.harness.control.ProcessBundleHandler.processBundle(ProcessBundleHandler.java:550)
  at org.apache.beam.fn.harness.FnHarness$$Lambda$1537/2029604552.apply(Unknown Source)
  at org.apache.beam.fn.harness.control.BeamFnControlClient.delegateOnInstructionRequestType(BeamFnControlClient.java:150)
  at org.apache.beam.fn.harness.control.BeamFnControlClient$InboundObserver.lambda$onNext$0(BeamFnControlClient.java:115)
  at org.apache.beam.fn.harness.control.BeamFnControlClient$InboundObserver$$Lambda$1561/1042746376.run(Unknown Source)
  at java.util.concurrent.Executors$RunnableAdapter.call(Executors.java:511)
  at java.util.concurrent.FutureTask.run(FutureTask.java:266)
  at org.apache.beam.sdk.util.UnboundedScheduledExecutorService$ScheduledFutureTask.run(UnboundedScheduledExecutorService.java:163)
  at java.util.concurrent.ThreadPoolExecutor.runWorker(ThreadPoolExecutor.java:1149)
  at java.util.concurrent.ThreadPoolExecutor$Worker.run(ThreadPoolExecutor.java:624)
  at java.lang.Thread.run(Thread.java:750)
[pool-786-thread-2] WARN org.apache.beam.fn.harness.control.ExecutionStateSampler - Operation ongoing in bundle 1 for at least 01h24m36s without outputting or completing:
  at sun.misc.Unsafe.park(Native Method)
  at java.util.concurrent.locks.LockSupport.park(LockSupport.java:175)
  at java.util.concurrent.locks.AbstractQueuedSynchronizer$ConditionObject.await(AbstractQueuedSynchronizer.java:2039)
  at org.apache.beam.sdk.fn.CancellableQueue.take(CancellableQueue.java:95)
  at org.apache.beam.sdk.fn.data.BeamFnDataInboundObserver.awaitCompletion(BeamFnDataInboundObserver.java:122)
  at org.apache.beam.fn.harness.control.ProcessBundleHandler.processBundle(ProcessBundleHandler.java:550)
  at org.apache.beam.fn.harness.FnHarness$$Lambda$1537/2029604552.apply(Unknown Source)
  at org.apache.beam.fn.harness.control.BeamFnControlClient.delegateOnInstructionRequestType(BeamFnControlClient.java:150)
  at org.apache.beam.fn.harness.control.BeamFnControlClient$InboundObserver.lambda$onNext$0(BeamFnControlClient.java:115)
  at org.apache.beam.fn.harness.control.BeamFnControlClient$InboundObserver$$Lambda$1561/1042746376.run(Unknown Source)
  at java.util.concurrent.Executors$RunnableAdapter.call(Executors.java:511)
  at java.util.concurrent.FutureTask.run(FutureTask.java:266)
  at org.apache.beam.sdk.util.UnboundedScheduledExecutorService$ScheduledFutureTask.run(UnboundedScheduledExecutorService.java:163)
  at java.util.concurrent.ThreadPoolExecutor.runWorker(ThreadPoolExecutor.java:1149)
  at java.util.concurrent.ThreadPoolExecutor$Worker.run(ThreadPoolExecutor.java:624)
  at java.lang.Thread.run(Thread.java:750)
[pool-1029-thread-2] WARN org.apache.beam.fn.harness.control.ExecutionStateSampler - Operation ongoing in bundle 6 for at least 01h18m38s without outputting or completing:
  at sun.misc.Unsafe.park(Native Method)
  at java.util.concurrent.locks.LockSupport.park(LockSupport.java:175)
  at java.util.concurrent.locks.AbstractQueuedSynchronizer$ConditionObject.await(AbstractQueuedSynchronizer.java:2039)
  at org.apache.beam.sdk.fn.CancellableQueue.take(CancellableQueue.java:95)
  at org.apache.beam.sdk.fn.data.BeamFnDataInboundObserver.awaitCompletion(BeamFnDataInboundObserver.java:122)
  at org.apache.beam.fn.harness.control.ProcessBundleHandler.processBundle(ProcessBundleHandler.java:550)
  at org.apache.beam.fn.harness.FnHarness$$Lambda$1537/2029604552.apply(Unknown Source)
  at org.apache.beam.fn.harness.control.BeamFnControlClient.delegateOnInstructionRequestType(BeamFnControlClient.java:150)
  at org.apache.beam.fn.harness.control.BeamFnControlClient$InboundObserver.lambda$onNext$0(BeamFnControlClient.java:115)
  at org.apache.beam.fn.harness.control.BeamFnControlClient$InboundObserver$$Lambda$1561/1042746376.run(Unknown Source)
  at java.util.concurrent.Executors$RunnableAdapter.call(Executors.java:511)
  at java.util.concurrent.FutureTask.run(FutureTask.java:266)
  at org.apache.beam.sdk.util.UnboundedScheduledExecutorService$ScheduledFutureTask.run(UnboundedScheduledExecutorService.java:163)
  at java.util.concurrent.ThreadPoolExecutor.runWorker(ThreadPoolExecutor.java:1149)
  at java.util.concurrent.ThreadPoolExecutor$Worker.run(ThreadPoolExecutor.java:624)
  at java.lang.Thread.run(Thread.java:750)
[pool-975-thread-2] WARN org.apache.beam.fn.harness.control.ExecutionStateSampler - Operation ongoing in bundle 5 for at least 01h20m08s without outputting or completing:
  at sun.misc.Unsafe.park(Native Method)
  at java.util.concurrent.locks.LockSupport.park(LockSupport.java:175)
  at java.util.concurrent.locks.AbstractQueuedSynchronizer$ConditionObject.await(AbstractQueuedSynchronizer.java:2039)
  at org.apache.beam.sdk.fn.CancellableQueue.take(CancellableQueue.java:95)
  at org.apache.beam.sdk.fn.data.BeamFnDataInboundObserver.awaitCompletion(BeamFnDataInboundObserver.java:122)
  at org.apache.beam.fn.harness.control.ProcessBundleHandler.processBundle(ProcessBundleHandler.java:550)
  at org.apache.beam.fn.harness.FnHarness$$Lambda$1537/2029604552.apply(Unknown Source)
  at org.apache.beam.fn.harness.control.BeamFnControlClient.delegateOnInstructionRequestType(BeamFnControlClient.java:150)
  at org.apache.beam.fn.harness.control.BeamFnControlClient$InboundObserver.lambda$onNext$0(BeamFnControlClient.java:115)
  at org.apache.beam.fn.harness.control.BeamFnControlClient$InboundObserver$$Lambda$1561/1042746376.run(Unknown Source)
  at java.util.concurrent.Executors$RunnableAdapter.call(Executors.java:511)
  at java.util.concurrent.FutureTask.run(FutureTask.java:266)
  at org.apache.beam.sdk.util.UnboundedScheduledExecutorService$ScheduledFutureTask.run(UnboundedScheduledExecutorService.java:163)
  at java.util.concurrent.ThreadPoolExecutor.runWorker(ThreadPoolExecutor.java:1149)
  at java.util.concurrent.ThreadPoolExecutor$Worker.run(ThreadPoolExecutor.java:624)
  at java.lang.Thread.run(Thread.java:750)

234 tests completed, 21 failed, 1 skipped

> Task :runners:spark:3:job-server:validatesPortableRunnerBatch FAILED
> Task :runners:spark:3:job-server:validatesPortableRunnerDocker
[shutdown-hook-0] INFO org.apache.spark.util.ShutdownHookManager - Shutdown hook called
[shutdown-hook-0] INFO org.apache.spark.util.ShutdownHookManager - Deleting directory /tmp/spark-914631b4-b17b-4395-bbb2-b2018825a685

FAILURE: Build failed with an exception.

* What went wrong:
Execution failed for task ':runners:spark:3:job-server:validatesPortableRunnerBatch'.
> There were failing tests. See the report at: file://<https://ci-beam.apache.org/job/beam_PostCommit_Java_PVR_Spark_Batch/ws/src/runners/spark/3/job-server/build/reports/tests/validatesPortableRunnerBatch/index.html>

* Try:
> Run with --stacktrace option to get the stack trace.
> Run with --info or --debug option to get more log output.

* Get more help at https://help.gradle.org

Deprecated Gradle features were used in this build, making it incompatible with Gradle 8.0.

You can use '--warning-mode all' to show the individual deprecation warnings and determine if they come from your own scripts or plugins.

See https://docs.gradle.org/7.6.2/userguide/command_line_interface.html#sec:command_line_warnings

Execution optimizations have been disabled for 1 invalid unit(s) of work during this build to ensure correctness.
Please consult deprecation warnings for more details.

BUILD FAILED in 1h 41m 13s
118 actionable tasks: 73 executed, 41 from cache, 4 up-to-date

Publishing build scan...
https://ge.apache.org/s/r5u6jas76ds2g

Build step 'Invoke Gradle script' changed build result to FAILURE
Build step 'Invoke Gradle script' marked build as failure

---------------------------------------------------------------------
To unsubscribe, e-mail: builds-unsubscribe@beam.apache.org
For additional commands, e-mail: builds-help@beam.apache.org


Jenkins build is back to normal : beam_PostCommit_Java_PVR_Spark_Batch #2409

Posted by Apache Jenkins Server <je...@builds.apache.org>.
See <https://ci-beam.apache.org/job/beam_PostCommit_Java_PVR_Spark_Batch/2409/display/redirect>


---------------------------------------------------------------------
To unsubscribe, e-mail: builds-unsubscribe@beam.apache.org
For additional commands, e-mail: builds-help@beam.apache.org