You are viewing a plain text version of this content. The canonical link for it is here.
Posted to builds@beam.apache.org by Apache Jenkins Server <je...@builds.apache.org> on 2018/11/14 19:36:58 UTC
Build failed in Jenkins: beam_PostCommit_Py_VR_Dataflow #1727
See <https://builds.apache.org/job/beam_PostCommit_Py_VR_Dataflow/1727/display/redirect?page=changes>
Changes:
[mxm] ParDoTest: Check expected errors inline instead of after pipeline
[mxm] Add output collection id to timer specs.
[mxm] Move doFn wrapper initialization to open()
[mxm] [BEAM-6009] Add note about default mode for PortableValidatesRunner
[mxm] [BEAM-4681] Add support for portable timers in Flink streaming mode
------------------------------------------
[...truncated 270.83 KB...]
test_flattened_side_input (apache_beam.transforms.sideinputs_test.SideInputsTest) ... ok
test_default_value_singleton_side_input (apache_beam.transforms.sideinputs_test.SideInputsTest) ... ok
test_multi_valued_singleton_side_input (apache_beam.transforms.sideinputs_test.SideInputsTest) ... ok
test_empty_singleton_side_input (apache_beam.transforms.sideinputs_test.SideInputsTest) ... ok
test_iterable_side_input (apache_beam.transforms.sideinputs_test.SideInputsTest) ... ok
----------------------------------------------------------------------
XML: <https://builds.apache.org/job/beam_PostCommit_Py_VR_Dataflow/ws/src/sdks/python/nosetests.xml>
----------------------------------------------------------------------
Ran 16 tests in 863.502s
OK
Found: https://console.cloud.google.com/dataflow/jobsDetail/locations/us-central1/jobs/2018-11-14_11_07_47-7067831804315221390?project=apache-beam-testing.
Found: https://console.cloud.google.com/dataflow/jobsDetail/locations/us-central1/jobs/2018-11-14_11_15_24-13141169015901902169?project=apache-beam-testing.
Found: https://console.cloud.google.com/dataflow/jobsDetail/locations/us-central1/jobs/2018-11-14_11_07_48-13452410540378718354?project=apache-beam-testing.
Found: https://console.cloud.google.com/dataflow/jobsDetail/locations/us-central1/jobs/2018-11-14_11_15_33-3129819376384485788?project=apache-beam-testing.
Found: https://console.cloud.google.com/dataflow/jobsDetail/locations/us-central1/jobs/2018-11-14_11_07_47-8716024428775838849?project=apache-beam-testing.
Found: https://console.cloud.google.com/dataflow/jobsDetail/locations/us-central1/jobs/2018-11-14_11_15_09-10846657339180189578?project=apache-beam-testing.
Found: https://console.cloud.google.com/dataflow/jobsDetail/locations/us-central1/jobs/2018-11-14_11_07_47-8904791275372151865?project=apache-beam-testing.
Found: https://console.cloud.google.com/dataflow/jobsDetail/locations/us-central1/jobs/2018-11-14_11_14_33-5545488340526491160?project=apache-beam-testing.
Found: https://console.cloud.google.com/dataflow/jobsDetail/locations/us-central1/jobs/2018-11-14_11_07_47-17248077356663773418?project=apache-beam-testing.
Found: https://console.cloud.google.com/dataflow/jobsDetail/locations/us-central1/jobs/2018-11-14_11_15_23-10434672553127907534?project=apache-beam-testing.
Found: https://console.cloud.google.com/dataflow/jobsDetail/locations/us-central1/jobs/2018-11-14_11_07_46-13293056256080094186?project=apache-beam-testing.
Found: https://console.cloud.google.com/dataflow/jobsDetail/locations/us-central1/jobs/2018-11-14_11_14_37-4861484282419668485?project=apache-beam-testing.
Found: https://console.cloud.google.com/dataflow/jobsDetail/locations/us-central1/jobs/2018-11-14_11_07_48-12155845279559484900?project=apache-beam-testing.
Found: https://console.cloud.google.com/dataflow/jobsDetail/locations/us-central1/jobs/2018-11-14_11_14_19-15846458283358409762?project=apache-beam-testing.
Found: https://console.cloud.google.com/dataflow/jobsDetail/locations/us-central1/jobs/2018-11-14_11_07_47-15081770956286081622?project=apache-beam-testing.
Found: https://console.cloud.google.com/dataflow/jobsDetail/locations/us-central1/jobs/2018-11-14_11_14_48-6609592423592496688?project=apache-beam-testing.
:beam-sdks-python:validatesRunnerBatchTests (Thread[Task worker for ':',5,main]) completed. Took 14 mins 24.454 secs.
:beam-sdks-python:validatesRunnerStreamingTests (Thread[Task worker for ':',5,main]) started.
> Task :beam-sdks-python:validatesRunnerStreamingTests
Caching disabled for task ':beam-sdks-python:validatesRunnerStreamingTests': Caching has not been enabled for the task
Task ':beam-sdks-python:validatesRunnerStreamingTests' is not up-to-date because:
Task has not declared any outputs despite executing actions.
Starting process 'command 'sh''. Working directory: <https://builds.apache.org/job/beam_PostCommit_Py_VR_Dataflow/ws/src/sdks/python> Command: sh -c . <https://builds.apache.org/job/beam_PostCommit_Py_VR_Dataflow/ws/src/sdks/python/build/gradleenv/bin/activate> && ./scripts/run_integration_test.sh --test_opts "--nocapture --processes=8 --process-timeout=4500 --attr=ValidatesRunner,!sickbay-streaming" --streaming true --worker_jar <https://builds.apache.org/job/beam_PostCommit_Py_VR_Dataflow/ws/src/runners/google-cloud-dataflow-java/worker/build/libs/beam-runners-google-cloud-dataflow-java-fn-api-worker-2.9.0-SNAPSHOT.jar>
Successfully started process 'command 'sh''
###########################################################################
# Build pipeline options if not provided in --pipeline_opts from commandline
if [[ -z $PIPELINE_OPTS ]]; then
# Check that the script is running in a known directory.
if [[ $PWD != *sdks/python* ]]; then
echo 'Unable to locate Apache Beam Python SDK root directory'
exit 1
fi
# Go to the Apache Beam Python SDK root
if [[ "*sdks/python" != $PWD ]]; then
cd $(pwd | sed 's/sdks\/python.*/sdks\/python/')
fi
# Create a tarball if not exists
if [[ $(find ${SDK_LOCATION}) ]]; then
SDK_LOCATION=$(find ${SDK_LOCATION})
else
python setup.py -q sdist
SDK_LOCATION=$(find dist/apache-beam-*.tar.gz)
fi
# Install test dependencies for ValidatesRunner tests.
echo "pyhamcrest" > postcommit_requirements.txt
echo "mock" >> postcommit_requirements.txt
# Options used to run testing pipeline on Cloud Dataflow Service. Also used for
# running on DirectRunner (some options ignored).
opts=(
"--runner=$RUNNER"
"--project=$PROJECT"
"--staging_location=$GCS_LOCATION/staging-it"
"--temp_location=$GCS_LOCATION/temp-it"
"--output=$GCS_LOCATION/py-it-cloud/output"
"--sdk_location=$SDK_LOCATION"
"--requirements_file=postcommit_requirements.txt"
"--num_workers=$NUM_WORKERS"
"--sleep_secs=$SLEEP_SECS"
)
# Add --streaming if provided
if [[ "$STREAMING" = true ]]; then
opts+=("--streaming")
fi
# Add --dataflow_worker_jar if provided
if [[ ! -z "$WORKER_JAR" ]]; then
opts+=("--dataflow_worker_jar=$WORKER_JAR")
fi
PIPELINE_OPTS=$(IFS=" " ; echo "${opts[*]}")
fi
pwd | sed 's/sdks\/python.*/sdks\/python/'
find ${SDK_LOCATION}
find ${SDK_LOCATION}
IFS=" " ; echo "${opts[*]}"
###########################################################################
# Run tests and validate that jobs finish successfully.
echo ">>> RUNNING integration tests with pipeline options: $PIPELINE_OPTS"
python setup.py nosetests \
>>> RUNNING integration tests with pipeline options: --runner=TestDataflowRunner --project=apache-beam-testing --staging_location=gs://temp-storage-for-end-to-end-tests/staging-it --temp_location=gs://temp-storage-for-end-to-end-tests/temp-it --output=gs://temp-storage-for-end-to-end-tests/py-it-cloud/output --sdk_location=build/apache-beam.tar.gz --requirements_file=postcommit_requirements.txt --num_workers=1 --sleep_secs=20 --streaming --dataflow_worker_jar=<https://builds.apache.org/job/beam_PostCommit_Py_VR_Dataflow/ws/src/runners/google-cloud-dataflow-java/worker/build/libs/beam-runners-google-cloud-dataflow-java-fn-api-worker-2.9.0-SNAPSHOT.jar>
--test-pipeline-options="$PIPELINE_OPTS" \
$TEST_OPTS
<https://builds.apache.org/job/beam_PostCommit_Py_VR_Dataflow/ws/src/sdks/python/build/gradleenv/local/lib/python2.7/site-packages/setuptools/dist.py>:470: UserWarning: Normalizing '2.9.0.dev' to '2.9.0.dev0'
normalized_version,
running nosetests
running egg_info
writing requirements to apache_beam.egg-info/requires.txt
writing apache_beam.egg-info/PKG-INFO
writing top-level names to apache_beam.egg-info/top_level.txt
writing dependency_links to apache_beam.egg-info/dependency_links.txt
writing entry points to apache_beam.egg-info/entry_points.txt
reading manifest file 'apache_beam.egg-info/SOURCES.txt'
reading manifest template 'MANIFEST.in'
warning: no files found matching 'README.md'
warning: no files found matching 'NOTICE'
warning: no files found matching 'LICENSE'
writing manifest file 'apache_beam.egg-info/SOURCES.txt'
<https://builds.apache.org/job/beam_PostCommit_Py_VR_Dataflow/ws/src/sdks/python/apache_beam/runners/dataflow/dataflow_runner.py>:800: BeamDeprecationWarning: options is deprecated since First stable release. References to <pipeline>.options will not be supported
options = pbegin.pipeline.options.view_as(DebugOptions)
<https://builds.apache.org/job/beam_PostCommit_Py_VR_Dataflow/ws/src/sdks/python/apache_beam/runners/dataflow/dataflow_runner.py>:800: BeamDeprecationWarning: options is deprecated since First stable release. References to <pipeline>.options will not be supported
options = pbegin.pipeline.options.view_as(DebugOptions)
<https://builds.apache.org/job/beam_PostCommit_Py_VR_Dataflow/ws/src/sdks/python/apache_beam/runners/dataflow/dataflow_runner.py>:800: BeamDeprecationWarning: options is deprecated since First stable release. References to <pipeline>.options will not be supported
options = pbegin.pipeline.options.view_as(DebugOptions)
<https://builds.apache.org/job/beam_PostCommit_Py_VR_Dataflow/ws/src/sdks/python/apache_beam/runners/dataflow/dataflow_runner.py>:800: BeamDeprecationWarning: options is deprecated since First stable release. References to <pipeline>.options will not be supported
options = pbegin.pipeline.options.view_as(DebugOptions)
<https://builds.apache.org/job/beam_PostCommit_Py_VR_Dataflow/ws/src/sdks/python/apache_beam/runners/dataflow/dataflow_runner.py>:800: BeamDeprecationWarning: options is deprecated since First stable release. References to <pipeline>.options will not be supported
options = pbegin.pipeline.options.view_as(DebugOptions)
<https://builds.apache.org/job/beam_PostCommit_Py_VR_Dataflow/ws/src/sdks/python/apache_beam/runners/dataflow/dataflow_runner.py>:800: BeamDeprecationWarning: options is deprecated since First stable release. References to <pipeline>.options will not be supported
options = pbegin.pipeline.options.view_as(DebugOptions)
<https://builds.apache.org/job/beam_PostCommit_Py_VR_Dataflow/ws/src/sdks/python/apache_beam/runners/dataflow/dataflow_runner.py>:800: BeamDeprecationWarning: options is deprecated since First stable release. References to <pipeline>.options will not be supported
options = pbegin.pipeline.options.view_as(DebugOptions)
<https://builds.apache.org/job/beam_PostCommit_Py_VR_Dataflow/ws/src/sdks/python/apache_beam/runners/dataflow/dataflow_runner.py>:800: BeamDeprecationWarning: options is deprecated since First stable release. References to <pipeline>.options will not be supported
options = pbegin.pipeline.options.view_as(DebugOptions)
Could not find a version that satisfies the requirement setuptools (from pyhamcrest->-r postcommit_requirements.txt (line 1)) (from versions: )
No matching distribution found for setuptools (from pyhamcrest->-r postcommit_requirements.txt (line 1))
test_par_do_with_multiple_outputs_and_using_return (apache_beam.transforms.ptransform_test.PTransformTest) ... ERROR
test_as_dict_twice (apache_beam.transforms.sideinputs_test.SideInputsTest) ... ok
test_as_list_and_as_dict_side_inputs (apache_beam.transforms.sideinputs_test.SideInputsTest) ... ok
test_par_do_with_multiple_outputs_and_using_yield (apache_beam.transforms.ptransform_test.PTransformTest) ... ok
test_multiple_empty_outputs (apache_beam.transforms.ptransform_test.PTransformTest) ... ok
test_as_singleton_with_different_defaults (apache_beam.transforms.sideinputs_test.SideInputsTest) ... ok
test_undeclared_outputs (apache_beam.transforms.ptransform_test.PTransformTest) ... ok
test_flatten_multiple_pcollections_having_multiple_consumers (apache_beam.transforms.ptransform_test.PTransformTest) ... ok
test_as_list_twice (apache_beam.transforms.sideinputs_test.SideInputsTest) ... ok
test_as_singleton_without_unique_labels (apache_beam.transforms.sideinputs_test.SideInputsTest) ... ok
test_empty_singleton_side_input (apache_beam.transforms.sideinputs_test.SideInputsTest) ... ok
test_default_value_singleton_side_input (apache_beam.transforms.sideinputs_test.SideInputsTest) ... ok
test_flattened_side_input (apache_beam.transforms.sideinputs_test.SideInputsTest) ... ok
test_iterable_side_input (apache_beam.transforms.sideinputs_test.SideInputsTest) ... ok
======================================================================
ERROR: test_par_do_with_multiple_outputs_and_using_return (apache_beam.transforms.ptransform_test.PTransformTest)
----------------------------------------------------------------------
Traceback (most recent call last):
File "<https://builds.apache.org/job/beam_PostCommit_Py_VR_Dataflow/ws/src/sdks/python/apache_beam/transforms/ptransform_test.py",> line 257, in test_par_do_with_multiple_outputs_and_using_return
pipeline.run()
File "<https://builds.apache.org/job/beam_PostCommit_Py_VR_Dataflow/ws/src/sdks/python/apache_beam/testing/test_pipeline.py",> line 107, in run
else test_runner_api))
File "<https://builds.apache.org/job/beam_PostCommit_Py_VR_Dataflow/ws/src/sdks/python/apache_beam/pipeline.py",> line 405, in run
self._options).run(False)
File "<https://builds.apache.org/job/beam_PostCommit_Py_VR_Dataflow/ws/src/sdks/python/apache_beam/pipeline.py",> line 418, in run
return self.runner.run_pipeline(self)
File "<https://builds.apache.org/job/beam_PostCommit_Py_VR_Dataflow/ws/src/sdks/python/apache_beam/runners/dataflow/test_dataflow_runner.py",> line 52, in run_pipeline
self.result = super(TestDataflowRunner, self).run_pipeline(pipeline)
File "<https://builds.apache.org/job/beam_PostCommit_Py_VR_Dataflow/ws/src/sdks/python/apache_beam/runners/dataflow/dataflow_runner.py",> line 394, in run_pipeline
self.dataflow_client.create_job(self.job), self)
File "<https://builds.apache.org/job/beam_PostCommit_Py_VR_Dataflow/ws/src/sdks/python/apache_beam/utils/retry.py",> line 184, in wrapper
return fun(*args, **kwargs)
File "<https://builds.apache.org/job/beam_PostCommit_Py_VR_Dataflow/ws/src/sdks/python/apache_beam/runners/dataflow/internal/apiclient.py",> line 499, in create_job
self.create_job_description(job)
File "<https://builds.apache.org/job/beam_PostCommit_Py_VR_Dataflow/ws/src/sdks/python/apache_beam/runners/dataflow/internal/apiclient.py",> line 528, in create_job_description
resources = self._stage_resources(job.options)
File "<https://builds.apache.org/job/beam_PostCommit_Py_VR_Dataflow/ws/src/sdks/python/apache_beam/runners/dataflow/internal/apiclient.py",> line 461, in _stage_resources
staging_location=google_cloud_options.staging_location)
File "<https://builds.apache.org/job/beam_PostCommit_Py_VR_Dataflow/ws/src/sdks/python/apache_beam/runners/portability/stager.py",> line 161, in stage_job_resources
requirements_cache_path)
File "<https://builds.apache.org/job/beam_PostCommit_Py_VR_Dataflow/ws/src/sdks/python/apache_beam/runners/portability/stager.py",> line 419, in _populate_requirements_cache
processes.check_output(cmd_args)
File "<https://builds.apache.org/job/beam_PostCommit_Py_VR_Dataflow/ws/src/sdks/python/apache_beam/utils/processes.py",> line 52, in check_output
return subprocess.check_output(*args, **kwargs)
File "/usr/lib/python2.7/subprocess.py", line 574, in check_output
raise CalledProcessError(retcode, cmd, output=output)
CalledProcessError: Command '['<https://builds.apache.org/job/beam_PostCommit_Py_VR_Dataflow/ws/src/sdks/python/build/gradleenv/bin/python',> '-m', 'pip', 'download', '--dest', '/tmp/dataflow-requirements-cache', '-r', 'postcommit_requirements.txt', '--exists-action', 'i', '--no-binary', ':all:']' returned non-zero exit status 1
-------------------- >> begin captured logging << --------------------
root: DEBUG: Connecting using Google Application Default Credentials.
root: INFO: Starting GCS upload to gs://temp-storage-for-end-to-end-tests/staging-it/beamapp-jenkins-1114192158-334287.1542223318.334514/pipeline.pb...
oauth2client.transport: INFO: Attempting refresh to obtain initial access_token
oauth2client.transport: INFO: Attempting refresh to obtain initial access_token
root: INFO: Completed GCS upload to gs://temp-storage-for-end-to-end-tests/staging-it/beamapp-jenkins-1114192158-334287.1542223318.334514/pipeline.pb
root: INFO: Starting GCS upload to gs://temp-storage-for-end-to-end-tests/staging-it/beamapp-jenkins-1114192158-334287.1542223318.334514/requirements.txt...
root: INFO: Completed GCS upload to gs://temp-storage-for-end-to-end-tests/staging-it/beamapp-jenkins-1114192158-334287.1542223318.334514/requirements.txt
root: INFO: Executing command: ['<https://builds.apache.org/job/beam_PostCommit_Py_VR_Dataflow/ws/src/sdks/python/build/gradleenv/bin/python',> '-m', 'pip', 'download', '--dest', '/tmp/dataflow-requirements-cache', '-r', 'postcommit_requirements.txt', '--exists-action', 'i', '--no-binary', ':all:']
--------------------- >> end captured logging << ---------------------
----------------------------------------------------------------------
XML: <https://builds.apache.org/job/beam_PostCommit_Py_VR_Dataflow/ws/src/sdks/python/nosetests.xml>
----------------------------------------------------------------------
Ran 14 tests in 899.552s
FAILED (errors=1)
Found: https://console.cloud.google.com/dataflow/jobsDetail/locations/us-central1/jobs/2018-11-14_11_22_14-16153262412358053123?project=apache-beam-testing.
Found: https://console.cloud.google.com/dataflow/jobsDetail/locations/us-central1/jobs/2018-11-14_11_29_34-12703615393742683114?project=apache-beam-testing.
Found: https://console.cloud.google.com/dataflow/jobsDetail/locations/us-central1/jobs/2018-11-14_11_22_13-1790520211192909830?project=apache-beam-testing.
Found: https://console.cloud.google.com/dataflow/jobsDetail/locations/us-central1/jobs/2018-11-14_11_29_33-15791523507440013105?project=apache-beam-testing.
Found: https://console.cloud.google.com/dataflow/jobsDetail/locations/us-central1/jobs/2018-11-14_11_22_12-17192534939772997742?project=apache-beam-testing.
Found: https://console.cloud.google.com/dataflow/jobsDetail/locations/us-central1/jobs/2018-11-14_11_29_23-1754389655159983753?project=apache-beam-testing.
Found: https://console.cloud.google.com/dataflow/jobsDetail/locations/us-central1/jobs/2018-11-14_11_22_12-7087654095848784041?project=apache-beam-testing.
Found: https://console.cloud.google.com/dataflow/jobsDetail/locations/us-central1/jobs/2018-11-14_11_22_13-12097509854947339350?project=apache-beam-testing.
Found: https://console.cloud.google.com/dataflow/jobsDetail/locations/us-central1/jobs/2018-11-14_11_29_28-16024374344854630798?project=apache-beam-testing.
Found: https://console.cloud.google.com/dataflow/jobsDetail/locations/us-central1/jobs/2018-11-14_11_22_13-13195915086234015237?project=apache-beam-testing.
Found: https://console.cloud.google.com/dataflow/jobsDetail/locations/us-central1/jobs/2018-11-14_11_29_19-8787969210421399914?project=apache-beam-testing.
Found: https://console.cloud.google.com/dataflow/jobsDetail/locations/us-central1/jobs/2018-11-14_11_22_12-2712783855929625500?project=apache-beam-testing.
Found: https://console.cloud.google.com/dataflow/jobsDetail/locations/us-central1/jobs/2018-11-14_11_22_13-5305401052724980876?project=apache-beam-testing.
> Task :beam-sdks-python:validatesRunnerStreamingTests FAILED
:beam-sdks-python:validatesRunnerStreamingTests (Thread[Task worker for ':',5,main]) completed. Took 15 mins 0.33 secs.
FAILURE: Build failed with an exception.
* Where:
Build file '<https://builds.apache.org/job/beam_PostCommit_Py_VR_Dataflow/ws/src/sdks/python/build.gradle'> line: 349
* What went wrong:
Execution failed for task ':beam-sdks-python:validatesRunnerStreamingTests'.
> Process 'command 'sh'' finished with non-zero exit value 1
* Try:
Run with --stacktrace option to get the stack trace. Run with --debug option to get more log output. Run with --scan to get full insights.
* Get more help at https://help.gradle.org
Deprecated Gradle features were used in this build, making it incompatible with Gradle 5.0.
Use '--warning-mode all' to show the individual deprecation warnings.
See https://docs.gradle.org/4.10.2/userguide/command_line_interface.html#sec:command_line_warnings
BUILD FAILED in 30m 10s
61 actionable tasks: 61 executed
Publishing build scan...
https://gradle.com/s/mngnqkp43i7ic
Build step 'Invoke Gradle script' changed build result to FAILURE
Build step 'Invoke Gradle script' marked build as failure
---------------------------------------------------------------------
To unsubscribe, e-mail: builds-unsubscribe@beam.apache.org
For additional commands, e-mail: builds-help@beam.apache.org
Jenkins build is back to normal : beam_PostCommit_Py_VR_Dataflow
#1728
Posted by Apache Jenkins Server <je...@builds.apache.org>.
See <https://builds.apache.org/job/beam_PostCommit_Py_VR_Dataflow/1728/display/redirect?page=changes>
---------------------------------------------------------------------
To unsubscribe, e-mail: builds-unsubscribe@beam.apache.org
For additional commands, e-mail: builds-help@beam.apache.org