You are viewing a plain text version of this content. The canonical link for it is here.
Posted to builds@beam.apache.org by Apache Jenkins Server <je...@builds.apache.org> on 2023/04/27 16:49:18 UTC
beam_PostCommit_XVR_JavaUsingPython_Dataflow - Build # 1817 - Aborted!
beam_PostCommit_XVR_JavaUsingPython_Dataflow - Build # 1817 - Aborted:
Check console output at https://ci-beam.apache.org/job/beam_PostCommit_XVR_JavaUsingPython_Dataflow/1817/ to view the results.
Jenkins build is back to normal : beam_PostCommit_XVR_JavaUsingPython_Dataflow #1822
Posted by Apache Jenkins Server <je...@builds.apache.org>.
See <https://ci-beam.apache.org/job/beam_PostCommit_XVR_JavaUsingPython_Dataflow/1822/display/redirect>
---------------------------------------------------------------------
To unsubscribe, e-mail: builds-unsubscribe@beam.apache.org
For additional commands, e-mail: builds-help@beam.apache.org
Build failed in Jenkins: beam_PostCommit_XVR_JavaUsingPython_Dataflow #1821
Posted by Apache Jenkins Server <je...@builds.apache.org>.
See <https://ci-beam.apache.org/job/beam_PostCommit_XVR_JavaUsingPython_Dataflow/1821/display/redirect?page=changes>
Changes:
[noreply] keep retrying mass_comment until it has started all jobs (#26457)
------------------------------------------
[...truncated 592.37 KB...]
#20 [beam 16/16] COPY target/launcher/linux_amd64/boot /opt/apache/beam/
#20 DONE 0.1s
#21 [third_party_licenses 1/4] COPY target/license_scripts /tmp/license_scripts/
#21 DONE 0.1s
#22 [third_party_licenses 2/4] COPY target/go-licenses/* /opt/apache/beam/third_party_licenses/golang/
#22 DONE 0.1s
#23 [third_party_licenses 3/4] COPY target/license_scripts /tmp/license_scripts/
#23 DONE 0.1s
#24 [third_party_licenses 4/4] RUN if [ "true" = "true" ] ; then pip install 'pip-licenses<5' pyyaml tenacity && python /tmp/license_scripts/pull_licenses_py.py ; fi
#24 1.016 Collecting pip-licenses<5
#24 1.095 Downloading pip_licenses-3.5.5-py3-none-any.whl (17 kB)
#24 1.105 Requirement already satisfied: pyyaml in /usr/local/lib/python3.7/site-packages (6.0)
#24 1.105 Requirement already satisfied: tenacity in /usr/local/lib/python3.7/site-packages (8.2.2)
#24 1.148 Collecting PTable (from pip-licenses<5)
#24 1.165 Downloading PTable-0.9.2.tar.gz (31 kB)
#24 1.184 Preparing metadata (setup.py): started
#24 1.547 Preparing metadata (setup.py): finished with status 'done'
#24 1.563 Building wheels for collected packages: PTable
#24 1.564 Building wheel for PTable (setup.py): started
#24 2.106 Building wheel for PTable (setup.py): finished with status 'done'
#24 2.107 Created wheel for PTable: filename=PTable-0.9.2-py3-none-any.whl size=22908 sha256=540e579eca418188d6db9400d503fb59c9f62ce014f0ce53d3915315863bfecb
#24 2.107 Stored in directory: /root/.cache/pip/wheels/33/df/2f/674985b3f8a2de3f96357d1eadef5110f74fa91b3785e52a54
#24 2.112 Successfully built PTable
#24 3.307 Installing collected packages: PTable, pip-licenses
#24 3.382 Successfully installed PTable-0.9.2 pip-licenses-3.5.5
#24 3.383 WARNING: Running pip as the 'root' user can result in broken permissions and conflicting behaviour with the system package manager. It is recommended to use a virtual environment instead: https://pip.pypa.io/warnings/venv
#24 8.347 INFO:root:Successfully pulled licenses for 109 dependencies
#24 8.347 Skip pulling license for bs4
#24 DONE 8.4s
#25 [stage-2 1/2] COPY --from=third_party_licenses /opt/apache/beam/third_party_licenses /opt/apache/beam/third_party_licenses
#25 DONE 0.1s
#26 [stage-2 2/2] RUN if [ "true" != "true" ] ; then rm -rf /opt/apache/beam/third_party_licenses ; fi
#26 DONE 0.3s
#27 exporting to image
#27 exporting layers
#27 exporting layers 10.9s done
#27 writing image sha256:c58a714171c04edd4a8da495026a06ac443134b7b1762205e4527f1d253da6fc done
#27 naming to docker.io/apache/beam_python3.7_sdk:2.48.0.dev done
#27 DONE 10.9s
> Task :runners:google-cloud-dataflow-java:buildAndPushDockerPythonContainer
WARNING: `gcloud docker` will not be supported for Docker client versions above 18.03.
As an alternative, use `gcloud auth configure-docker` to configure `docker` to
use `gcloud` as a credential helper, then use `docker` as you would for non-GCR
registries, e.g. `docker pull gcr.io/project-id/my-image`. Add
`--verbosity=error` to silence this warning: `gcloud docker
--verbosity=error -- pull gcr.io/project-id/my-image`.
See: https://cloud.google.com/container-registry/docs/support/deprecation-notices#gcloud-docker
The push refers to repository [us.gcr.io/apache-beam-testing/java-postcommit-it/python]
cb6be35f5768: Preparing
48a2a39d01e4: Preparing
16e09319dc31: Preparing
9c9ac2afbdf5: Preparing
2985799046b6: Preparing
ecef7ce2b34c: Preparing
5e123b7f5c01: Preparing
18af8462c734: Preparing
4dc8fb91b6bd: Preparing
5b7864a935d5: Preparing
a890e9cce817: Preparing
52ccb3ead2c9: Preparing
5cef342d1551: Preparing
954d43bd9ba9: Preparing
2dcbaff964d6: Preparing
5921d1fd6cc9: Preparing
8b11614c359f: Preparing
063d47f8faa1: Preparing
02a788988127: Preparing
90dd70c2e6bd: Preparing
807e5e673844: Preparing
cfd0811d364e: Preparing
b86f260e173a: Preparing
6a1ebb98b0dc: Preparing
24b48387f467: Preparing
ae56c0c5405b: Preparing
ecef7ce2b34c: Waiting
5e123b7f5c01: Waiting
4dc8fb91b6bd: Waiting
063d47f8faa1: Waiting
5b7864a935d5: Waiting
02a788988127: Waiting
a890e9cce817: Waiting
18af8462c734: Waiting
52ccb3ead2c9: Waiting
5921d1fd6cc9: Waiting
90dd70c2e6bd: Waiting
8b11614c359f: Waiting
807e5e673844: Waiting
5cef342d1551: Waiting
954d43bd9ba9: Waiting
2dcbaff964d6: Waiting
cfd0811d364e: Waiting
24b48387f467: Waiting
ae56c0c5405b: Waiting
b86f260e173a: Waiting
9c9ac2afbdf5: Pushed
2985799046b6: Pushed
48a2a39d01e4: Pushed
cb6be35f5768: Pushed
ecef7ce2b34c: Pushed
18af8462c734: Pushed
5e123b7f5c01: Pushed
16e09319dc31: Pushed
a890e9cce817: Pushed
5b7864a935d5: Pushed
52ccb3ead2c9: Pushed
5921d1fd6cc9: Pushed
954d43bd9ba9: Pushed
8b11614c359f: Pushed
063d47f8faa1: Layer already exists
02a788988127: Layer already exists
807e5e673844: Layer already exists
90dd70c2e6bd: Layer already exists
cfd0811d364e: Layer already exists
b86f260e173a: Layer already exists
6a1ebb98b0dc: Layer already exists
24b48387f467: Layer already exists
ae56c0c5405b: Layer already exists
4dc8fb91b6bd: Pushed
2dcbaff964d6: Pushed
5cef342d1551: Pushed
20230428151956: digest: sha256:7436bbd358e4cb45895d12d3a412f988115054e1c8fe92cdc18631091e745eae size: 5774
> Task :runners:google-cloud-dataflow-java:setupXVR
> Task :runners:google-cloud-dataflow-java:validatesCrossLanguageRunnerSetup
Launching Java expansion service @ 45639
Launching Python expansion service @ 45189
> Task :runners:google-cloud-dataflow-java:validatesCrossLanguageRunnerJavaUsingPython
org.apache.beam.runners.core.construction.ValidateRunnerXlangTest$CoGroupByKeyTest > test FAILED
java.lang.RuntimeException at TestDataflowRunner.java:141
org.apache.beam.runners.core.construction.ValidateRunnerXlangTest$CombineGloballyTest > test FAILED
java.lang.RuntimeException at TestDataflowRunner.java:141
org.apache.beam.runners.core.construction.ValidateRunnerXlangTest$MultiInputOutputWithSideInputTest > test FAILED
java.lang.RuntimeException at TestDataflowRunner.java:141
org.apache.beam.runners.core.construction.ValidateRunnerXlangTest$PartitionTest > test FAILED
java.lang.RuntimeException at TestDataflowRunner.java:141
INFO:root:Default Python SDK image for environment is apache/beam_python3.8_sdk:2.47.0rc1
INFO:root:No image given, using default Python SDK image
INFO:root:Default Python SDK image for environment is apache/beam_python3.8_sdk:2.47.0rc1
INFO:root:Python SDK container image set to "apache/beam_python3.8_sdk:2.47.0rc1" for Docker environment
INFO:__main__:Listening for expansion requests at 36465
INFO:root:Missing pipeline option (runner). Executing pipeline using the default runner: DirectRunner.
INFO:__main__:Shutting down expansion service.
INFO:apache_beam.runners.portability.stager:Executing command: ['/home/jenkins/.apache_beam/cache/venvs/py-3.8-beam-2.47.0rc1-743bdccef67087512a7a190820e727aab7bdcb14/bin/python', '-m', 'pip', 'download', '--dest', '/tmp/dataflow-requirements-cache', '-r', '/tmp/tmp5nl1crpt/tmp_requirements.txt', '--exists-action', 'i', '--no-deps', '--implementation', 'cp', '--abi', 'cp38', '--platform', 'manylinux2014_x86_64']
INFO:root:Default Python SDK image for environment is apache/beam_python3.8_sdk:2.47.0rc1
INFO:root:No image given, using default Python SDK image
INFO:root:Default Python SDK image for environment is apache/beam_python3.8_sdk:2.47.0rc1
INFO:root:Python SDK container image set to "apache/beam_python3.8_sdk:2.47.0rc1" for Docker environment
INFO:__main__:Listening for expansion requests at 35911
INFO:root:Missing pipeline option (runner). Executing pipeline using the default runner: DirectRunner.
INFO:__main__:Shutting down expansion service.
16 tests completed, 4 failed
> Task :runners:google-cloud-dataflow-java:validatesCrossLanguageRunnerJavaUsingPython FAILED
> Task :runners:google-cloud-dataflow-java:cleanupXVR UP-TO-DATE
> Task :runners:google-cloud-dataflow-java:cleanUpDockerPythonImages
Untagged: us.gcr.io/apache-beam-testing/java-postcommit-it/python:20230428151956
Untagged: us.gcr.io/apache-beam-testing/java-postcommit-it/python@sha256:7436bbd358e4cb45895d12d3a412f988115054e1c8fe92cdc18631091e745eae
WARNING: Successfully resolved tag to sha256, but it is recommended to use sha256 directly.
Tag: [us.gcr.io/apache-beam-testing/java-postcommit-it/python:20230428151956]
- referencing digest: [us.gcr.io/apache-beam-testing/java-postcommit-it/python@sha256:7436bbd358e4cb45895d12d3a412f988115054e1c8fe92cdc18631091e745eae]
Deleted [[us.gcr.io/apache-beam-testing/java-postcommit-it/python:20230428151956] (referencing [us.gcr.io/apache-beam-testing/java-postcommit-it/python@sha256:7436bbd358e4cb45895d12d3a412f988115054e1c8fe92cdc18631091e745eae])].
Removing untagged image us.gcr.io/apache-beam-testing/java-postcommit-it/python@sha256:7436bbd358e4cb45895d12d3a412f988115054e1c8fe92cdc18631091e745eae
Digests:
- us.gcr.io/apache-beam-testing/java-postcommit-it/python@sha256:7436bbd358e4cb45895d12d3a412f988115054e1c8fe92cdc18631091e745eae
Deleted [us.gcr.io/apache-beam-testing/java-postcommit-it/python@sha256:7436bbd358e4cb45895d12d3a412f988115054e1c8fe92cdc18631091e745eae].
> Task :runners:google-cloud-dataflow-java:cleanUpDockerJavaImages
Untagged: us.gcr.io/apache-beam-testing/java-postcommit-it/java:20230428151956
Untagged: us.gcr.io/apache-beam-testing/java-postcommit-it/java@sha256:db8231e831f794f3bb965ad8de75a3cb6a3d0535dbe22268f8fb8a822a20c0da
WARNING: Successfully resolved tag to sha256, but it is recommended to use sha256 directly.
Tag: [us.gcr.io/apache-beam-testing/java-postcommit-it/java:20230428151956]
- referencing digest: [us.gcr.io/apache-beam-testing/java-postcommit-it/java@sha256:db8231e831f794f3bb965ad8de75a3cb6a3d0535dbe22268f8fb8a822a20c0da]
Deleted [[us.gcr.io/apache-beam-testing/java-postcommit-it/java:20230428151956] (referencing [us.gcr.io/apache-beam-testing/java-postcommit-it/java@sha256:db8231e831f794f3bb965ad8de75a3cb6a3d0535dbe22268f8fb8a822a20c0da])].
Removing untagged image us.gcr.io/apache-beam-testing/java-postcommit-it/java@sha256:db8231e831f794f3bb965ad8de75a3cb6a3d0535dbe22268f8fb8a822a20c0da
Digests:
- us.gcr.io/apache-beam-testing/java-postcommit-it/java@sha256:db8231e831f794f3bb965ad8de75a3cb6a3d0535dbe22268f8fb8a822a20c0da
Deleted [us.gcr.io/apache-beam-testing/java-postcommit-it/java@sha256:db8231e831f794f3bb965ad8de75a3cb6a3d0535dbe22268f8fb8a822a20c0da].
> Task :runners:google-cloud-dataflow-java:validatesCrossLanguageRunnerCleanup
Stopping expansion service pid: 193969.
Stopping expansion service pid: 193970.
FAILURE: Build failed with an exception.
* What went wrong:
Execution failed for task ':runners:google-cloud-dataflow-java:validatesCrossLanguageRunnerJavaUsingPython'.
> There were failing tests. See the report at: file://<https://ci-beam.apache.org/job/beam_PostCommit_XVR_JavaUsingPython_Dataflow/ws/src/runners/google-cloud-dataflow-java/build/reports/tests/validatesCrossLanguageRunnerJavaUsingPython/index.html>
* Try:
> Run with --stacktrace option to get the stack trace.
> Run with --info or --debug option to get more log output.
* Get more help at https://help.gradle.org
Deprecated Gradle features were used in this build, making it incompatible with Gradle 8.0.
You can use '--warning-mode all' to show the individual deprecation warnings and determine if they come from your own scripts or plugins.
See https://docs.gradle.org/7.5.1/userguide/command_line_interface.html#sec:command_line_warnings
Execution optimizations have been disabled for 1 invalid unit(s) of work during this build to ensure correctness.
Please consult deprecation warnings for more details.
BUILD FAILED in 30m 11s
191 actionable tasks: 129 executed, 56 from cache, 6 up-to-date
Build scan background action failed.
java.lang.IllegalArgumentException: com.gradle.enterprise.gradleplugin.internal.extension.a is not an interface
at java.lang.reflect.Proxy$ProxyClassFactory.apply(Proxy.java:590)
at java.lang.reflect.Proxy$ProxyClassFactory.apply(Proxy.java:557)
at java.lang.reflect.WeakCache$Factory.get(WeakCache.java:230)
at java.lang.reflect.WeakCache.get(WeakCache.java:127)
at java.lang.reflect.Proxy.getProxyClass0(Proxy.java:419)
at java.lang.reflect.Proxy.newProxyInstance(Proxy.java:719)
at com.gradle.ProxyFactory$ProxyingInvocationHandler.createLocalProxy(ProxyFactory.java:64)
at com.gradle.ProxyFactory$ProxyingInvocationHandler.lambda$adaptActionArg$1(ProxyFactory.java:59)
at com.gradle.enterprise.gradleplugin.internal.extension.b$3.run(SourceFile:100)
at java.util.concurrent.Executors$RunnableAdapter.call(Executors.java:511)
at java.util.concurrent.FutureTask.run(FutureTask.java:266)
at java.util.concurrent.ThreadPoolExecutor.runWorker(ThreadPoolExecutor.java:1149)
at java.util.concurrent.ThreadPoolExecutor$Worker.run(ThreadPoolExecutor.java:624)
at java.lang.Thread.run(Thread.java:750)
Publishing build scan...
https://gradle.com/s/dblqdvyq4bjeg
Build step 'Invoke Gradle script' changed build result to FAILURE
Build step 'Invoke Gradle script' marked build as failure
---------------------------------------------------------------------
To unsubscribe, e-mail: builds-unsubscribe@beam.apache.org
For additional commands, e-mail: builds-help@beam.apache.org
Build failed in Jenkins: beam_PostCommit_XVR_JavaUsingPython_Dataflow #1820
Posted by Apache Jenkins Server <je...@builds.apache.org>.
See <https://ci-beam.apache.org/job/beam_PostCommit_XVR_JavaUsingPython_Dataflow/1820/display/redirect>
Changes:
------------------------------------------
[...truncated 594.35 KB...]
#24 1.675 Building wheels for collected packages: PTable
#24 1.676 Building wheel for PTable (setup.py): started
#24 2.236 Building wheel for PTable (setup.py): finished with status 'done'
#24 2.238 Created wheel for PTable: filename=PTable-0.9.2-py3-none-any.whl size=22908 sha256=81983c872e6899b0475f83ae1d14a2b41cc14c8190028ba7086c38fc45bc3e6f
#24 2.238 Stored in directory: /root/.cache/pip/wheels/33/df/2f/674985b3f8a2de3f96357d1eadef5110f74fa91b3785e52a54
#24 2.245 Successfully built PTable
#24 3.508 Installing collected packages: PTable, pip-licenses
#24 3.593 Successfully installed PTable-0.9.2 pip-licenses-3.5.5
#24 3.594 WARNING: Running pip as the 'root' user can result in broken permissions and conflicting behaviour with the system package manager. It is recommended to use a virtual environment instead: https://pip.pypa.io/warnings/venv
#24 8.695 INFO:root:Successfully pulled licenses for 109 dependencies
#24 8.695 Skip pulling license for bs4
#24 DONE 11.7s
#25 [stage-2 1/2] COPY --from=third_party_licenses /opt/apache/beam/third_party_licenses /opt/apache/beam/third_party_licenses
#25 DONE 0.1s
#26 [stage-2 2/2] RUN if [ "true" != "true" ] ; then rm -rf /opt/apache/beam/third_party_licenses ; fi
#26 DONE 0.3s
#27 exporting to image
#27 exporting layers
#27 exporting layers 16.2s done
#27 writing image sha256:4711556b92203fcbc273015ec2058b663ce92c7333454f14279a2f132cf60523
#27 writing image sha256:4711556b92203fcbc273015ec2058b663ce92c7333454f14279a2f132cf60523 done
#27 naming to docker.io/apache/beam_python3.7_sdk:2.48.0.dev done
#27 DONE 16.2s
> Task :runners:google-cloud-dataflow-java:buildAndPushDockerPythonContainer
WARNING: `gcloud docker` will not be supported for Docker client versions above 18.03.
As an alternative, use `gcloud auth configure-docker` to configure `docker` to
use `gcloud` as a credential helper, then use `docker` as you would for non-GCR
registries, e.g. `docker pull gcr.io/project-id/my-image`. Add
`--verbosity=error` to silence this warning: `gcloud docker
--verbosity=error -- pull gcr.io/project-id/my-image`.
See: https://cloud.google.com/container-registry/docs/support/deprecation-notices#gcloud-docker
The push refers to repository [us.gcr.io/apache-beam-testing/java-postcommit-it/python]
70ea8b3358c7: Preparing
bcbd2619cdcb: Preparing
e5242f705298: Preparing
0c868ee390d0: Preparing
3de8821e20e9: Preparing
b261d4eb62f3: Preparing
0f025c593998: Preparing
384a7644590d: Preparing
608bc050ebb3: Preparing
5fa8bfe06a9c: Preparing
77e14ec81748: Preparing
a6e50f7ea116: Preparing
1597e308b2c2: Preparing
3c996da10fdb: Preparing
82134164830d: Preparing
059d187ba4f2: Preparing
b3e61f2d2464: Preparing
063d47f8faa1: Preparing
02a788988127: Preparing
90dd70c2e6bd: Preparing
807e5e673844: Preparing
cfd0811d364e: Preparing
b86f260e173a: Preparing
6a1ebb98b0dc: Preparing
24b48387f467: Preparing
ae56c0c5405b: Preparing
b261d4eb62f3: Waiting
0f025c593998: Waiting
384a7644590d: Waiting
608bc050ebb3: Waiting
5fa8bfe06a9c: Waiting
77e14ec81748: Waiting
a6e50f7ea116: Waiting
1597e308b2c2: Waiting
3c996da10fdb: Waiting
82134164830d: Waiting
059d187ba4f2: Waiting
b3e61f2d2464: Waiting
063d47f8faa1: Waiting
02a788988127: Waiting
90dd70c2e6bd: Waiting
807e5e673844: Waiting
cfd0811d364e: Waiting
b86f260e173a: Waiting
6a1ebb98b0dc: Waiting
24b48387f467: Waiting
ae56c0c5405b: Waiting
3de8821e20e9: Pushed
bcbd2619cdcb: Pushed
0c868ee390d0: Pushed
e5242f705298: Pushed
b261d4eb62f3: Pushed
384a7644590d: Pushed
0f025c593998: Pushed
70ea8b3358c7: Pushed
5fa8bfe06a9c: Pushed
77e14ec81748: Pushed
a6e50f7ea116: Pushed
059d187ba4f2: Pushed
3c996da10fdb: Pushed
b3e61f2d2464: Pushed
063d47f8faa1: Layer already exists
02a788988127: Layer already exists
807e5e673844: Layer already exists
90dd70c2e6bd: Layer already exists
cfd0811d364e: Layer already exists
b86f260e173a: Layer already exists
6a1ebb98b0dc: Layer already exists
24b48387f467: Layer already exists
ae56c0c5405b: Layer already exists
608bc050ebb3: Pushed
82134164830d: Pushed
1597e308b2c2: Pushed
20230428090943: digest: sha256:17854374a7dff9c817b05edf41f21cef1166bc7709c41304f624e4225fcdd05e size: 5774
> Task :runners:google-cloud-dataflow-java:setupXVR
> Task :runners:google-cloud-dataflow-java:validatesCrossLanguageRunnerSetup
Stopping expansion service pid: 2734584.
Stopping expansion service pid: 2734585.
Launching Java expansion service @ 40005
Launching Python expansion service @ 35665
> Task :runners:google-cloud-dataflow-java:validatesCrossLanguageRunnerJavaUsingPython
INFO:root:Default Python SDK image for environment is apache/beam_python3.8_sdk:2.47.0rc1
INFO:root:No image given, using default Python SDK image
INFO:root:Default Python SDK image for environment is apache/beam_python3.8_sdk:2.47.0rc1
INFO:root:Python SDK container image set to "apache/beam_python3.8_sdk:2.47.0rc1" for Docker environment
INFO:__main__:Listening for expansion requests at 43453
INFO:root:Missing pipeline option (runner). Executing pipeline using the default runner: DirectRunner.
INFO:__main__:Shutting down expansion service.
INFO:apache_beam.runners.portability.stager:Executing command: ['/home/jenkins/.apache_beam/cache/venvs/py-3.8-beam-2.47.0rc1-743bdccef67087512a7a190820e727aab7bdcb14/bin/python', '-m', 'pip', 'download', '--dest', '/tmp/dataflow-requirements-cache', '-r', '/tmp/tmpa2w4lpte/tmp_requirements.txt', '--exists-action', 'i', '--no-deps', '--implementation', 'cp', '--abi', 'cp38', '--platform', 'manylinux2014_x86_64']
INFO:root:Default Python SDK image for environment is apache/beam_python3.8_sdk:2.47.0rc1
INFO:root:No image given, using default Python SDK image
INFO:root:Default Python SDK image for environment is apache/beam_python3.8_sdk:2.47.0rc1
INFO:root:Python SDK container image set to "apache/beam_python3.8_sdk:2.47.0rc1" for Docker environment
INFO:__main__:Listening for expansion requests at 35403
INFO:root:Missing pipeline option (runner). Executing pipeline using the default runner: DirectRunner.
INFO:__main__:Shutting down expansion service.
org.apache.beam.runners.core.construction.ValidateRunnerXlangTest$SingleInputOutputTest > test FAILED
org.apache.beam.vendor.grpc.v1p54p0.io.grpc.StatusRuntimeException at ValidateRunnerXlangTest.java:242
Caused by: org.apache.beam.vendor.grpc.v1p54p0.io.netty.channel.AbstractChannel$AnnotatedConnectException
Caused by: java.net.ConnectException at Errors.java:155
java.lang.NullPointerException at Preconditions.java:980
org.apache.beam.sdk.extensions.python.transforms.RunInferenceTransformTest > testRunInferenceWithKVs FAILED
java.lang.RuntimeException at RunInferenceTransformTest.java:108
Caused by: java.util.concurrent.TimeoutException at RunInferenceTransformTest.java:108
java.lang.NullPointerException at Preconditions.java:980
org.apache.beam.sdk.extensions.python.transforms.PythonMapTest > testPythonMap FAILED
java.lang.RuntimeException at PythonMapTest.java:41
Caused by: java.util.concurrent.TimeoutException at PythonMapTest.java:41
java.lang.NullPointerException at Preconditions.java:980
org.apache.beam.sdk.extensions.python.transforms.DataframeTransformTest > testDataframeSum FAILED
java.lang.RuntimeException at DataframeTransformTest.java:50
Caused by: java.util.concurrent.TimeoutException at DataframeTransformTest.java:50
java.lang.NullPointerException at Preconditions.java:980
org.apache.beam.sdk.extensions.python.transforms.RunInferenceTransformTest > testRunInference FAILED
java.lang.RuntimeException at RunInferenceTransformTest.java:60
Caused by: java.util.concurrent.TimeoutException at RunInferenceTransformTest.java:60
java.lang.NullPointerException at Preconditions.java:980
org.apache.beam.sdk.extensions.python.transforms.PythonMapTest > testPythonFlatMap FAILED
java.lang.RuntimeException at PythonMapTest.java:54
Caused by: java.util.concurrent.TimeoutException at PythonMapTest.java:54
java.lang.NullPointerException at Preconditions.java:980
16 tests completed, 6 failed
> Task :runners:google-cloud-dataflow-java:validatesCrossLanguageRunnerJavaUsingPython FAILED
> Task :runners:google-cloud-dataflow-java:cleanupXVR UP-TO-DATE
> Task :runners:google-cloud-dataflow-java:cleanUpDockerPythonImages
Untagged: us.gcr.io/apache-beam-testing/java-postcommit-it/python:20230428090943
Untagged: us.gcr.io/apache-beam-testing/java-postcommit-it/python@sha256:17854374a7dff9c817b05edf41f21cef1166bc7709c41304f624e4225fcdd05e
WARNING: Successfully resolved tag to sha256, but it is recommended to use sha256 directly.
Tag: [us.gcr.io/apache-beam-testing/java-postcommit-it/python:20230428090943]
- referencing digest: [us.gcr.io/apache-beam-testing/java-postcommit-it/python@sha256:17854374a7dff9c817b05edf41f21cef1166bc7709c41304f624e4225fcdd05e]
Deleted [[us.gcr.io/apache-beam-testing/java-postcommit-it/python:20230428090943] (referencing [us.gcr.io/apache-beam-testing/java-postcommit-it/python@sha256:17854374a7dff9c817b05edf41f21cef1166bc7709c41304f624e4225fcdd05e])].
Removing untagged image us.gcr.io/apache-beam-testing/java-postcommit-it/python@sha256:17854374a7dff9c817b05edf41f21cef1166bc7709c41304f624e4225fcdd05e
Digests:
- us.gcr.io/apache-beam-testing/java-postcommit-it/python@sha256:17854374a7dff9c817b05edf41f21cef1166bc7709c41304f624e4225fcdd05e
Deleted [us.gcr.io/apache-beam-testing/java-postcommit-it/python@sha256:17854374a7dff9c817b05edf41f21cef1166bc7709c41304f624e4225fcdd05e].
> Task :runners:google-cloud-dataflow-java:cleanUpDockerJavaImages
Untagged: us.gcr.io/apache-beam-testing/java-postcommit-it/java:20230428090943
Untagged: us.gcr.io/apache-beam-testing/java-postcommit-it/java@sha256:4bb54384c86ef1515db15749e1b5ea593a80ac60cf2180e6697020279c8f6d2e
Deleted: sha256:6f8dbc3a3b3a6efbe9e79198d793d62a776e6900a049d53613ba787f26e526ca
WARNING: Successfully resolved tag to sha256, but it is recommended to use sha256 directly.
Tag: [us.gcr.io/apache-beam-testing/java-postcommit-it/java:20230428090943]
- referencing digest: [us.gcr.io/apache-beam-testing/java-postcommit-it/java@sha256:4bb54384c86ef1515db15749e1b5ea593a80ac60cf2180e6697020279c8f6d2e]
Deleted [[us.gcr.io/apache-beam-testing/java-postcommit-it/java:20230428090943] (referencing [us.gcr.io/apache-beam-testing/java-postcommit-it/java@sha256:4bb54384c86ef1515db15749e1b5ea593a80ac60cf2180e6697020279c8f6d2e])].
Removing untagged image us.gcr.io/apache-beam-testing/java-postcommit-it/java@sha256:4bb54384c86ef1515db15749e1b5ea593a80ac60cf2180e6697020279c8f6d2e
Digests:
- us.gcr.io/apache-beam-testing/java-postcommit-it/java@sha256:4bb54384c86ef1515db15749e1b5ea593a80ac60cf2180e6697020279c8f6d2e
Deleted [us.gcr.io/apache-beam-testing/java-postcommit-it/java@sha256:4bb54384c86ef1515db15749e1b5ea593a80ac60cf2180e6697020279c8f6d2e].
> Task :runners:google-cloud-dataflow-java:validatesCrossLanguageRunnerCleanup
FAILURE: Build failed with an exception.
* What went wrong:
Execution failed for task ':runners:google-cloud-dataflow-java:validatesCrossLanguageRunnerJavaUsingPython'.
> There were failing tests. See the report at: file://<https://ci-beam.apache.org/job/beam_PostCommit_XVR_JavaUsingPython_Dataflow/ws/src/runners/google-cloud-dataflow-java/build/reports/tests/validatesCrossLanguageRunnerJavaUsingPython/index.html>
* Try:
> Run with --stacktrace option to get the stack trace.
> Run with --info or --debug option to get more log output.
* Get more help at https://help.gradle.org
Deprecated Gradle features were used in this build, making it incompatible with Gradle 8.0.
You can use '--warning-mode all' to show the individual deprecation warnings and determine if they come from your own scripts or plugins.
See https://docs.gradle.org/7.5.1/userguide/command_line_interface.html#sec:command_line_warnings
Execution optimizations have been disabled for 1 invalid unit(s) of work during this build to ensure correctness.
Please consult deprecation warnings for more details.
BUILD FAILED in 22m 18s
191 actionable tasks: 126 executed, 59 from cache, 6 up-to-date
Build scan background action failed.
java.lang.IllegalArgumentException: com.gradle.enterprise.gradleplugin.internal.extension.a is not an interface
at java.lang.reflect.Proxy$ProxyClassFactory.apply(Proxy.java:590)
at java.lang.reflect.Proxy$ProxyClassFactory.apply(Proxy.java:557)
at java.lang.reflect.WeakCache$Factory.get(WeakCache.java:230)
at java.lang.reflect.WeakCache.get(WeakCache.java:127)
at java.lang.reflect.Proxy.getProxyClass0(Proxy.java:419)
at java.lang.reflect.Proxy.newProxyInstance(Proxy.java:719)
at com.gradle.ProxyFactory$ProxyingInvocationHandler.createLocalProxy(ProxyFactory.java:64)
at com.gradle.ProxyFactory$ProxyingInvocationHandler.lambda$adaptActionArg$1(ProxyFactory.java:59)
at com.gradle.enterprise.gradleplugin.internal.extension.b$3.run(SourceFile:100)
at java.util.concurrent.Executors$RunnableAdapter.call(Executors.java:511)
at java.util.concurrent.FutureTask.run(FutureTask.java:266)
at java.util.concurrent.ThreadPoolExecutor.runWorker(ThreadPoolExecutor.java:1149)
at java.util.concurrent.ThreadPoolExecutor$Worker.run(ThreadPoolExecutor.java:624)
at java.lang.Thread.run(Thread.java:750)
Publishing build scan...
https://gradle.com/s/5na3xfddnxvdo
Build step 'Invoke Gradle script' changed build result to FAILURE
Build step 'Invoke Gradle script' marked build as failure
---------------------------------------------------------------------
To unsubscribe, e-mail: builds-unsubscribe@beam.apache.org
For additional commands, e-mail: builds-help@beam.apache.org
Build failed in Jenkins: beam_PostCommit_XVR_JavaUsingPython_Dataflow #1819
Posted by Apache Jenkins Server <je...@builds.apache.org>.
See <https://ci-beam.apache.org/job/beam_PostCommit_XVR_JavaUsingPython_Dataflow/1819/display/redirect>
Changes:
------------------------------------------
[...truncated 547.75 KB...]
#24 1.051 Collecting pip-licenses<5
#24 1.128 Downloading pip_licenses-3.5.5-py3-none-any.whl (17 kB)
#24 1.137 Requirement already satisfied: pyyaml in /usr/local/lib/python3.7/site-packages (6.0)
#24 1.138 Requirement already satisfied: tenacity in /usr/local/lib/python3.7/site-packages (8.2.2)
#24 1.180 Collecting PTable (from pip-licenses<5)
#24 1.198 Downloading PTable-0.9.2.tar.gz (31 kB)
#24 1.218 Preparing metadata (setup.py): started
#24 1.587 Preparing metadata (setup.py): finished with status 'done'
#24 1.604 Building wheels for collected packages: PTable
#24 1.605 Building wheel for PTable (setup.py): started
#24 2.161 Building wheel for PTable (setup.py): finished with status 'done'
#24 2.162 Created wheel for PTable: filename=PTable-0.9.2-py3-none-any.whl size=22908 sha256=f9022ff7a65def2a6ba8173c3e0ff39f9d0e2cbfc4ae9ec6ed983df3385a18dc
#24 2.163 Stored in directory: /root/.cache/pip/wheels/33/df/2f/674985b3f8a2de3f96357d1eadef5110f74fa91b3785e52a54
#24 2.169 Successfully built PTable
#24 3.406 Installing collected packages: PTable, pip-licenses
#24 3.483 Successfully installed PTable-0.9.2 pip-licenses-3.5.5
#24 3.484 WARNING: Running pip as the 'root' user can result in broken permissions and conflicting behaviour with the system package manager. It is recommended to use a virtual environment instead: https://pip.pypa.io/warnings/venv
#24 8.428 INFO:root:Successfully pulled licenses for 109 dependencies
#24 8.428 Skip pulling license for bs4
#24 DONE 8.6s
#25 [stage-2 1/2] COPY --from=third_party_licenses /opt/apache/beam/third_party_licenses /opt/apache/beam/third_party_licenses
#25 DONE 0.1s
#26 [stage-2 2/2] RUN if [ "true" != "true" ] ; then rm -rf /opt/apache/beam/third_party_licenses ; fi
#26 DONE 0.3s
#27 exporting to image
#27 exporting layers
#27 exporting layers 0.8s done
#27 writing image sha256:1bbbc62ba059a21845b3aef5d3fca1626eb829b0cfc08f529a9891483357a7d0 done
#27 naming to docker.io/apache/beam_python3.7_sdk:2.48.0.dev done
#27 DONE 0.9s
> Task :runners:google-cloud-dataflow-java:buildAndPushDockerPythonContainer
WARNING: `gcloud docker` will not be supported for Docker client versions above 18.03.
As an alternative, use `gcloud auth configure-docker` to configure `docker` to
use `gcloud` as a credential helper, then use `docker` as you would for non-GCR
registries, e.g. `docker pull gcr.io/project-id/my-image`. Add
`--verbosity=error` to silence this warning: `gcloud docker
--verbosity=error -- pull gcr.io/project-id/my-image`.
See: https://cloud.google.com/container-registry/docs/support/deprecation-notices#gcloud-docker
The push refers to repository [us.gcr.io/apache-beam-testing/java-postcommit-it/python]
9316e8c225eb: Preparing
8997ef292722: Preparing
f2ac93cc2559: Preparing
4cd00e6fe423: Preparing
fbe5416d3909: Preparing
d2aae41e5aec: Preparing
a655fb305b68: Preparing
48d7bf2957e2: Preparing
f44b3a8bcdb8: Preparing
6d012d63a7ec: Preparing
10a0d0a16f7f: Preparing
d2aae41e5aec: Waiting
48d7bf2957e2: Waiting
2f91922848da: Preparing
8153f88e1535: Preparing
f44b3a8bcdb8: Waiting
a655fb305b68: Waiting
b1bb7dc48e04: Preparing
6d012d63a7ec: Waiting
e7d057363c7e: Preparing
10a0d0a16f7f: Waiting
8153f88e1535: Waiting
2f91922848da: Waiting
9b9215e65da7: Preparing
b1bb7dc48e04: Waiting
90068bb8f3ac: Preparing
063d47f8faa1: Preparing
02a788988127: Preparing
90068bb8f3ac: Waiting
90dd70c2e6bd: Preparing
807e5e673844: Preparing
cfd0811d364e: Preparing
807e5e673844: Waiting
b86f260e173a: Preparing
6a1ebb98b0dc: Preparing
24b48387f467: Preparing
ae56c0c5405b: Preparing
ae56c0c5405b: Waiting
24b48387f467: Waiting
6a1ebb98b0dc: Waiting
8997ef292722: Pushed
fbe5416d3909: Pushed
4cd00e6fe423: Pushed
9316e8c225eb: Pushed
f2ac93cc2559: Pushed
a655fb305b68: Pushed
d2aae41e5aec: Pushed
10a0d0a16f7f: Layer already exists
2f91922848da: Layer already exists
8153f88e1535: Layer already exists
48d7bf2957e2: Pushed
b1bb7dc48e04: Layer already exists
e7d057363c7e: Layer already exists
90068bb8f3ac: Layer already exists
063d47f8faa1: Layer already exists
9b9215e65da7: Layer already exists
90dd70c2e6bd: Layer already exists
807e5e673844: Layer already exists
02a788988127: Layer already exists
cfd0811d364e: Layer already exists
b86f260e173a: Layer already exists
6a1ebb98b0dc: Layer already exists
24b48387f467: Layer already exists
ae56c0c5405b: Layer already exists
6d012d63a7ec: Pushed
f44b3a8bcdb8: Pushed
20230428053530: digest: sha256:432d1f9a894a70b0b90c36e52521b36ff23da208d50b9e464dd061919f1f567b size: 5774
> Task :runners:google-cloud-dataflow-java:setupXVR
> Task :runners:google-cloud-dataflow-java:validatesCrossLanguageRunnerSetup
Stopping expansion service pid: 240229.
Stopping expansion service pid: 240230.
Launching Java expansion service @ 37247
Launching Python expansion service @ 41173
> Task :runners:google-cloud-dataflow-java:validatesCrossLanguageRunnerJavaUsingPython
org.apache.beam.runners.core.construction.ValidateRunnerXlangTest$SingleInputOutputTest > test FAILED
org.apache.beam.vendor.grpc.v1p54p0.io.grpc.StatusRuntimeException at ValidateRunnerXlangTest.java:242
Caused by: org.apache.beam.vendor.grpc.v1p54p0.io.netty.channel.AbstractChannel$AnnotatedConnectException
Caused by: java.net.ConnectException at Errors.java:155
java.lang.NullPointerException at Preconditions.java:980
org.apache.beam.sdk.extensions.python.transforms.PythonMapTest > testPythonMap FAILED
java.lang.RuntimeException at PythonMapTest.java:41
Caused by: java.util.concurrent.TimeoutException at PythonMapTest.java:41
java.lang.NullPointerException at Preconditions.java:980
INFO:root:Default Python SDK image for environment is apache/beam_python3.8_sdk:2.47.0rc1
INFO:root:No image given, using default Python SDK image
INFO:root:Default Python SDK image for environment is apache/beam_python3.8_sdk:2.47.0rc1
INFO:root:Python SDK container image set to "apache/beam_python3.8_sdk:2.47.0rc1" for Docker environment
INFO:__main__:Listening for expansion requests at 38109
INFO:root:Missing pipeline option (runner). Executing pipeline using the default runner: DirectRunner.
INFO:__main__:Shutting down expansion service.
INFO:apache_beam.runners.portability.stager:Executing command: ['/home/jenkins/.apache_beam/cache/venvs/py-3.8-beam-2.47.0rc1-743bdccef67087512a7a190820e727aab7bdcb14/bin/python', '-m', 'pip', 'download', '--dest', '/tmp/dataflow-requirements-cache', '-r', '/tmp/tmp_5bf7l_d/tmp_requirements.txt', '--exists-action', 'i', '--no-deps', '--implementation', 'cp', '--abi', 'cp38', '--platform', 'manylinux2014_x86_64']
INFO:root:Default Python SDK image for environment is apache/beam_python3.8_sdk:2.47.0rc1
INFO:root:No image given, using default Python SDK image
INFO:root:Default Python SDK image for environment is apache/beam_python3.8_sdk:2.47.0rc1
INFO:root:Python SDK container image set to "apache/beam_python3.8_sdk:2.47.0rc1" for Docker environment
INFO:__main__:Listening for expansion requests at 41257
INFO:root:Missing pipeline option (runner). Executing pipeline using the default runner: DirectRunner.
org.apache.beam.sdk.extensions.python.transforms.DataframeTransformTest > testDataframeSum FAILED
java.lang.RuntimeException at DataframeTransformTest.java:50
Caused by: java.util.concurrent.TimeoutException at DataframeTransformTest.java:50
java.lang.NullPointerException at Preconditions.java:980
INFO:__main__:Shutting down expansion service.
org.apache.beam.sdk.extensions.python.transforms.RunInferenceTransformTest > testRunInferenceWithKVs FAILED
java.lang.RuntimeException at RunInferenceTransformTest.java:108
Caused by: java.util.concurrent.TimeoutException at RunInferenceTransformTest.java:108
java.lang.NullPointerException at Preconditions.java:980
org.apache.beam.sdk.extensions.python.transforms.PythonMapTest > testPythonFlatMap FAILED
java.lang.RuntimeException at PythonMapTest.java:54
Caused by: java.util.concurrent.TimeoutException at PythonMapTest.java:54
java.lang.NullPointerException at Preconditions.java:980
org.apache.beam.sdk.extensions.python.transforms.RunInferenceTransformTest > testRunInference FAILED
java.lang.RuntimeException at RunInferenceTransformTest.java:60
Caused by: java.util.concurrent.TimeoutException at RunInferenceTransformTest.java:60
java.lang.NullPointerException at Preconditions.java:980
16 tests completed, 6 failed
> Task :runners:google-cloud-dataflow-java:validatesCrossLanguageRunnerJavaUsingPython FAILED
> Task :runners:google-cloud-dataflow-java:cleanupXVR UP-TO-DATE
> Task :runners:google-cloud-dataflow-java:cleanUpDockerPythonImages
Untagged: us.gcr.io/apache-beam-testing/java-postcommit-it/python:20230428053530
Untagged: us.gcr.io/apache-beam-testing/java-postcommit-it/python@sha256:432d1f9a894a70b0b90c36e52521b36ff23da208d50b9e464dd061919f1f567b
WARNING: Successfully resolved tag to sha256, but it is recommended to use sha256 directly.
Tag: [us.gcr.io/apache-beam-testing/java-postcommit-it/python:20230428053530]
- referencing digest: [us.gcr.io/apache-beam-testing/java-postcommit-it/python@sha256:432d1f9a894a70b0b90c36e52521b36ff23da208d50b9e464dd061919f1f567b]
Deleted [[us.gcr.io/apache-beam-testing/java-postcommit-it/python:20230428053530] (referencing [us.gcr.io/apache-beam-testing/java-postcommit-it/python@sha256:432d1f9a894a70b0b90c36e52521b36ff23da208d50b9e464dd061919f1f567b])].
Removing untagged image us.gcr.io/apache-beam-testing/java-postcommit-it/python@sha256:432d1f9a894a70b0b90c36e52521b36ff23da208d50b9e464dd061919f1f567b
Digests:
- us.gcr.io/apache-beam-testing/java-postcommit-it/python@sha256:432d1f9a894a70b0b90c36e52521b36ff23da208d50b9e464dd061919f1f567b
Deleted [us.gcr.io/apache-beam-testing/java-postcommit-it/python@sha256:432d1f9a894a70b0b90c36e52521b36ff23da208d50b9e464dd061919f1f567b].
> Task :runners:google-cloud-dataflow-java:cleanUpDockerJavaImages
Untagged: us.gcr.io/apache-beam-testing/java-postcommit-it/java:20230428053530
Untagged: us.gcr.io/apache-beam-testing/java-postcommit-it/java@sha256:012eb88e52fe9bcda08e59164ea53b190241eff2ccb1f383350eeb3fe99b5bb7
Deleted: sha256:5bff36cbbf57a4ababb72dbb2087d727878bf0ee96be732de34d72e188be2a05
WARNING: Successfully resolved tag to sha256, but it is recommended to use sha256 directly.
Tag: [us.gcr.io/apache-beam-testing/java-postcommit-it/java:20230428053530]
- referencing digest: [us.gcr.io/apache-beam-testing/java-postcommit-it/java@sha256:012eb88e52fe9bcda08e59164ea53b190241eff2ccb1f383350eeb3fe99b5bb7]
Deleted [[us.gcr.io/apache-beam-testing/java-postcommit-it/java:20230428053530] (referencing [us.gcr.io/apache-beam-testing/java-postcommit-it/java@sha256:012eb88e52fe9bcda08e59164ea53b190241eff2ccb1f383350eeb3fe99b5bb7])].
Removing untagged image us.gcr.io/apache-beam-testing/java-postcommit-it/java@sha256:012eb88e52fe9bcda08e59164ea53b190241eff2ccb1f383350eeb3fe99b5bb7
Digests:
- us.gcr.io/apache-beam-testing/java-postcommit-it/java@sha256:012eb88e52fe9bcda08e59164ea53b190241eff2ccb1f383350eeb3fe99b5bb7
Deleted [us.gcr.io/apache-beam-testing/java-postcommit-it/java@sha256:012eb88e52fe9bcda08e59164ea53b190241eff2ccb1f383350eeb3fe99b5bb7].
> Task :runners:google-cloud-dataflow-java:validatesCrossLanguageRunnerCleanup
FAILURE: Build failed with an exception.
* What went wrong:
Execution failed for task ':runners:google-cloud-dataflow-java:validatesCrossLanguageRunnerJavaUsingPython'.
> There were failing tests. See the report at: file://<https://ci-beam.apache.org/job/beam_PostCommit_XVR_JavaUsingPython_Dataflow/ws/src/runners/google-cloud-dataflow-java/build/reports/tests/validatesCrossLanguageRunnerJavaUsingPython/index.html>
* Try:
> Run with --stacktrace option to get the stack trace.
> Run with --info or --debug option to get more log output.
* Get more help at https://help.gradle.org
Deprecated Gradle features were used in this build, making it incompatible with Gradle 8.0.
You can use '--warning-mode all' to show the individual deprecation warnings and determine if they come from your own scripts or plugins.
See https://docs.gradle.org/7.5.1/userguide/command_line_interface.html#sec:command_line_warnings
Execution optimizations have been disabled for 1 invalid unit(s) of work during this build to ensure correctness.
Please consult deprecation warnings for more details.
BUILD FAILED in 15m 59s
191 actionable tasks: 126 executed, 59 from cache, 6 up-to-date
Build scan background action failed.
java.lang.IllegalArgumentException: com.gradle.enterprise.gradleplugin.internal.extension.a is not an interface
at java.lang.reflect.Proxy$ProxyClassFactory.apply(Proxy.java:590)
at java.lang.reflect.Proxy$ProxyClassFactory.apply(Proxy.java:557)
at java.lang.reflect.WeakCache$Factory.get(WeakCache.java:230)
at java.lang.reflect.WeakCache.get(WeakCache.java:127)
at java.lang.reflect.Proxy.getProxyClass0(Proxy.java:419)
at java.lang.reflect.Proxy.newProxyInstance(Proxy.java:719)
at com.gradle.ProxyFactory$ProxyingInvocationHandler.createLocalProxy(ProxyFactory.java:64)
at com.gradle.ProxyFactory$ProxyingInvocationHandler.lambda$adaptActionArg$1(ProxyFactory.java:59)
at com.gradle.enterprise.gradleplugin.internal.extension.b$3.run(SourceFile:100)
at java.util.concurrent.Executors$RunnableAdapter.call(Executors.java:511)
at java.util.concurrent.FutureTask.run(FutureTask.java:266)
at java.util.concurrent.ThreadPoolExecutor.runWorker(ThreadPoolExecutor.java:1149)
at java.util.concurrent.ThreadPoolExecutor$Worker.run(ThreadPoolExecutor.java:624)
at java.lang.Thread.run(Thread.java:750)
Publishing build scan...
https://gradle.com/s/vvvhprv3zfrcm
Build step 'Invoke Gradle script' changed build result to FAILURE
Build step 'Invoke Gradle script' marked build as failure
---------------------------------------------------------------------
To unsubscribe, e-mail: builds-unsubscribe@beam.apache.org
For additional commands, e-mail: builds-help@beam.apache.org
Build failed in Jenkins: beam_PostCommit_XVR_JavaUsingPython_Dataflow #1818
Posted by Apache Jenkins Server <je...@builds.apache.org>.
See <https://ci-beam.apache.org/job/beam_PostCommit_XVR_JavaUsingPython_Dataflow/1818/display/redirect>
Changes:
------------------------------------------
[...truncated 596.75 KB...]
#24 1.249 Preparing metadata (setup.py): started
#24 1.605 Preparing metadata (setup.py): finished with status 'done'
#24 1.621 Building wheels for collected packages: PTable
#24 1.622 Building wheel for PTable (setup.py): started
#24 2.173 Building wheel for PTable (setup.py): finished with status 'done'
#24 2.174 Created wheel for PTable: filename=PTable-0.9.2-py3-none-any.whl size=22908 sha256=ea76994cc034732b7c6ca95202a33a0b165edf3fe728284230beeb41d77df91c
#24 2.174 Stored in directory: /root/.cache/pip/wheels/33/df/2f/674985b3f8a2de3f96357d1eadef5110f74fa91b3785e52a54
#24 2.180 Successfully built PTable
#24 3.394 Installing collected packages: PTable, pip-licenses
#24 3.477 Successfully installed PTable-0.9.2 pip-licenses-3.5.5
#24 3.477 WARNING: Running pip as the 'root' user can result in broken permissions and conflicting behaviour with the system package manager. It is recommended to use a virtual environment instead: https://pip.pypa.io/warnings/venv
#24 13.77 INFO:root:Successfully pulled licenses for 109 dependencies
#24 13.77 Skip pulling license for bs4
#24 DONE 14.5s
#25 [stage-2 1/2] COPY --from=third_party_licenses /opt/apache/beam/third_party_licenses /opt/apache/beam/third_party_licenses
#25 DONE 0.2s
#26 [stage-2 2/2] RUN if [ "true" != "true" ] ; then rm -rf /opt/apache/beam/third_party_licenses ; fi
#26 DONE 0.3s
#27 exporting to image
#27 exporting layers
#27 exporting layers 21.6s done
#27 writing image sha256:27e4c51e48242df1bff1e1a91b085a8643547821032a7abdb15fb81da7c7eee9 done
#27 naming to docker.io/apache/beam_python3.7_sdk:2.48.0.dev done
#27 DONE 21.7s
> Task :runners:google-cloud-dataflow-java:buildAndPushDockerPythonContainer
WARNING: `gcloud docker` will not be supported for Docker client versions above 18.03.
As an alternative, use `gcloud auth configure-docker` to configure `docker` to
use `gcloud` as a credential helper, then use `docker` as you would for non-GCR
registries, e.g. `docker pull gcr.io/project-id/my-image`. Add
`--verbosity=error` to silence this warning: `gcloud docker
--verbosity=error -- pull gcr.io/project-id/my-image`.
See: https://cloud.google.com/container-registry/docs/support/deprecation-notices#gcloud-docker
The push refers to repository [us.gcr.io/apache-beam-testing/java-postcommit-it/python]
d7964ce6225e: Preparing
dfcef876feb4: Preparing
3db2cbb40725: Preparing
e9956aa02ba3: Preparing
d909d0bfcb8c: Preparing
982fd900cec4: Preparing
c9a82537a0e7: Preparing
5c5c9bd3d9a7: Preparing
6f709ce62c1b: Preparing
6e2654a73df9: Preparing
567359582d5f: Preparing
2e27f28b13ad: Preparing
166ccc123e1c: Preparing
4bb06f17be73: Preparing
83281ee1af7b: Preparing
baca7b997294: Preparing
8d98f6ee2724: Preparing
063d47f8faa1: Preparing
02a788988127: Preparing
90dd70c2e6bd: Preparing
807e5e673844: Preparing
cfd0811d364e: Preparing
b86f260e173a: Preparing
6a1ebb98b0dc: Preparing
24b48387f467: Preparing
ae56c0c5405b: Preparing
982fd900cec4: Waiting
2e27f28b13ad: Waiting
166ccc123e1c: Waiting
8d98f6ee2724: Waiting
063d47f8faa1: Waiting
4bb06f17be73: Waiting
c9a82537a0e7: Waiting
02a788988127: Waiting
83281ee1af7b: Waiting
6a1ebb98b0dc: Waiting
90dd70c2e6bd: Waiting
baca7b997294: Waiting
24b48387f467: Waiting
5c5c9bd3d9a7: Waiting
807e5e673844: Waiting
ae56c0c5405b: Waiting
6f709ce62c1b: Waiting
b86f260e173a: Waiting
6e2654a73df9: Waiting
cfd0811d364e: Waiting
567359582d5f: Waiting
dfcef876feb4: Pushed
e9956aa02ba3: Pushed
d909d0bfcb8c: Pushed
d7964ce6225e: Pushed
3db2cbb40725: Pushed
c9a82537a0e7: Pushed
5c5c9bd3d9a7: Pushed
982fd900cec4: Pushed
6e2654a73df9: Pushed
567359582d5f: Pushed
2e27f28b13ad: Pushed
baca7b997294: Pushed
8d98f6ee2724: Pushed
063d47f8faa1: Layer already exists
02a788988127: Layer already exists
90dd70c2e6bd: Layer already exists
807e5e673844: Layer already exists
cfd0811d364e: Layer already exists
4bb06f17be73: Pushed
b86f260e173a: Layer already exists
24b48387f467: Layer already exists
6a1ebb98b0dc: Layer already exists
ae56c0c5405b: Layer already exists
6f709ce62c1b: Pushed
83281ee1af7b: Pushed
166ccc123e1c: Pushed
20230428002736: digest: sha256:e8e9aad789b5b55cb9187a137461c2b64ce7954f6f5293b50cb3649579a0f962 size: 5774
> Task :runners:google-cloud-dataflow-java:setupXVR
> Task :runners:google-cloud-dataflow-java:validatesCrossLanguageRunnerSetup
Stopping expansion service pid: 810899.
Stopping expansion service pid: 810900.
Launching Java expansion service @ 45001
Launching Python expansion service @ 45607
> Task :runners:google-cloud-dataflow-java:validatesCrossLanguageRunnerJavaUsingPython
org.apache.beam.runners.core.construction.ValidateRunnerXlangTest$SingleInputOutputTest > test FAILED
org.apache.beam.vendor.grpc.v1p54p0.io.grpc.StatusRuntimeException at ValidateRunnerXlangTest.java:242
Caused by: org.apache.beam.vendor.grpc.v1p54p0.io.netty.channel.AbstractChannel$AnnotatedConnectException
Caused by: java.net.ConnectException at Errors.java:155
java.lang.NullPointerException at Preconditions.java:980
org.apache.beam.sdk.extensions.python.transforms.DataframeTransformTest > testDataframeSum FAILED
java.lang.RuntimeException at DataframeTransformTest.java:50
Caused by: java.util.concurrent.TimeoutException at DataframeTransformTest.java:50
java.lang.NullPointerException at Preconditions.java:980
org.apache.beam.sdk.extensions.python.transforms.RunInferenceTransformTest > testRunInferenceWithKVs FAILED
java.lang.RuntimeException at RunInferenceTransformTest.java:108
Caused by: java.util.concurrent.TimeoutException at RunInferenceTransformTest.java:108
java.lang.NullPointerException at Preconditions.java:980
INFO:root:Default Python SDK image for environment is apache/beam_python3.8_sdk:2.47.0rc1
INFO:root:No image given, using default Python SDK image
INFO:root:Default Python SDK image for environment is apache/beam_python3.8_sdk:2.47.0rc1
INFO:root:Python SDK container image set to "apache/beam_python3.8_sdk:2.47.0rc1" for Docker environment
INFO:__main__:Listening for expansion requests at 46293
INFO:root:Missing pipeline option (runner). Executing pipeline using the default runner: DirectRunner.
INFO:__main__:Shutting down expansion service.
org.apache.beam.sdk.extensions.python.transforms.PythonMapTest > testPythonMap FAILED
java.lang.RuntimeException at PythonMapTest.java:41
Caused by: java.util.concurrent.TimeoutException at PythonMapTest.java:41
java.lang.NullPointerException at Preconditions.java:980
INFO:apache_beam.runners.portability.stager:Executing command: ['/home/jenkins/.apache_beam/cache/venvs/py-3.8-beam-2.47.0rc1-743bdccef67087512a7a190820e727aab7bdcb14/bin/python', '-m', 'pip', 'download', '--dest', '/tmp/dataflow-requirements-cache', '-r', '/tmp/tmpzu2s0qp3/tmp_requirements.txt', '--exists-action', 'i', '--no-deps', '--implementation', 'cp', '--abi', 'cp38', '--platform', 'manylinux2014_x86_64']
INFO:root:Default Python SDK image for environment is apache/beam_python3.8_sdk:2.47.0rc1
INFO:root:No image given, using default Python SDK image
INFO:root:Default Python SDK image for environment is apache/beam_python3.8_sdk:2.47.0rc1
INFO:root:Python SDK container image set to "apache/beam_python3.8_sdk:2.47.0rc1" for Docker environment
INFO:__main__:Listening for expansion requests at 43009
INFO:root:Missing pipeline option (runner). Executing pipeline using the default runner: DirectRunner.
org.apache.beam.sdk.extensions.python.transforms.RunInferenceTransformTest > testRunInference FAILED
java.lang.RuntimeException at RunInferenceTransformTest.java:60
Caused by: java.util.concurrent.TimeoutException at RunInferenceTransformTest.java:60
java.lang.NullPointerException at Preconditions.java:980
org.apache.beam.sdk.extensions.python.transforms.PythonMapTest > testPythonFlatMap FAILED
java.lang.RuntimeException at PythonMapTest.java:54
Caused by: java.util.concurrent.TimeoutException at PythonMapTest.java:54
java.lang.NullPointerException at Preconditions.java:980
INFO:__main__:Shutting down expansion service.
16 tests completed, 6 failed
> Task :runners:google-cloud-dataflow-java:validatesCrossLanguageRunnerJavaUsingPython FAILED
> Task :runners:google-cloud-dataflow-java:cleanupXVR UP-TO-DATE
> Task :runners:google-cloud-dataflow-java:cleanUpDockerPythonImages
Untagged: us.gcr.io/apache-beam-testing/java-postcommit-it/python:20230428002736
Untagged: us.gcr.io/apache-beam-testing/java-postcommit-it/python@sha256:e8e9aad789b5b55cb9187a137461c2b64ce7954f6f5293b50cb3649579a0f962
WARNING: Successfully resolved tag to sha256, but it is recommended to use sha256 directly.
Tag: [us.gcr.io/apache-beam-testing/java-postcommit-it/python:20230428002736]
- referencing digest: [us.gcr.io/apache-beam-testing/java-postcommit-it/python@sha256:e8e9aad789b5b55cb9187a137461c2b64ce7954f6f5293b50cb3649579a0f962]
Deleted [[us.gcr.io/apache-beam-testing/java-postcommit-it/python:20230428002736] (referencing [us.gcr.io/apache-beam-testing/java-postcommit-it/python@sha256:e8e9aad789b5b55cb9187a137461c2b64ce7954f6f5293b50cb3649579a0f962])].
Removing untagged image us.gcr.io/apache-beam-testing/java-postcommit-it/python@sha256:e8e9aad789b5b55cb9187a137461c2b64ce7954f6f5293b50cb3649579a0f962
Digests:
- us.gcr.io/apache-beam-testing/java-postcommit-it/python@sha256:e8e9aad789b5b55cb9187a137461c2b64ce7954f6f5293b50cb3649579a0f962
Deleted [us.gcr.io/apache-beam-testing/java-postcommit-it/python@sha256:e8e9aad789b5b55cb9187a137461c2b64ce7954f6f5293b50cb3649579a0f962].
> Task :runners:google-cloud-dataflow-java:cleanUpDockerJavaImages
Untagged: us.gcr.io/apache-beam-testing/java-postcommit-it/java:20230428002736
Untagged: us.gcr.io/apache-beam-testing/java-postcommit-it/java@sha256:ef3d47281b4a32c36c87926caa082a893cfce9eafe95c4c36da4bbeb21dcfc61
WARNING: Successfully resolved tag to sha256, but it is recommended to use sha256 directly.
Tag: [us.gcr.io/apache-beam-testing/java-postcommit-it/java:20230428002736]
- referencing digest: [us.gcr.io/apache-beam-testing/java-postcommit-it/java@sha256:ef3d47281b4a32c36c87926caa082a893cfce9eafe95c4c36da4bbeb21dcfc61]
Deleted [[us.gcr.io/apache-beam-testing/java-postcommit-it/java:20230428002736] (referencing [us.gcr.io/apache-beam-testing/java-postcommit-it/java@sha256:ef3d47281b4a32c36c87926caa082a893cfce9eafe95c4c36da4bbeb21dcfc61])].
Removing untagged image us.gcr.io/apache-beam-testing/java-postcommit-it/java@sha256:ef3d47281b4a32c36c87926caa082a893cfce9eafe95c4c36da4bbeb21dcfc61
Digests:
- us.gcr.io/apache-beam-testing/java-postcommit-it/java@sha256:ef3d47281b4a32c36c87926caa082a893cfce9eafe95c4c36da4bbeb21dcfc61
Deleted [us.gcr.io/apache-beam-testing/java-postcommit-it/java@sha256:ef3d47281b4a32c36c87926caa082a893cfce9eafe95c4c36da4bbeb21dcfc61].
> Task :runners:google-cloud-dataflow-java:validatesCrossLanguageRunnerCleanup
FAILURE: Build failed with an exception.
* What went wrong:
Execution failed for task ':runners:google-cloud-dataflow-java:validatesCrossLanguageRunnerJavaUsingPython'.
> There were failing tests. See the report at: file://<https://ci-beam.apache.org/job/beam_PostCommit_XVR_JavaUsingPython_Dataflow/ws/src/runners/google-cloud-dataflow-java/build/reports/tests/validatesCrossLanguageRunnerJavaUsingPython/index.html>
* Try:
> Run with --stacktrace option to get the stack trace.
> Run with --info or --debug option to get more log output.
* Get more help at https://help.gradle.org
Deprecated Gradle features were used in this build, making it incompatible with Gradle 8.0.
You can use '--warning-mode all' to show the individual deprecation warnings and determine if they come from your own scripts or plugins.
See https://docs.gradle.org/7.5.1/userguide/command_line_interface.html#sec:command_line_warnings
Execution optimizations have been disabled for 1 invalid unit(s) of work during this build to ensure correctness.
Please consult deprecation warnings for more details.
BUILD FAILED in 23m 45s
191 actionable tasks: 126 executed, 59 from cache, 6 up-to-date
Build scan background action failed.
java.lang.IllegalArgumentException: com.gradle.enterprise.gradleplugin.internal.extension.a is not an interface
at java.lang.reflect.Proxy$ProxyClassFactory.apply(Proxy.java:590)
at java.lang.reflect.Proxy$ProxyClassFactory.apply(Proxy.java:557)
at java.lang.reflect.WeakCache$Factory.get(WeakCache.java:230)
at java.lang.reflect.WeakCache.get(WeakCache.java:127)
at java.lang.reflect.Proxy.getProxyClass0(Proxy.java:419)
at java.lang.reflect.Proxy.newProxyInstance(Proxy.java:719)
at com.gradle.ProxyFactory$ProxyingInvocationHandler.createLocalProxy(ProxyFactory.java:64)
at com.gradle.ProxyFactory$ProxyingInvocationHandler.lambda$adaptActionArg$1(ProxyFactory.java:59)
at com.gradle.enterprise.gradleplugin.internal.extension.b$3.run(SourceFile:100)
at java.util.concurrent.Executors$RunnableAdapter.call(Executors.java:511)
at java.util.concurrent.FutureTask.run(FutureTask.java:266)
at java.util.concurrent.ThreadPoolExecutor.runWorker(ThreadPoolExecutor.java:1149)
at java.util.concurrent.ThreadPoolExecutor$Worker.run(ThreadPoolExecutor.java:624)
at java.lang.Thread.run(Thread.java:750)
Publishing build scan...
https://gradle.com/s/tjoab7tpwcwdq
Build step 'Invoke Gradle script' changed build result to FAILURE
Build step 'Invoke Gradle script' marked build as failure
---------------------------------------------------------------------
To unsubscribe, e-mail: builds-unsubscribe@beam.apache.org
For additional commands, e-mail: builds-help@beam.apache.org