You are viewing a plain text version of this content. The canonical link for it is here.
Posted to notifications@maven.apache.org by Apache Jenkins Server <je...@builds.apache.org> on 2012/07/15 23:01:14 UTC
Build failed in Jenkins: maven-site-plugin-3.x » JDK 1.5 (latest),Solaris #226
See <https://builds.apache.org/job/maven-site-plugin-3.x/./jdk=JDK%201.5%20(latest),label=Solaris/226/changes>
Changes:
[hboutemy] fixed IT
------------------------------------------
Started by upstream project "maven-site-plugin-3.x" build number 226
Building remotely on solaris1 in workspace <https://builds.apache.org/job/maven-site-plugin-3.x/./jdk=JDK%201.5%20(latest),label=Solaris/ws/>
Updating http://svn.apache.org/repos/asf/maven/plugins/trunk/maven-site-plugin
U src/it/validate/src/site/fml/faq.fml
At revision 1361414
[locks-and-latches] Checking to see if we really have the locks
[locks-and-latches] Have all the locks, build can start
[Solaris] $ /home/hudson/tools/maven/apache-maven-3.0.3/bin/mvn -Dlabel=Solaris "-Djdk=JDK 1.5 (latest)" clean verify -Prun-its -fae -B -U -e -V
Apache Maven 3.0.3 (r1075438; 2011-02-28 17:31:09+0000)
Maven home: /home/hudson/tools/maven/apache-maven-3.0.3
Java version: 1.5.0_22, vendor: Sun Microsystems Inc.
Java home: /zonestorage/hudson_solaris/home/hudson/tools/java/jdk1.5.0_22/jre
Default locale: en, platform encoding: ISO646-US
OS name: "sunos", version: "5.10", arch: "x86", family: "unix"
[INFO] Error stacktraces are turned on.
[INFO] Scanning for projects...
[ERROR] The build could not read 1 project -> [Help 1]
org.apache.maven.project.ProjectBuildingException: Some problems were encountered while processing the POMs:
[FATAL] Non-resolvable parent POM: Could not find artifact org.apache.maven.plugins:maven-plugins:pom:23-SNAPSHOT and 'parent.relativePath' points at wrong local POM @ line 25, column 11
at org.apache.maven.project.DefaultProjectBuilder.build(DefaultProjectBuilder.java:339)
at org.apache.maven.DefaultMaven.collectProjects(DefaultMaven.java:632)
at org.apache.maven.DefaultMaven.getProjectsForMavenReactor(DefaultMaven.java:581)
at org.apache.maven.DefaultMaven.doExecute(DefaultMaven.java:233)
at org.apache.maven.DefaultMaven.execute(DefaultMaven.java:156)
at org.apache.maven.cli.MavenCli.execute(MavenCli.java:537)
at org.apache.maven.cli.MavenCli.doMain(MavenCli.java:196)
at org.apache.maven.cli.MavenCli.main(MavenCli.java:141)
at sun.reflect.NativeMethodAccessorImpl.invoke0(Native Method)
at sun.reflect.NativeMethodAccessorImpl.invoke(NativeMethodAccessorImpl.java:39)
at sun.reflect.DelegatingMethodAccessorImpl.invoke(DelegatingMethodAccessorImpl.java:25)
at java.lang.reflect.Method.invoke(Method.java:592)
at org.codehaus.plexus.classworlds.launcher.Launcher.launchEnhanced(Launcher.java:290)
at org.codehaus.plexus.classworlds.launcher.Launcher.launch(Launcher.java:230)
at org.codehaus.plexus.classworlds.launcher.Launcher.mainWithExitCode(Launcher.java:409)
at org.codehaus.plexus.classworlds.launcher.Launcher.main(Launcher.java:352)
[ERROR]
[ERROR] The project org.apache.maven.plugins:maven-site-plugin:3.2-SNAPSHOT (/zonestorage/hudson_solaris/home/hudson/hudson-slave/workspace/maven-site-plugin-3.x/jdk/JDK 1.5 (latest)/label/Solaris/pom.xml) has 1 error
[ERROR] Non-resolvable parent POM: Could not find artifact org.apache.maven.plugins:maven-plugins:pom:23-SNAPSHOT and 'parent.relativePath' points at wrong local POM @ line 25, column 11 -> [Help 2]
org.apache.maven.model.resolution.UnresolvableModelException: Could not find artifact org.apache.maven.plugins:maven-plugins:pom:23-SNAPSHOT
at org.apache.maven.project.ProjectModelResolver.resolveModel(ProjectModelResolver.java:159)
at org.apache.maven.model.building.DefaultModelBuilder.readParentExternally(DefaultModelBuilder.java:819)
at org.apache.maven.model.building.DefaultModelBuilder.readParent(DefaultModelBuilder.java:670)
at org.apache.maven.model.building.DefaultModelBuilder.build(DefaultModelBuilder.java:308)
at org.apache.maven.model.building.DefaultModelBuilder.build(DefaultModelBuilder.java:232)
at org.apache.maven.project.DefaultProjectBuilder.build(DefaultProjectBuilder.java:386)
at org.apache.maven.project.DefaultProjectBuilder.build(DefaultProjectBuilder.java:355)
at org.apache.maven.project.DefaultProjectBuilder.build(DefaultProjectBuilder.java:319)
at org.apache.maven.DefaultMaven.collectProjects(DefaultMaven.java:632)
at org.apache.maven.DefaultMaven.getProjectsForMavenReactor(DefaultMaven.java:581)
at org.apache.maven.DefaultMaven.doExecute(DefaultMaven.java:233)
at org.apache.maven.DefaultMaven.execute(DefaultMaven.java:156)
at org.apache.maven.cli.MavenCli.execute(MavenCli.java:537)
at org.apache.maven.cli.MavenCli.doMain(MavenCli.java:196)
at org.apache.maven.cli.MavenCli.main(MavenCli.java:141)
at sun.reflect.NativeMethodAccessorImpl.invoke0(Native Method)
at sun.reflect.NativeMethodAccessorImpl.invoke(NativeMethodAccessorImpl.java:39)
at sun.reflect.DelegatingMethodAccessorImpl.invoke(DelegatingMethodAccessorImpl.java:25)
at java.lang.reflect.Method.invoke(Method.java:592)
at org.codehaus.plexus.classworlds.launcher.Launcher.launchEnhanced(Launcher.java:290)
at org.codehaus.plexus.classworlds.launcher.Launcher.launch(Launcher.java:230)
at org.codehaus.plexus.classworlds.launcher.Launcher.mainWithExitCode(Launcher.java:409)
at org.codehaus.plexus.classworlds.launcher.Launcher.main(Launcher.java:352)
Caused by: org.sonatype.aether.resolution.ArtifactResolutionException: Could not find artifact org.apache.maven.plugins:maven-plugins:pom:23-SNAPSHOT
at org.sonatype.aether.impl.internal.DefaultArtifactResolver.resolve(DefaultArtifactResolver.java:541)
at org.sonatype.aether.impl.internal.DefaultArtifactResolver.resolveArtifacts(DefaultArtifactResolver.java:220)
at org.sonatype.aether.impl.internal.DefaultArtifactResolver.resolveArtifact(DefaultArtifactResolver.java:197)
at org.sonatype.aether.impl.internal.DefaultRepositorySystem.resolveArtifact(DefaultRepositorySystem.java:323)
at org.apache.maven.project.ProjectModelResolver.resolveModel(ProjectModelResolver.java:155)
... 22 more
Caused by: org.sonatype.aether.transfer.ArtifactNotFoundException: Could not find artifact org.apache.maven.plugins:maven-plugins:pom:23-SNAPSHOT
at org.sonatype.aether.impl.internal.DefaultArtifactResolver.resolve(DefaultArtifactResolver.java:531)
... 26 more
[ERROR]
[ERROR] Re-run Maven using the -X switch to enable full debug logging.
[ERROR]
[ERROR] For more information about the errors and possible solutions, please read the following articles:
[ERROR] [Help 1] http://cwiki.apache.org/confluence/display/MAVEN/ProjectBuildingException
[ERROR] [Help 2] http://cwiki.apache.org/confluence/display/MAVEN/UnresolvableModelException
Build step 'Invoke top-level Maven targets' marked build as failure
[locks-and-latches] Releasing all the locks
[locks-and-latches] All the locks released
Build failed in Jenkins: maven-site-plugin-3.x » JDK 1.5 (latest),Solaris #227
Posted by Apache Jenkins Server <je...@builds.apache.org>.
See <https://builds.apache.org/job/maven-site-plugin-3.x/./jdk=JDK%201.5%20(latest),label=Solaris/227/>
------------------------------------------
Started by upstream project "maven-site-plugin-3.x" build number 227
Building remotely on solaris1 in workspace <https://builds.apache.org/job/maven-site-plugin-3.x/./jdk=JDK%201.5%20(latest),label=Solaris/ws/>
Updating http://svn.apache.org/repos/asf/maven/plugins/trunk/maven-site-plugin
At revision 1362614
no change for http://svn.apache.org/repos/asf/maven/plugins/trunk/maven-site-plugin since the previous build
[locks-and-latches] Checking to see if we really have the locks
[locks-and-latches] Have all the locks, build can start
[Solaris] $ /home/hudson/tools/maven/apache-maven-3.0.3/bin/mvn -Dlabel=Solaris "-Djdk=JDK 1.5 (latest)" clean verify -Prun-its -fae -B -U -e -V
Apache Maven 3.0.3 (r1075438; 2011-02-28 17:31:09+0000)
Maven home: /home/hudson/tools/maven/apache-maven-3.0.3
Java version: 1.5.0_22, vendor: Sun Microsystems Inc.
Java home: /zonestorage/hudson_solaris/home/hudson/tools/java/jdk1.5.0_22/jre
Default locale: en, platform encoding: ISO646-US
OS name: "sunos", version: "5.10", arch: "x86", family: "unix"
[INFO] Error stacktraces are turned on.
[INFO] Scanning for projects...
[ERROR] The build could not read 1 project -> [Help 1]
org.apache.maven.project.ProjectBuildingException: Some problems were encountered while processing the POMs:
[FATAL] Non-resolvable parent POM: Could not find artifact org.apache.maven.plugins:maven-plugins:pom:23-SNAPSHOT and 'parent.relativePath' points at wrong local POM @ line 25, column 11
at org.apache.maven.project.DefaultProjectBuilder.build(DefaultProjectBuilder.java:339)
at org.apache.maven.DefaultMaven.collectProjects(DefaultMaven.java:632)
at org.apache.maven.DefaultMaven.getProjectsForMavenReactor(DefaultMaven.java:581)
at org.apache.maven.DefaultMaven.doExecute(DefaultMaven.java:233)
at org.apache.maven.DefaultMaven.execute(DefaultMaven.java:156)
at org.apache.maven.cli.MavenCli.execute(MavenCli.java:537)
at org.apache.maven.cli.MavenCli.doMain(MavenCli.java:196)
at org.apache.maven.cli.MavenCli.main(MavenCli.java:141)
at sun.reflect.NativeMethodAccessorImpl.invoke0(Native Method)
at sun.reflect.NativeMethodAccessorImpl.invoke(NativeMethodAccessorImpl.java:39)
at sun.reflect.DelegatingMethodAccessorImpl.invoke(DelegatingMethodAccessorImpl.java:25)
at java.lang.reflect.Method.invoke(Method.java:592)
at org.codehaus.plexus.classworlds.launcher.Launcher.launchEnhanced(Launcher.java:290)
at org.codehaus.plexus.classworlds.launcher.Launcher.launch(Launcher.java:230)
at org.codehaus.plexus.classworlds.launcher.Launcher.mainWithExitCode(Launcher.java:409)
at org.codehaus.plexus.classworlds.launcher.Launcher.main(Launcher.java:352)
[ERROR]
[ERROR] The project org.apache.maven.plugins:maven-site-plugin:3.2-SNAPSHOT (/zonestorage/hudson_solaris/home/hudson/hudson-slave/workspace/maven-site-plugin-3.x/jdk/JDK 1.5 (latest)/label/Solaris/pom.xml) has 1 error
[ERROR] Non-resolvable parent POM: Could not find artifact org.apache.maven.plugins:maven-plugins:pom:23-SNAPSHOT and 'parent.relativePath' points at wrong local POM @ line 25, column 11 -> [Help 2]
org.apache.maven.model.resolution.UnresolvableModelException: Could not find artifact org.apache.maven.plugins:maven-plugins:pom:23-SNAPSHOT
at org.apache.maven.project.ProjectModelResolver.resolveModel(ProjectModelResolver.java:159)
at org.apache.maven.model.building.DefaultModelBuilder.readParentExternally(DefaultModelBuilder.java:819)
at org.apache.maven.model.building.DefaultModelBuilder.readParent(DefaultModelBuilder.java:670)
at org.apache.maven.model.building.DefaultModelBuilder.build(DefaultModelBuilder.java:308)
at org.apache.maven.model.building.DefaultModelBuilder.build(DefaultModelBuilder.java:232)
at org.apache.maven.project.DefaultProjectBuilder.build(DefaultProjectBuilder.java:386)
at org.apache.maven.project.DefaultProjectBuilder.build(DefaultProjectBuilder.java:355)
at org.apache.maven.project.DefaultProjectBuilder.build(DefaultProjectBuilder.java:319)
at org.apache.maven.DefaultMaven.collectProjects(DefaultMaven.java:632)
at org.apache.maven.DefaultMaven.getProjectsForMavenReactor(DefaultMaven.java:581)
at org.apache.maven.DefaultMaven.doExecute(DefaultMaven.java:233)
at org.apache.maven.DefaultMaven.execute(DefaultMaven.java:156)
at org.apache.maven.cli.MavenCli.execute(MavenCli.java:537)
at org.apache.maven.cli.MavenCli.doMain(MavenCli.java:196)
at org.apache.maven.cli.MavenCli.main(MavenCli.java:141)
at sun.reflect.NativeMethodAccessorImpl.invoke0(Native Method)
at sun.reflect.NativeMethodAccessorImpl.invoke(NativeMethodAccessorImpl.java:39)
at sun.reflect.DelegatingMethodAccessorImpl.invoke(DelegatingMethodAccessorImpl.java:25)
at java.lang.reflect.Method.invoke(Method.java:592)
at org.codehaus.plexus.classworlds.launcher.Launcher.launchEnhanced(Launcher.java:290)
at org.codehaus.plexus.classworlds.launcher.Launcher.launch(Launcher.java:230)
at org.codehaus.plexus.classworlds.launcher.Launcher.mainWithExitCode(Launcher.java:409)
at org.codehaus.plexus.classworlds.launcher.Launcher.main(Launcher.java:352)
Caused by: org.sonatype.aether.resolution.ArtifactResolutionException: Could not find artifact org.apache.maven.plugins:maven-plugins:pom:23-SNAPSHOT
at org.sonatype.aether.impl.internal.DefaultArtifactResolver.resolve(DefaultArtifactResolver.java:541)
at org.sonatype.aether.impl.internal.DefaultArtifactResolver.resolveArtifacts(DefaultArtifactResolver.java:220)
at org.sonatype.aether.impl.internal.DefaultArtifactResolver.resolveArtifact(DefaultArtifactResolver.java:197)
at org.sonatype.aether.impl.internal.DefaultRepositorySystem.resolveArtifact(DefaultRepositorySystem.java:323)
at org.apache.maven.project.ProjectModelResolver.resolveModel(ProjectModelResolver.java:155)
... 22 more
Caused by: org.sonatype.aether.transfer.ArtifactNotFoundException: Could not find artifact org.apache.maven.plugins:maven-plugins:pom:23-SNAPSHOT
at org.sonatype.aether.impl.internal.DefaultArtifactResolver.resolve(DefaultArtifactResolver.java:531)
... 26 more
[ERROR]
[ERROR] Re-run Maven using the -X switch to enable full debug logging.
[ERROR]
[ERROR] For more information about the errors and possible solutions, please read the following articles:
[ERROR] [Help 1] http://cwiki.apache.org/confluence/display/MAVEN/ProjectBuildingException
[ERROR] [Help 2] http://cwiki.apache.org/confluence/display/MAVEN/UnresolvableModelException
Build step 'Invoke top-level Maven targets' marked build as failure
[locks-and-latches] Releasing all the locks
[locks-and-latches] All the locks released