You are viewing a plain text version of this content. The canonical link for it is here.
Posted to yarn-dev@hadoop.apache.org by Apache Jenkins Server <je...@builds.apache.org> on 2014/06/09 20:20:13 UTC
Failed: YARN-1879 PreCommit Build #3943
Jira: https://issues.apache.org/jira/browse/YARN-1879
Build: https://builds.apache.org/job/PreCommit-YARN-Build/3943/
###################################################################################
########################## LAST 60 LINES OF THE CONSOLE ###########################
[...truncated 3176 lines...]
http://issues.apache.org/jira/secure/attachment/12649395/YARN-1879.8.patch
against trunk revision .
{color:green}+1 @author{color}. The patch does not contain any @author tags.
{color:green}+1 tests included{color}. The patch appears to include 6 new or modified test files.
{color:green}+1 javac{color}. The applied patch does not increase the total number of javac compiler warnings.
{color:green}+1 javadoc{color}. There were no new javadoc warning messages.
{color:green}+1 eclipse:eclipse{color}. The patch built with eclipse:eclipse.
{color:green}+1 findbugs{color}. The patch does not introduce any new Findbugs (version 1.3.9) warnings.
{color:green}+1 release audit{color}. The applied patch does not increase the total number of release audit warnings.
{color:red}-1 core tests{color}. The patch failed these unit tests in hadoop-yarn-project/hadoop-yarn/hadoop-yarn-api hadoop-yarn-project/hadoop-yarn/hadoop-yarn-client hadoop-yarn-project/hadoop-yarn/hadoop-yarn-server/hadoop-yarn-server-resourcemanager:
org.apache.hadoop.yarn.client.TestRMAdminCLI
{color:green}+1 contrib tests{color}. The patch passed contrib unit tests.
Test results: https://builds.apache.org/job/PreCommit-YARN-Build/3943//testReport/
Console output: https://builds.apache.org/job/PreCommit-YARN-Build/3943//console
This message is automatically generated.
======================================================================
======================================================================
Adding comment to Jira.
======================================================================
======================================================================
Comment added.
28e584c9807763428dfdbee48d766a400a1ac913 logged out
======================================================================
======================================================================
Finished build.
======================================================================
======================================================================
Build step 'Execute shell' marked build as failure
Archiving artifacts
Sending artifact delta relative to PreCommit-YARN-Build #3938
Archived 27 artifacts
Archive block size is 32768
Received 205 blocks and 1910979 bytes
Compression is 77.9%
Took 2.1 sec
[description-setter] Could not determine description.
Recording test results
Email was triggered for: Failure
Sending email for trigger: Failure
###################################################################################
############################## FAILED TESTS (if any) ##############################
2 tests failed.
FAILED: org.apache.hadoop.yarn.client.TestRMAdminCLI.testTransitionToActive
Error Message:
null
Stack Trace:
java.lang.UnsupportedOperationException: null
at java.util.AbstractList.remove(AbstractList.java:144)
at java.util.AbstractList$Itr.remove(AbstractList.java:360)
at java.util.AbstractCollection.remove(AbstractCollection.java:252)
at org.apache.hadoop.ha.HAAdmin.isOtherTargetNodeActive(HAAdmin.java:173)
at org.apache.hadoop.ha.HAAdmin.transitionToActive(HAAdmin.java:144)
at org.apache.hadoop.ha.HAAdmin.runCmd(HAAdmin.java:447)
at org.apache.hadoop.ha.HAAdmin.run(HAAdmin.java:380)
at org.apache.hadoop.yarn.client.cli.RMAdminCLI.run(RMAdminCLI.java:318)
at org.apache.hadoop.yarn.client.TestRMAdminCLI.testTransitionToActive(TestRMAdminCLI.java:180)
FAILED: org.apache.hadoop.yarn.client.TestRMAdminCLI.testHelp
Error Message:
null
Stack Trace:
java.lang.AssertionError: null
at org.junit.Assert.fail(Assert.java:86)
at org.junit.Assert.assertTrue(Assert.java:41)
at org.junit.Assert.assertTrue(Assert.java:52)
at org.apache.hadoop.yarn.client.TestRMAdminCLI.testError(TestRMAdminCLI.java:366)
at org.apache.hadoop.yarn.client.TestRMAdminCLI.testHelp(TestRMAdminCLI.java:307)