You are viewing a plain text version of this content. The canonical link for it is here.
Posted to builds@hbase.apache.org by Apache Jenkins Server <je...@builds.apache.org> on 2015/10/03 02:49:43 UTC
Build failed in Jenkins: HBase-1.1 #691
See <https://builds.apache.org/job/HBase-1.1/691/changes>
Changes:
[stack] HBASE-14538 Remove TestVisibilityLabelsWithDistributedLogReplay, a test
------------------------------------------
[...truncated 2123 lines...]
Tests run: 1, Failures: 0, Errors: 0, Skipped: 0, Time elapsed: 0.346 sec - in org.apache.hadoop.hbase.ipc.TestHBaseClient
Running org.apache.hadoop.hbase.ipc.TestProtoBufRpc
Tests run: 1, Failures: 0, Errors: 0, Skipped: 0, Time elapsed: 1.565 sec - in org.apache.hadoop.hbase.ipc.TestProtoBufRpc
Running org.apache.hadoop.hbase.TestJMXListener
Tests run: 8, Failures: 0, Errors: 0, Skipped: 0, Time elapsed: 108.988 sec - in org.apache.hadoop.hbase.security.access.TestCellACLWithMultipleVersions
Running org.apache.hadoop.hbase.TestGlobalMemStoreSize
Tests run: 2, Failures: 0, Errors: 0, Skipped: 0, Time elapsed: 16.756 sec - in org.apache.hadoop.hbase.TestJMXListener
Tests run: 1, Failures: 0, Errors: 0, Skipped: 0, Time elapsed: 43.556 sec - in org.apache.hadoop.hbase.TestFullLogReconstruction
Running org.apache.hadoop.hbase.constraint.TestConstraint
Tests run: 1, Failures: 0, Errors: 0, Skipped: 0, Time elapsed: 18.225 sec - in org.apache.hadoop.hbase.TestGlobalMemStoreSize
Running org.apache.hadoop.hbase.io.hfile.TestHFileBlockIndex
Running org.apache.hadoop.hbase.trace.TestHTraceHooks
Tests run: 6, Failures: 0, Errors: 0, Skipped: 0, Time elapsed: 72.263 sec - in org.apache.hadoop.hbase.security.access.TestAccessController2
Running org.apache.hadoop.hbase.io.hfile.TestHFileSeek
Tests run: 1, Failures: 0, Errors: 0, Skipped: 0, Time elapsed: 4.248 sec - in org.apache.hadoop.hbase.trace.TestHTraceHooks
Tests run: 1, Failures: 0, Errors: 0, Skipped: 0, Time elapsed: 1.736 sec - in org.apache.hadoop.hbase.io.hfile.TestHFileSeek
Running org.apache.hadoop.hbase.io.hfile.TestForceCacheImportantBlocks
Running org.apache.hadoop.hbase.io.hfile.TestCacheConfig
Tests run: 6, Failures: 0, Errors: 0, Skipped: 0, Time elapsed: 1.481 sec - in org.apache.hadoop.hbase.io.hfile.TestCacheConfig
Tests run: 10, Failures: 0, Errors: 0, Skipped: 0, Time elapsed: 10.068 sec - in org.apache.hadoop.hbase.io.hfile.TestHFileBlockIndex
Running org.apache.hadoop.hbase.io.hfile.TestCacheOnWrite
Running org.apache.hadoop.hbase.io.hfile.TestScannerSelectionUsingTTL
Tests run: 5, Failures: 0, Errors: 0, Skipped: 0, Time elapsed: 35.906 sec - in org.apache.hadoop.hbase.constraint.TestConstraint
Running org.apache.hadoop.hbase.io.hfile.TestHFileBlock
Tests run: 56, Failures: 0, Errors: 0, Skipped: 0, Time elapsed: 146.328 sec - in org.apache.hadoop.hbase.security.access.TestAccessController
Tests run: 4, Failures: 0, Errors: 0, Skipped: 0, Time elapsed: 42.017 sec - in org.apache.hadoop.hbase.io.hfile.TestForceCacheImportantBlocks
Running org.apache.hadoop.hbase.io.TestFileLink
Running org.apache.hadoop.hbase.io.encoding.TestEncodedSeekers
Tests run: 5, Failures: 0, Errors: 0, Skipped: 0, Time elapsed: 13.715 sec - in org.apache.hadoop.hbase.io.TestFileLink
Tests run: 6, Failures: 0, Errors: 0, Skipped: 0, Time elapsed: 64.187 sec - in org.apache.hadoop.hbase.io.hfile.TestScannerSelectionUsingTTL
Running org.apache.hadoop.hbase.io.encoding.TestDataBlockEncoders
Running org.apache.hadoop.hbase.io.encoding.TestChangingEncoding
Tests run: 28, Failures: 0, Errors: 0, Skipped: 0, Time elapsed: 93.837 sec - in org.apache.hadoop.hbase.io.hfile.TestHFileBlock
Running org.apache.hadoop.hbase.io.encoding.TestBufferedDataBlockEncoder
Tests run: 1, Failures: 0, Errors: 0, Skipped: 0, Time elapsed: 9.62 sec - in org.apache.hadoop.hbase.io.encoding.TestBufferedDataBlockEncoder
Running org.apache.hadoop.hbase.io.encoding.TestLoadAndSwitchEncodeOnDisk
Tests run: 72, Failures: 0, Errors: 0, Skipped: 0, Time elapsed: 135.49 sec - in org.apache.hadoop.hbase.io.hfile.TestCacheOnWrite
Running org.apache.hadoop.hbase.TestRegionRebalancing
Tests run: 1, Failures: 0, Errors: 0, Skipped: 0, Time elapsed: 34.07 sec - in org.apache.hadoop.hbase.io.encoding.TestLoadAndSwitchEncodeOnDisk
Tests run: 20, Failures: 0, Errors: 0, Skipped: 0, Time elapsed: 119.488 sec - in org.apache.hadoop.hbase.io.encoding.TestEncodedSeekers
Running org.apache.hadoop.hbase.TestHColumnDescriptorDefaultVersions
Tests run: 2, Failures: 0, Errors: 0, Skipped: 0, Time elapsed: 46.561 sec - in org.apache.hadoop.hbase.TestRegionRebalancing
Running org.apache.hadoop.hbase.mapred.TestTableMapReduceUtil
Tests run: 3, Failures: 0, Errors: 0, Skipped: 0, Time elapsed: 39.639 sec - in org.apache.hadoop.hbase.TestHColumnDescriptorDefaultVersions
Running org.apache.hadoop.hbase.mapred.TestTableInputFormat
Running org.apache.hadoop.hbase.mapred.TestTableMapReduce
Tests run: 28, Failures: 0, Errors: 0, Skipped: 0, Time elapsed: 176.927 sec - in org.apache.hadoop.hbase.io.encoding.TestDataBlockEncoders
Running org.apache.hadoop.hbase.mapred.TestTableSnapshotInputFormat
Tests run: 4, Failures: 0, Errors: 0, Skipped: 0, Time elapsed: 83.493 sec - in org.apache.hadoop.hbase.mapred.TestTableMapReduceUtil
Running org.apache.hadoop.hbase.replication.TestReplicationTrackerZKImpl
Tests run: 5, Failures: 0, Errors: 0, Skipped: 0, Time elapsed: 1.4 sec - in org.apache.hadoop.hbase.replication.TestReplicationTrackerZKImpl
Tests run: 3, Failures: 0, Errors: 0, Skipped: 0, Time elapsed: 234.294 sec - in org.apache.hadoop.hbase.io.encoding.TestChangingEncoding
Tests run: 8, Failures: 0, Errors: 0, Skipped: 0, Time elapsed: 95.035 sec - in org.apache.hadoop.hbase.mapred.TestTableInputFormat
Running org.apache.hadoop.hbase.replication.TestReplicationEndpoint
Tests run: 3, Failures: 0, Errors: 0, Skipped: 0, Time elapsed: 4.205 sec - in org.apache.hadoop.hbase.replication.TestReplicationEndpoint
Running org.apache.hadoop.hbase.replication.TestReplicationDisableInactivePeer
Tests run: 2, Failures: 0, Errors: 0, Skipped: 0, Time elapsed: 99.866 sec - in org.apache.hadoop.hbase.mapred.TestTableMapReduce
Running org.apache.hadoop.hbase.replication.TestReplicationKillMasterRSCompressed
Running org.apache.hadoop.hbase.replication.TestPerTableCFReplication
Running org.apache.hadoop.hbase.replication.regionserver.TestReplicationSink
Tests run: 1, Failures: 0, Errors: 0, Skipped: 0, Time elapsed: 23.114 sec - in org.apache.hadoop.hbase.replication.TestReplicationDisableInactivePeer
Tests run: 5, Failures: 0, Errors: 0, Skipped: 0, Time elapsed: 2.481 sec - in org.apache.hadoop.hbase.replication.regionserver.TestReplicationSink
Running org.apache.hadoop.hbase.replication.regionserver.TestReplicationSourceManager
Tests run: 1, Failures: 0, Errors: 0, Skipped: 0, Time elapsed: 24.2 sec - in org.apache.hadoop.hbase.replication.TestReplicationKillMasterRSCompressed
Tests run: 5, Failures: 0, Errors: 0, Skipped: 0, Time elapsed: 4.671 sec - in org.apache.hadoop.hbase.replication.regionserver.TestReplicationSourceManager
Running org.apache.hadoop.hbase.replication.regionserver.TestRegionReplicaReplicationEndpoint
Running org.apache.hadoop.hbase.replication.regionserver.TestReplicationWALReaderManager
Running org.apache.hadoop.hbase.replication.regionserver.TestRegionReplicaReplicationEndpointNoMaster
Tests run: 2, Failures: 0, Errors: 0, Skipped: 0, Time elapsed: 44.153 sec - in org.apache.hadoop.hbase.replication.TestPerTableCFReplication
Running org.apache.hadoop.hbase.replication.TestReplicationSource
Tests run: 1, Failures: 0, Errors: 0, Skipped: 0, Time elapsed: 0.593 sec - in org.apache.hadoop.hbase.replication.TestReplicationSource
Tests run: 4, Failures: 0, Errors: 0, Skipped: 0, Time elapsed: 42.632 sec - in org.apache.hadoop.hbase.replication.regionserver.TestRegionReplicaReplicationEndpointNoMaster
Running org.apache.hadoop.hbase.replication.TestReplicationChangingPeerRegionservers
Tests run: 1, Failures: 0, Errors: 0, Skipped: 0, Time elapsed: 6.103 sec - in org.apache.hadoop.hbase.replication.TestReplicationChangingPeerRegionservers
Running org.apache.hadoop.hbase.replication.TestReplicationSyncUpTool
Running org.apache.hadoop.hbase.replication.TestReplicationKillMasterRS
Tests run: 1, Failures: 0, Errors: 0, Skipped: 0, Time elapsed: 26.146 sec - in org.apache.hadoop.hbase.replication.TestReplicationKillMasterRS
Running org.apache.hadoop.hbase.replication.TestMultiSlaveReplication
Tests run: 9, Failures: 0, Errors: 0, Skipped: 0, Time elapsed: 137.899 sec - in org.apache.hadoop.hbase.replication.regionserver.TestRegionReplicaReplicationEndpoint
Tests run: 1, Failures: 0, Errors: 0, Skipped: 0, Time elapsed: 67.988 sec - in org.apache.hadoop.hbase.replication.TestReplicationSyncUpTool
Tests run: 1, Failures: 0, Errors: 0, Skipped: 0, Time elapsed: 43.775 sec - in org.apache.hadoop.hbase.replication.TestMultiSlaveReplication
Running org.apache.hadoop.hbase.replication.TestReplicationStateZKImpl
Running org.apache.hadoop.hbase.replication.TestReplicationWithTags
Tests run: 6, Failures: 0, Errors: 0, Skipped: 0, Time elapsed: 2.4 sec - in org.apache.hadoop.hbase.replication.TestReplicationStateZKImpl
Tests run: 1, Failures: 0, Errors: 0, Skipped: 0, Time elapsed: 3.448 sec - in org.apache.hadoop.hbase.replication.TestReplicationWithTags
Running org.apache.hadoop.hbase.replication.TestMasterReplication
Running org.apache.hadoop.hbase.replication.TestReplicationKillSlaveRS
Running org.apache.hadoop.hbase.replication.TestReplicationSmallTests
Tests run: 1, Failures: 0, Errors: 0, Skipped: 0, Time elapsed: 23.133 sec - in org.apache.hadoop.hbase.replication.TestReplicationKillSlaveRS
Running org.apache.hadoop.hbase.util.TestMergeTool
Tests run: 7, Failures: 0, Errors: 0, Skipped: 0, Time elapsed: 356.709 sec - in org.apache.hadoop.hbase.mapred.TestTableSnapshotInputFormat
Running org.apache.hadoop.hbase.util.TestFSTableDescriptors
Tests run: 1, Failures: 0, Errors: 0, Skipped: 0, Time elapsed: 23.87 sec - in org.apache.hadoop.hbase.util.TestMergeTool
Running org.apache.hadoop.hbase.util.TestConnectionCache
Tests run: 15, Failures: 0, Errors: 0, Skipped: 0, Time elapsed: 4.488 sec - in org.apache.hadoop.hbase.util.TestFSTableDescriptors
Running org.apache.hadoop.hbase.util.TestHBaseFsckEncryption
Tests run: 1, Failures: 0, Errors: 0, Skipped: 0, Time elapsed: 20.744 sec - in org.apache.hadoop.hbase.util.TestConnectionCache
Tests run: 1, Failures: 0, Errors: 0, Skipped: 0, Time elapsed: 19.52 sec - in org.apache.hadoop.hbase.util.TestHBaseFsckEncryption
Running org.apache.hadoop.hbase.util.TestIdLock
Running org.apache.hadoop.hbase.util.TestMiniClusterLoadSequential
Tests run: 1, Failures: 0, Errors: 0, Skipped: 0, Time elapsed: 15.34 sec - in org.apache.hadoop.hbase.util.TestIdLock
Tests run: 10, Failures: 0, Errors: 0, Skipped: 0, Time elapsed: 72.586 sec - in org.apache.hadoop.hbase.replication.TestReplicationSmallTests
Running org.apache.hadoop.hbase.util.TestMergeTable
Running org.apache.hadoop.hbase.util.TestMiniClusterLoadParallel
Tests run: 3, Failures: 0, Errors: 0, Skipped: 0, Time elapsed: 114.814 sec - in org.apache.hadoop.hbase.replication.TestMasterReplication
Running org.apache.hadoop.hbase.util.TestHBaseFsck
Tests run: 8, Failures: 0, Errors: 0, Skipped: 0, Time elapsed: 302.932 sec - in org.apache.hadoop.hbase.replication.regionserver.TestReplicationWALReaderManager
Running org.apache.hadoop.hbase.util.TestFSUtils
Tests run: 1, Failures: 0, Errors: 0, Skipped: 0, Time elapsed: 31.747 sec - in org.apache.hadoop.hbase.util.TestMergeTable
Running org.apache.hadoop.hbase.util.TestRegionSplitter
Tests run: 4, Failures: 0, Errors: 0, Skipped: 0, Time elapsed: 64.454 sec - in org.apache.hadoop.hbase.util.TestMiniClusterLoadSequential
Running org.apache.hadoop.hbase.util.TestProcessBasedCluster
Tests run: 10, Failures: 0, Errors: 0, Skipped: 0, Time elapsed: 24.339 sec - in org.apache.hadoop.hbase.util.TestFSUtils
Tests run: 1, Failures: 0, Errors: 0, Skipped: 0, Time elapsed: 0.837 sec - in org.apache.hadoop.hbase.util.TestProcessBasedCluster
Running org.apache.hadoop.hbase.util.TestTableName
Tests run: 6, Failures: 0, Errors: 0, Skipped: 0, Time elapsed: 0.469 sec - in org.apache.hadoop.hbase.util.TestTableName
Running org.apache.hadoop.hbase.util.TestMiniClusterLoadEncoded
Tests run: 6, Failures: 0, Errors: 0, Skipped: 0, Time elapsed: 10.726 sec - in org.apache.hadoop.hbase.util.TestRegionSplitter
Running org.apache.hadoop.hbase.util.TestFSVisitor
Tests run: 3, Failures: 0, Errors: 0, Skipped: 0, Time elapsed: 5.976 sec - in org.apache.hadoop.hbase.util.TestFSVisitor
Running org.apache.hadoop.hbase.util.hbck.TestOfflineMetaRebuildBase
Running org.apache.hadoop.hbase.util.TestCoprocessorScanPolicy
Tests run: 4, Failures: 0, Errors: 0, Skipped: 0, Time elapsed: 71.482 sec - in org.apache.hadoop.hbase.util.TestMiniClusterLoadParallel
Running org.apache.hadoop.hbase.util.hbck.TestOfflineMetaRebuildOverlap
Tests run: 4, Failures: 0, Errors: 0, Skipped: 0, Time elapsed: 22.223 sec - in org.apache.hadoop.hbase.util.TestCoprocessorScanPolicy
Running org.apache.hadoop.hbase.util.hbck.TestOfflineMetaRebuildHole
Tests run: 1, Failures: 0, Errors: 0, Skipped: 0, Time elapsed: 32.322 sec - in org.apache.hadoop.hbase.util.hbck.TestOfflineMetaRebuildBase
Running org.apache.hadoop.hbase.util.TestDefaultEnvironmentEdge
Tests run: 1, Failures: 0, Errors: 0, Skipped: 0, Time elapsed: 0.325 sec - in org.apache.hadoop.hbase.util.TestDefaultEnvironmentEdge
Running org.apache.hadoop.hbase.util.TestFSHDFSUtils
Tests run: 1, Failures: 0, Errors: 0, Skipped: 0, Time elapsed: 29.664 sec - in org.apache.hadoop.hbase.util.hbck.TestOfflineMetaRebuildOverlap
Tests run: 3, Failures: 0, Errors: 0, Skipped: 0, Time elapsed: 8.183 sec - in org.apache.hadoop.hbase.util.TestFSHDFSUtils
Running org.apache.hadoop.hbase.TestMetaTableAccessorNoCluster
Tests run: 2, Failures: 0, Errors: 0, Skipped: 0, Time elapsed: 3.43 sec - in org.apache.hadoop.hbase.TestMetaTableAccessorNoCluster
Tests run: 1, Failures: 0, Errors: 0, Skipped: 0, Time elapsed: 28.474 sec - in org.apache.hadoop.hbase.util.hbck.TestOfflineMetaRebuildHole
Running org.apache.hadoop.hbase.migration.TestUpgradeTo96
Tests run: 5, Failures: 0, Errors: 0, Skipped: 0, Time elapsed: 75.563 sec - in org.apache.hadoop.hbase.util.TestMiniClusterLoadEncoded
Tests run: 5, Failures: 0, Errors: 0, Skipped: 0, Time elapsed: 3.571 sec - in org.apache.hadoop.hbase.migration.TestUpgradeTo96
Running org.apache.hadoop.hbase.TestNamespace
Running org.apache.hadoop.hbase.migration.TestNamespaceUpgrade
Running org.apache.hadoop.hbase.TestMetaTableAccessor
Running org.apache.hadoop.hbase.TestInfoServers
Tests run: 3, Failures: 0, Errors: 0, Skipped: 0, Time elapsed: 5.817 sec - in org.apache.hadoop.hbase.TestInfoServers
Tests run: 5, Failures: 0, Errors: 0, Skipped: 0, Time elapsed: 31.761 sec - in org.apache.hadoop.hbase.migration.TestNamespaceUpgrade
Tests run: 13, Failures: 0, Errors: 0, Skipped: 0, Time elapsed: 26.799 sec - in org.apache.hadoop.hbase.TestMetaTableAccessor
Tests run: 9, Failures: 0, Errors: 0, Skipped: 1, Time elapsed: 52.083 sec - in org.apache.hadoop.hbase.TestNamespace
Tests run: 51, Failures: 0, Errors: 0, Skipped: 1, Time elapsed: 549.859 sec - in org.apache.hadoop.hbase.util.TestHBaseFsck
Results :
Tests in error:
org.apache.hadoop.hbase.regionserver.TestWALLockup.testLockupWhenSyncInMiddleOfZigZagSetup(org.apache.hadoop.hbase.regionserver.TestWALLockup)
Run 1: TestWALLockup.testLockupWhenSyncInMiddleOfZigZagSetup ? DamagedWAL On sync
Run 2: TestWALLockup.testLockupWhenSyncInMiddleOfZigZagSetup:254 ? TestTimedOut test ...
Run 3: TestWALLockup.testLockupWhenSyncInMiddleOfZigZagSetup:254 ? TestTimedOut test ...
Flaked tests:
org.apache.hadoop.hbase.mapreduce.TestLoadIncrementalHFiles.testRegionCrossingHFileSplit(org.apache.hadoop.hbase.mapreduce.TestLoadIncrementalHFiles)
Run 1: TestLoadIncrementalHFiles.testRegionCrossingHFileSplit:173->testRegionCrossingHFileSplit:195->runTest:223->runTest:232->runTest:285 ? TestTimedOut
Run 2: PASS
Tests run: 2497, Failures: 0, Errors: 1, Skipped: 21, Flakes: 1
[INFO] ------------------------------------------------------------------------
[INFO] Reactor Summary:
[INFO]
[INFO] Apache HBase ...................................... SUCCESS [8.077s]
[INFO] Apache HBase - Checkstyle ......................... SUCCESS [1.378s]
[INFO] Apache HBase - Resource Bundle .................... SUCCESS [0.270s]
[INFO] Apache HBase - Annotations ........................ SUCCESS [1.127s]
[INFO] Apache HBase - Protocol ........................... SUCCESS [12.451s]
[INFO] Apache HBase - Common ............................. SUCCESS [1:29.561s]
[INFO] Apache HBase - Procedure .......................... SUCCESS [1:09.523s]
[INFO] Apache HBase - Client ............................. SUCCESS [1:22.097s]
[INFO] Apache HBase - Hadoop Compatibility ............... SUCCESS [7.598s]
[INFO] Apache HBase - Hadoop Two Compatibility ........... SUCCESS [6.758s]
[INFO] Apache HBase - Prefix Tree ........................ SUCCESS [8.305s]
[INFO] Apache HBase - Server ............................. FAILURE [1:59:54.664s]
[INFO] Apache HBase - Testing Util ....................... SKIPPED
[INFO] Apache HBase - Thrift ............................. SKIPPED
[INFO] Apache HBase - Rest ............................... SKIPPED
[INFO] Apache HBase - Shell .............................. SKIPPED
[INFO] Apache HBase - Integration Tests .................. SKIPPED
[INFO] Apache HBase - Examples ........................... SKIPPED
[INFO] Apache HBase - Assembly ........................... SKIPPED
[INFO] Apache HBase - Shaded ............................. SKIPPED
[INFO] Apache HBase - Shaded - Client .................... SKIPPED
[INFO] Apache HBase - Shaded - Server .................... SKIPPED
[INFO] ------------------------------------------------------------------------
[INFO] BUILD FAILURE
[INFO] ------------------------------------------------------------------------
[INFO] Total time: 2:04:44.657s
[INFO] Finished at: Sat Oct 03 00:46:58 UTC 2015
[INFO] Final Memory: 58M/1253M
[INFO] ------------------------------------------------------------------------
[ERROR] Failed to execute goal org.apache.maven.plugins:maven-surefire-plugin:2.18.1:test (secondPartTestsExecution) on project hbase-server: There are test failures.
[ERROR]
[ERROR] Please refer to /x1/jenkins/jenkins-slave/workspace/HBase-1.1/hbase-server/target/surefire-reports for the individual test results.
[ERROR] -> [Help 1]
[ERROR]
[ERROR] To see the full stack trace of the errors, re-run Maven with the -e switch.
[ERROR] Re-run Maven using the -X switch to enable full debug logging.
[ERROR]
[ERROR] For more information about the errors and possible solutions, please read the following articles:
[ERROR] [Help 1] http://cwiki.apache.org/confluence/display/MAVEN/MojoFailureException
[ERROR]
[ERROR] After correcting the problems, you can resume the build with the command
[ERROR] mvn <goals> -rf :hbase-server
Build step 'Invoke top-level Maven targets' marked build as failure
Performing Post build task...
Match found for :.* : True
Logical operation result is TRUE
Running script : ZOMBIE_TESTS_COUNT=`jps | grep surefirebooter | wc -l`
if [[ $ZOMBIE_TESTS_COUNT != 0 ]] ; then
#It seems sometimes the tests are not dying immediately. Let's give them 10s
echo "Suspicious java process found - waiting 10s to see if there are just slow to stop"
sleep 10
ZOMBIE_TESTS_COUNT=`jps | grep surefirebooter | wc -l`
if [[ $ZOMBIE_TESTS_COUNT != 0 ]] ; then
echo "There are $ZOMBIE_TESTS_COUNT zombie tests, they should have been killed by surefire but survived"
echo "************ BEGIN zombies jstack extract"
ZB_STACK=`jps | grep surefirebooter | cut -d ' ' -f 1 | xargs -n 1 jstack | grep ".test" | grep "\.java"`
jps | grep surefirebooter | cut -d ' ' -f 1 | xargs -n 1 jstack
echo "************ END zombies jstack extract"
JIRA_COMMENT="$JIRA_COMMENT
{color:red}-1 core zombie tests{color}. There are ${ZOMBIE_TESTS_COUNT} zombie test(s): ${ZB_STACK}"
BAD=1
jps | grep surefirebooter | cut -d ' ' -f 1 | xargs kill -9
else
echo "We're ok: there is no zombie test, but some tests took some time to stop"
fi
else
echo "We're ok: there is no zombie test"
fi
[HBase-1.1] $ /bin/bash -xe /tmp/hudson5050581489796808783.sh
++ wc -l
++ grep surefirebooter
++ jps
+ ZOMBIE_TESTS_COUNT=0
+ [[ 0 != 0 ]]
+ echo 'We'\''re ok: there is no zombie test'
We're ok: there is no zombie test
POST BUILD TASK : SUCCESS
END OF POST BUILD TASK : 0
Archiving artifacts
Recording test results
Updating HBASE-14538
Jenkins build is back to normal : HBase-1.1 #692
Posted by Apache Jenkins Server <je...@builds.apache.org>.
See <https://builds.apache.org/job/HBase-1.1/692/changes>
Re: Build failed in Jenkins: HBase-1.1 #691
Posted by Stack <st...@duboce.net>.
This is TestWALLockup.. Let me dig in.
On Fri, Oct 2, 2015 at 5:49 PM, Apache Jenkins Server <
jenkins@builds.apache.org> wrote:
> See <https://builds.apache.org/job/HBase-1.1/691/changes>
>
> Changes:
>
> [stack] HBASE-14538 Remove TestVisibilityLabelsWithDistributedLogReplay, a
> test
>
> ------------------------------------------
> [...truncated 2123 lines...]
> Tests run: 1, Failures: 0, Errors: 0, Skipped: 0, Time elapsed: 0.346 sec
> - in org.apache.hadoop.hbase.ipc.TestHBaseClient
> Running org.apache.hadoop.hbase.ipc.TestProtoBufRpc
> Tests run: 1, Failures: 0, Errors: 0, Skipped: 0, Time elapsed: 1.565 sec
> - in org.apache.hadoop.hbase.ipc.TestProtoBufRpc
> Running org.apache.hadoop.hbase.TestJMXListener
> Tests run: 8, Failures: 0, Errors: 0, Skipped: 0, Time elapsed: 108.988
> sec - in
> org.apache.hadoop.hbase.security.access.TestCellACLWithMultipleVersions
> Running org.apache.hadoop.hbase.TestGlobalMemStoreSize
> Tests run: 2, Failures: 0, Errors: 0, Skipped: 0, Time elapsed: 16.756 sec
> - in org.apache.hadoop.hbase.TestJMXListener
> Tests run: 1, Failures: 0, Errors: 0, Skipped: 0, Time elapsed: 43.556 sec
> - in org.apache.hadoop.hbase.TestFullLogReconstruction
> Running org.apache.hadoop.hbase.constraint.TestConstraint
> Tests run: 1, Failures: 0, Errors: 0, Skipped: 0, Time elapsed: 18.225 sec
> - in org.apache.hadoop.hbase.TestGlobalMemStoreSize
> Running org.apache.hadoop.hbase.io.hfile.TestHFileBlockIndex
> Running org.apache.hadoop.hbase.trace.TestHTraceHooks
> Tests run: 6, Failures: 0, Errors: 0, Skipped: 0, Time elapsed: 72.263 sec
> - in org.apache.hadoop.hbase.security.access.TestAccessController2
> Running org.apache.hadoop.hbase.io.hfile.TestHFileSeek
> Tests run: 1, Failures: 0, Errors: 0, Skipped: 0, Time elapsed: 4.248 sec
> - in org.apache.hadoop.hbase.trace.TestHTraceHooks
> Tests run: 1, Failures: 0, Errors: 0, Skipped: 0, Time elapsed: 1.736 sec
> - in org.apache.hadoop.hbase.io.hfile.TestHFileSeek
> Running org.apache.hadoop.hbase.io.hfile.TestForceCacheImportantBlocks
> Running org.apache.hadoop.hbase.io.hfile.TestCacheConfig
> Tests run: 6, Failures: 0, Errors: 0, Skipped: 0, Time elapsed: 1.481 sec
> - in org.apache.hadoop.hbase.io.hfile.TestCacheConfig
> Tests run: 10, Failures: 0, Errors: 0, Skipped: 0, Time elapsed: 10.068
> sec - in org.apache.hadoop.hbase.io.hfile.TestHFileBlockIndex
> Running org.apache.hadoop.hbase.io.hfile.TestCacheOnWrite
> Running org.apache.hadoop.hbase.io.hfile.TestScannerSelectionUsingTTL
> Tests run: 5, Failures: 0, Errors: 0, Skipped: 0, Time elapsed: 35.906 sec
> - in org.apache.hadoop.hbase.constraint.TestConstraint
> Running org.apache.hadoop.hbase.io.hfile.TestHFileBlock
> Tests run: 56, Failures: 0, Errors: 0, Skipped: 0, Time elapsed: 146.328
> sec - in org.apache.hadoop.hbase.security.access.TestAccessController
> Tests run: 4, Failures: 0, Errors: 0, Skipped: 0, Time elapsed: 42.017 sec
> - in org.apache.hadoop.hbase.io.hfile.TestForceCacheImportantBlocks
> Running org.apache.hadoop.hbase.io.TestFileLink
> Running org.apache.hadoop.hbase.io.encoding.TestEncodedSeekers
> Tests run: 5, Failures: 0, Errors: 0, Skipped: 0, Time elapsed: 13.715 sec
> - in org.apache.hadoop.hbase.io.TestFileLink
> Tests run: 6, Failures: 0, Errors: 0, Skipped: 0, Time elapsed: 64.187 sec
> - in org.apache.hadoop.hbase.io.hfile.TestScannerSelectionUsingTTL
> Running org.apache.hadoop.hbase.io.encoding.TestDataBlockEncoders
> Running org.apache.hadoop.hbase.io.encoding.TestChangingEncoding
> Tests run: 28, Failures: 0, Errors: 0, Skipped: 0, Time elapsed: 93.837
> sec - in org.apache.hadoop.hbase.io.hfile.TestHFileBlock
> Running org.apache.hadoop.hbase.io.encoding.TestBufferedDataBlockEncoder
> Tests run: 1, Failures: 0, Errors: 0, Skipped: 0, Time elapsed: 9.62 sec -
> in org.apache.hadoop.hbase.io.encoding.TestBufferedDataBlockEncoder
> Running org.apache.hadoop.hbase.io.encoding.TestLoadAndSwitchEncodeOnDisk
> Tests run: 72, Failures: 0, Errors: 0, Skipped: 0, Time elapsed: 135.49
> sec - in org.apache.hadoop.hbase.io.hfile.TestCacheOnWrite
> Running org.apache.hadoop.hbase.TestRegionRebalancing
> Tests run: 1, Failures: 0, Errors: 0, Skipped: 0, Time elapsed: 34.07 sec
> - in org.apache.hadoop.hbase.io.encoding.TestLoadAndSwitchEncodeOnDisk
> Tests run: 20, Failures: 0, Errors: 0, Skipped: 0, Time elapsed: 119.488
> sec - in org.apache.hadoop.hbase.io.encoding.TestEncodedSeekers
> Running org.apache.hadoop.hbase.TestHColumnDescriptorDefaultVersions
> Tests run: 2, Failures: 0, Errors: 0, Skipped: 0, Time elapsed: 46.561 sec
> - in org.apache.hadoop.hbase.TestRegionRebalancing
> Running org.apache.hadoop.hbase.mapred.TestTableMapReduceUtil
> Tests run: 3, Failures: 0, Errors: 0, Skipped: 0, Time elapsed: 39.639 sec
> - in org.apache.hadoop.hbase.TestHColumnDescriptorDefaultVersions
> Running org.apache.hadoop.hbase.mapred.TestTableInputFormat
> Running org.apache.hadoop.hbase.mapred.TestTableMapReduce
> Tests run: 28, Failures: 0, Errors: 0, Skipped: 0, Time elapsed: 176.927
> sec - in org.apache.hadoop.hbase.io.encoding.TestDataBlockEncoders
> Running org.apache.hadoop.hbase.mapred.TestTableSnapshotInputFormat
> Tests run: 4, Failures: 0, Errors: 0, Skipped: 0, Time elapsed: 83.493 sec
> - in org.apache.hadoop.hbase.mapred.TestTableMapReduceUtil
> Running org.apache.hadoop.hbase.replication.TestReplicationTrackerZKImpl
> Tests run: 5, Failures: 0, Errors: 0, Skipped: 0, Time elapsed: 1.4 sec -
> in org.apache.hadoop.hbase.replication.TestReplicationTrackerZKImpl
> Tests run: 3, Failures: 0, Errors: 0, Skipped: 0, Time elapsed: 234.294
> sec - in org.apache.hadoop.hbase.io.encoding.TestChangingEncoding
> Tests run: 8, Failures: 0, Errors: 0, Skipped: 0, Time elapsed: 95.035 sec
> - in org.apache.hadoop.hbase.mapred.TestTableInputFormat
> Running org.apache.hadoop.hbase.replication.TestReplicationEndpoint
> Tests run: 3, Failures: 0, Errors: 0, Skipped: 0, Time elapsed: 4.205 sec
> - in org.apache.hadoop.hbase.replication.TestReplicationEndpoint
> Running
> org.apache.hadoop.hbase.replication.TestReplicationDisableInactivePeer
> Tests run: 2, Failures: 0, Errors: 0, Skipped: 0, Time elapsed: 99.866 sec
> - in org.apache.hadoop.hbase.mapred.TestTableMapReduce
> Running
> org.apache.hadoop.hbase.replication.TestReplicationKillMasterRSCompressed
> Running org.apache.hadoop.hbase.replication.TestPerTableCFReplication
> Running
> org.apache.hadoop.hbase.replication.regionserver.TestReplicationSink
> Tests run: 1, Failures: 0, Errors: 0, Skipped: 0, Time elapsed: 23.114 sec
> - in org.apache.hadoop.hbase.replication.TestReplicationDisableInactivePeer
> Tests run: 5, Failures: 0, Errors: 0, Skipped: 0, Time elapsed: 2.481 sec
> - in org.apache.hadoop.hbase.replication.regionserver.TestReplicationSink
> Running
> org.apache.hadoop.hbase.replication.regionserver.TestReplicationSourceManager
> Tests run: 1, Failures: 0, Errors: 0, Skipped: 0, Time elapsed: 24.2 sec -
> in org.apache.hadoop.hbase.replication.TestReplicationKillMasterRSCompressed
> Tests run: 5, Failures: 0, Errors: 0, Skipped: 0, Time elapsed: 4.671 sec
> - in
> org.apache.hadoop.hbase.replication.regionserver.TestReplicationSourceManager
> Running
> org.apache.hadoop.hbase.replication.regionserver.TestRegionReplicaReplicationEndpoint
> Running
> org.apache.hadoop.hbase.replication.regionserver.TestReplicationWALReaderManager
> Running
> org.apache.hadoop.hbase.replication.regionserver.TestRegionReplicaReplicationEndpointNoMaster
> Tests run: 2, Failures: 0, Errors: 0, Skipped: 0, Time elapsed: 44.153 sec
> - in org.apache.hadoop.hbase.replication.TestPerTableCFReplication
> Running org.apache.hadoop.hbase.replication.TestReplicationSource
> Tests run: 1, Failures: 0, Errors: 0, Skipped: 0, Time elapsed: 0.593 sec
> - in org.apache.hadoop.hbase.replication.TestReplicationSource
> Tests run: 4, Failures: 0, Errors: 0, Skipped: 0, Time elapsed: 42.632 sec
> - in
> org.apache.hadoop.hbase.replication.regionserver.TestRegionReplicaReplicationEndpointNoMaster
> Running
> org.apache.hadoop.hbase.replication.TestReplicationChangingPeerRegionservers
> Tests run: 1, Failures: 0, Errors: 0, Skipped: 0, Time elapsed: 6.103 sec
> - in
> org.apache.hadoop.hbase.replication.TestReplicationChangingPeerRegionservers
> Running org.apache.hadoop.hbase.replication.TestReplicationSyncUpTool
> Running org.apache.hadoop.hbase.replication.TestReplicationKillMasterRS
> Tests run: 1, Failures: 0, Errors: 0, Skipped: 0, Time elapsed: 26.146 sec
> - in org.apache.hadoop.hbase.replication.TestReplicationKillMasterRS
> Running org.apache.hadoop.hbase.replication.TestMultiSlaveReplication
> Tests run: 9, Failures: 0, Errors: 0, Skipped: 0, Time elapsed: 137.899
> sec - in
> org.apache.hadoop.hbase.replication.regionserver.TestRegionReplicaReplicationEndpoint
> Tests run: 1, Failures: 0, Errors: 0, Skipped: 0, Time elapsed: 67.988 sec
> - in org.apache.hadoop.hbase.replication.TestReplicationSyncUpTool
> Tests run: 1, Failures: 0, Errors: 0, Skipped: 0, Time elapsed: 43.775 sec
> - in org.apache.hadoop.hbase.replication.TestMultiSlaveReplication
> Running org.apache.hadoop.hbase.replication.TestReplicationStateZKImpl
> Running org.apache.hadoop.hbase.replication.TestReplicationWithTags
> Tests run: 6, Failures: 0, Errors: 0, Skipped: 0, Time elapsed: 2.4 sec -
> in org.apache.hadoop.hbase.replication.TestReplicationStateZKImpl
> Tests run: 1, Failures: 0, Errors: 0, Skipped: 0, Time elapsed: 3.448 sec
> - in org.apache.hadoop.hbase.replication.TestReplicationWithTags
> Running org.apache.hadoop.hbase.replication.TestMasterReplication
> Running org.apache.hadoop.hbase.replication.TestReplicationKillSlaveRS
> Running org.apache.hadoop.hbase.replication.TestReplicationSmallTests
> Tests run: 1, Failures: 0, Errors: 0, Skipped: 0, Time elapsed: 23.133 sec
> - in org.apache.hadoop.hbase.replication.TestReplicationKillSlaveRS
> Running org.apache.hadoop.hbase.util.TestMergeTool
> Tests run: 7, Failures: 0, Errors: 0, Skipped: 0, Time elapsed: 356.709
> sec - in org.apache.hadoop.hbase.mapred.TestTableSnapshotInputFormat
> Running org.apache.hadoop.hbase.util.TestFSTableDescriptors
> Tests run: 1, Failures: 0, Errors: 0, Skipped: 0, Time elapsed: 23.87 sec
> - in org.apache.hadoop.hbase.util.TestMergeTool
> Running org.apache.hadoop.hbase.util.TestConnectionCache
> Tests run: 15, Failures: 0, Errors: 0, Skipped: 0, Time elapsed: 4.488 sec
> - in org.apache.hadoop.hbase.util.TestFSTableDescriptors
> Running org.apache.hadoop.hbase.util.TestHBaseFsckEncryption
> Tests run: 1, Failures: 0, Errors: 0, Skipped: 0, Time elapsed: 20.744 sec
> - in org.apache.hadoop.hbase.util.TestConnectionCache
> Tests run: 1, Failures: 0, Errors: 0, Skipped: 0, Time elapsed: 19.52 sec
> - in org.apache.hadoop.hbase.util.TestHBaseFsckEncryption
> Running org.apache.hadoop.hbase.util.TestIdLock
> Running org.apache.hadoop.hbase.util.TestMiniClusterLoadSequential
> Tests run: 1, Failures: 0, Errors: 0, Skipped: 0, Time elapsed: 15.34 sec
> - in org.apache.hadoop.hbase.util.TestIdLock
> Tests run: 10, Failures: 0, Errors: 0, Skipped: 0, Time elapsed: 72.586
> sec - in org.apache.hadoop.hbase.replication.TestReplicationSmallTests
> Running org.apache.hadoop.hbase.util.TestMergeTable
> Running org.apache.hadoop.hbase.util.TestMiniClusterLoadParallel
> Tests run: 3, Failures: 0, Errors: 0, Skipped: 0, Time elapsed: 114.814
> sec - in org.apache.hadoop.hbase.replication.TestMasterReplication
> Running org.apache.hadoop.hbase.util.TestHBaseFsck
> Tests run: 8, Failures: 0, Errors: 0, Skipped: 0, Time elapsed: 302.932
> sec - in
> org.apache.hadoop.hbase.replication.regionserver.TestReplicationWALReaderManager
> Running org.apache.hadoop.hbase.util.TestFSUtils
> Tests run: 1, Failures: 0, Errors: 0, Skipped: 0, Time elapsed: 31.747 sec
> - in org.apache.hadoop.hbase.util.TestMergeTable
> Running org.apache.hadoop.hbase.util.TestRegionSplitter
> Tests run: 4, Failures: 0, Errors: 0, Skipped: 0, Time elapsed: 64.454 sec
> - in org.apache.hadoop.hbase.util.TestMiniClusterLoadSequential
> Running org.apache.hadoop.hbase.util.TestProcessBasedCluster
> Tests run: 10, Failures: 0, Errors: 0, Skipped: 0, Time elapsed: 24.339
> sec - in org.apache.hadoop.hbase.util.TestFSUtils
> Tests run: 1, Failures: 0, Errors: 0, Skipped: 0, Time elapsed: 0.837 sec
> - in org.apache.hadoop.hbase.util.TestProcessBasedCluster
> Running org.apache.hadoop.hbase.util.TestTableName
> Tests run: 6, Failures: 0, Errors: 0, Skipped: 0, Time elapsed: 0.469 sec
> - in org.apache.hadoop.hbase.util.TestTableName
> Running org.apache.hadoop.hbase.util.TestMiniClusterLoadEncoded
> Tests run: 6, Failures: 0, Errors: 0, Skipped: 0, Time elapsed: 10.726 sec
> - in org.apache.hadoop.hbase.util.TestRegionSplitter
> Running org.apache.hadoop.hbase.util.TestFSVisitor
> Tests run: 3, Failures: 0, Errors: 0, Skipped: 0, Time elapsed: 5.976 sec
> - in org.apache.hadoop.hbase.util.TestFSVisitor
> Running org.apache.hadoop.hbase.util.hbck.TestOfflineMetaRebuildBase
> Running org.apache.hadoop.hbase.util.TestCoprocessorScanPolicy
> Tests run: 4, Failures: 0, Errors: 0, Skipped: 0, Time elapsed: 71.482 sec
> - in org.apache.hadoop.hbase.util.TestMiniClusterLoadParallel
> Running org.apache.hadoop.hbase.util.hbck.TestOfflineMetaRebuildOverlap
> Tests run: 4, Failures: 0, Errors: 0, Skipped: 0, Time elapsed: 22.223 sec
> - in org.apache.hadoop.hbase.util.TestCoprocessorScanPolicy
> Running org.apache.hadoop.hbase.util.hbck.TestOfflineMetaRebuildHole
> Tests run: 1, Failures: 0, Errors: 0, Skipped: 0, Time elapsed: 32.322 sec
> - in org.apache.hadoop.hbase.util.hbck.TestOfflineMetaRebuildBase
> Running org.apache.hadoop.hbase.util.TestDefaultEnvironmentEdge
> Tests run: 1, Failures: 0, Errors: 0, Skipped: 0, Time elapsed: 0.325 sec
> - in org.apache.hadoop.hbase.util.TestDefaultEnvironmentEdge
> Running org.apache.hadoop.hbase.util.TestFSHDFSUtils
> Tests run: 1, Failures: 0, Errors: 0, Skipped: 0, Time elapsed: 29.664 sec
> - in org.apache.hadoop.hbase.util.hbck.TestOfflineMetaRebuildOverlap
> Tests run: 3, Failures: 0, Errors: 0, Skipped: 0, Time elapsed: 8.183 sec
> - in org.apache.hadoop.hbase.util.TestFSHDFSUtils
> Running org.apache.hadoop.hbase.TestMetaTableAccessorNoCluster
> Tests run: 2, Failures: 0, Errors: 0, Skipped: 0, Time elapsed: 3.43 sec -
> in org.apache.hadoop.hbase.TestMetaTableAccessorNoCluster
> Tests run: 1, Failures: 0, Errors: 0, Skipped: 0, Time elapsed: 28.474 sec
> - in org.apache.hadoop.hbase.util.hbck.TestOfflineMetaRebuildHole
> Running org.apache.hadoop.hbase.migration.TestUpgradeTo96
> Tests run: 5, Failures: 0, Errors: 0, Skipped: 0, Time elapsed: 75.563 sec
> - in org.apache.hadoop.hbase.util.TestMiniClusterLoadEncoded
> Tests run: 5, Failures: 0, Errors: 0, Skipped: 0, Time elapsed: 3.571 sec
> - in org.apache.hadoop.hbase.migration.TestUpgradeTo96
> Running org.apache.hadoop.hbase.TestNamespace
> Running org.apache.hadoop.hbase.migration.TestNamespaceUpgrade
> Running org.apache.hadoop.hbase.TestMetaTableAccessor
> Running org.apache.hadoop.hbase.TestInfoServers
> Tests run: 3, Failures: 0, Errors: 0, Skipped: 0, Time elapsed: 5.817 sec
> - in org.apache.hadoop.hbase.TestInfoServers
> Tests run: 5, Failures: 0, Errors: 0, Skipped: 0, Time elapsed: 31.761 sec
> - in org.apache.hadoop.hbase.migration.TestNamespaceUpgrade
> Tests run: 13, Failures: 0, Errors: 0, Skipped: 0, Time elapsed: 26.799
> sec - in org.apache.hadoop.hbase.TestMetaTableAccessor
> Tests run: 9, Failures: 0, Errors: 0, Skipped: 1, Time elapsed: 52.083 sec
> - in org.apache.hadoop.hbase.TestNamespace
> Tests run: 51, Failures: 0, Errors: 0, Skipped: 1, Time elapsed: 549.859
> sec - in org.apache.hadoop.hbase.util.TestHBaseFsck
>
> Results :
>
> Tests in error:
>
> org.apache.hadoop.hbase.regionserver.TestWALLockup.testLockupWhenSyncInMiddleOfZigZagSetup(org.apache.hadoop.hbase.regionserver.TestWALLockup)
> Run 1: TestWALLockup.testLockupWhenSyncInMiddleOfZigZagSetup ?
> DamagedWAL On sync
> Run 2: TestWALLockup.testLockupWhenSyncInMiddleOfZigZagSetup:254 ?
> TestTimedOut test ...
> Run 3: TestWALLockup.testLockupWhenSyncInMiddleOfZigZagSetup:254 ?
> TestTimedOut test ...
>
> Flaked tests:
>
> org.apache.hadoop.hbase.mapreduce.TestLoadIncrementalHFiles.testRegionCrossingHFileSplit(org.apache.hadoop.hbase.mapreduce.TestLoadIncrementalHFiles)
> Run 1:
> TestLoadIncrementalHFiles.testRegionCrossingHFileSplit:173->testRegionCrossingHFileSplit:195->runTest:223->runTest:232->runTest:285
> ? TestTimedOut
> Run 2: PASS
>
>
> Tests run: 2497, Failures: 0, Errors: 1, Skipped: 21, Flakes: 1
>
> [INFO]
> ------------------------------------------------------------------------
> [INFO] Reactor Summary:
> [INFO]
> [INFO] Apache HBase ...................................... SUCCESS [8.077s]
> [INFO] Apache HBase - Checkstyle ......................... SUCCESS [1.378s]
> [INFO] Apache HBase - Resource Bundle .................... SUCCESS [0.270s]
> [INFO] Apache HBase - Annotations ........................ SUCCESS [1.127s]
> [INFO] Apache HBase - Protocol ........................... SUCCESS
> [12.451s]
> [INFO] Apache HBase - Common ............................. SUCCESS
> [1:29.561s]
> [INFO] Apache HBase - Procedure .......................... SUCCESS
> [1:09.523s]
> [INFO] Apache HBase - Client ............................. SUCCESS
> [1:22.097s]
> [INFO] Apache HBase - Hadoop Compatibility ............... SUCCESS [7.598s]
> [INFO] Apache HBase - Hadoop Two Compatibility ........... SUCCESS [6.758s]
> [INFO] Apache HBase - Prefix Tree ........................ SUCCESS [8.305s]
> [INFO] Apache HBase - Server ............................. FAILURE
> [1:59:54.664s]
> [INFO] Apache HBase - Testing Util ....................... SKIPPED
> [INFO] Apache HBase - Thrift ............................. SKIPPED
> [INFO] Apache HBase - Rest ............................... SKIPPED
> [INFO] Apache HBase - Shell .............................. SKIPPED
> [INFO] Apache HBase - Integration Tests .................. SKIPPED
> [INFO] Apache HBase - Examples ........................... SKIPPED
> [INFO] Apache HBase - Assembly ........................... SKIPPED
> [INFO] Apache HBase - Shaded ............................. SKIPPED
> [INFO] Apache HBase - Shaded - Client .................... SKIPPED
> [INFO] Apache HBase - Shaded - Server .................... SKIPPED
> [INFO]
> ------------------------------------------------------------------------
> [INFO] BUILD FAILURE
> [INFO]
> ------------------------------------------------------------------------
> [INFO] Total time: 2:04:44.657s
> [INFO] Finished at: Sat Oct 03 00:46:58 UTC 2015
> [INFO] Final Memory: 58M/1253M
> [INFO]
> ------------------------------------------------------------------------
> [ERROR] Failed to execute goal
> org.apache.maven.plugins:maven-surefire-plugin:2.18.1:test
> (secondPartTestsExecution) on project hbase-server: There are test failures.
> [ERROR]
> [ERROR] Please refer to
> /x1/jenkins/jenkins-slave/workspace/HBase-1.1/hbase-server/target/surefire-reports
> for the individual test results.
> [ERROR] -> [Help 1]
> [ERROR]
> [ERROR] To see the full stack trace of the errors, re-run Maven with the
> -e switch.
> [ERROR] Re-run Maven using the -X switch to enable full debug logging.
> [ERROR]
> [ERROR] For more information about the errors and possible solutions,
> please read the following articles:
> [ERROR] [Help 1]
> http://cwiki.apache.org/confluence/display/MAVEN/MojoFailureException
> [ERROR]
> [ERROR] After correcting the problems, you can resume the build with the
> command
> [ERROR] mvn <goals> -rf :hbase-server
> Build step 'Invoke top-level Maven targets' marked build as failure
> Performing Post build task...
> Match found for :.* : True
> Logical operation result is TRUE
> Running script : ZOMBIE_TESTS_COUNT=`jps | grep surefirebooter | wc -l`
> if [[ $ZOMBIE_TESTS_COUNT != 0 ]] ; then
> #It seems sometimes the tests are not dying immediately. Let's give
> them 10s
> echo "Suspicious java process found - waiting 10s to see if there are
> just slow to stop"
> sleep 10
> ZOMBIE_TESTS_COUNT=`jps | grep surefirebooter | wc -l`
> if [[ $ZOMBIE_TESTS_COUNT != 0 ]] ; then
> echo "There are $ZOMBIE_TESTS_COUNT zombie tests, they should have
> been killed by surefire but survived"
> echo "************ BEGIN zombies jstack extract"
> ZB_STACK=`jps | grep surefirebooter | cut -d ' ' -f 1 | xargs -n 1
> jstack | grep ".test" | grep "\.java"`
> jps | grep surefirebooter | cut -d ' ' -f 1 | xargs -n 1 jstack
> echo "************ END zombies jstack extract"
> JIRA_COMMENT="$JIRA_COMMENT
>
> {color:red}-1 core zombie tests{color}. There are
> ${ZOMBIE_TESTS_COUNT} zombie test(s): ${ZB_STACK}"
> BAD=1
> jps | grep surefirebooter | cut -d ' ' -f 1 | xargs kill -9
> else
> echo "We're ok: there is no zombie test, but some tests took some
> time to stop"
> fi
> else
> echo "We're ok: there is no zombie test"
> fi
> [HBase-1.1] $ /bin/bash -xe /tmp/hudson5050581489796808783.sh
> ++ wc -l
> ++ grep surefirebooter
> ++ jps
> + ZOMBIE_TESTS_COUNT=0
> + [[ 0 != 0 ]]
> + echo 'We'\''re ok: there is no zombie test'
> We're ok: there is no zombie test
> POST BUILD TASK : SUCCESS
> END OF POST BUILD TASK : 0
> Archiving artifacts
> Recording test results
> Updating HBASE-14538
>