You are viewing a plain text version of this content. The canonical link for it is here.
Posted to java-dev@axis.apache.org by Apache Jenkins Server <je...@builds.apache.org> on 2012/03/29 07:01:47 UTC
Build failed in Jenkins: Rampart #786
See <https://builds.apache.org/job/Rampart/786/>
------------------------------------------
[...truncated 1206 lines...]
[ERROR] VM #displayTree: error : too few arguments to macro. Wanted 2 got 0
[ERROR] VM #menuItem: error : too few arguments to macro. Wanted 1 got 0
[JENKINS] Archiving site from <https://builds.apache.org/job/Rampart/ws/trunk/modules/documentation/target/site> to /home/hudson/hudson/jobs/Rampart/site/rampart-documentation
[JENKINS] Archiving <https://builds.apache.org/job/Rampart/ws/trunk/modules/documentation/pom.xml> to /home/hudson/hudson/jobs/Rampart/modules/org.apache.rampart$rampart-documentation/builds/2012-03-29_04-30-02/archive/org.apache.rampart/rampart-documentation/1.7.0-SNAPSHOT/rampart-documentation-1.7.0-SNAPSHOT.pom
[INFO] [INFO] Deleting <https://builds.apache.org/job/Rampart/ws/trunk/modules/distribution/target>
[INFO] ------------------------------------------------------------------------
[INFO] Building Rampart - Distribution 1.7.0-SNAPSHOT
[INFO] ------------------------------------------------------------------------
[INFO]
[INFO] --- maven-clean-plugin:2.4.1:clean (default-clean) @ rampart-dist ---
[INFO]
[INFO] --- maven-remote-resources-plugin:1.1:process (default) @ rampart-dist ---
[INFO]
[INFO] --- gmaven-plugin:1.2:execute (generate-timestamp) @ rampart-dist ---
[INFO] [INFO] Executing tasks
[INFO] --- maven-antrun-plugin:1.1:run (build-javadoc) @ rampart-dist ---
[javadoc] Generating Javadoc
[javadoc] Javadoc execution
[javadoc] Creating destination directory: "<https://builds.apache.org/job/Rampart/ws/trunk/modules/distribution/target/apidocs/">
[javadoc] Loading source files for package org.apache.rampart...
[javadoc] Loading source files for package org.apache.rampart.builder...
[javadoc] Loading source files for package org.apache.rampart.handler...
[javadoc] Loading source files for package org.apache.rampart.handler.config...
[javadoc] Loading source files for package org.apache.rampart.policy...
[javadoc] Loading source files for package org.apache.rampart.policy.builders...
[javadoc] Loading source files for package org.apache.rampart.policy.model...
[javadoc] Loading source files for package org.apache.rampart.saml...
[javadoc] Loading source files for package org.apache.rampart.util...
[javadoc] Loading source files for package org.apache.rahas...
[javadoc] Loading source files for package org.apache.rahas.client...
[javadoc] Loading source files for package org.apache.rahas.impl...
[javadoc] <https://builds.apache.org/job/Rampart/ws/trunk/modules/rampart-trust/src/main/java/org/apache/rahas/impl/SAML2TokenIssuer.java>:139: warning: unmappable character for encoding ASCII
[javadoc] * <wsp:AppliesTo xmlns:wsp="...???>...</wsp:AppliesTo>
[javadoc] ^
[javadoc] <https://builds.apache.org/job/Rampart/ws/trunk/modules/rampart-trust/src/main/java/org/apache/rahas/impl/SAML2TokenIssuer.java>:139: warning: unmappable character for encoding ASCII
[javadoc] * <wsp:AppliesTo xmlns:wsp="...???>...</wsp:AppliesTo>
[javadoc] ^
[javadoc] <https://builds.apache.org/job/Rampart/ws/trunk/modules/rampart-trust/src/main/java/org/apache/rahas/impl/SAML2TokenIssuer.java>:139: warning: unmappable character for encoding ASCII
[javadoc] * <wsp:AppliesTo xmlns:wsp="...???>...</wsp:AppliesTo>
[javadoc] ^
[javadoc] <https://builds.apache.org/job/Rampart/ws/trunk/modules/rampart-trust/src/main/java/org/apache/rahas/impl/SAML2TokenIssuer.java>:362: warning: unmappable character for encoding ASCII
[javadoc] * Method=???urn:oasis:names:tc:SAML:2.0:cm:holder-of-key???>
[javadoc] ^
[javadoc] <https://builds.apache.org/job/Rampart/ws/trunk/modules/rampart-trust/src/main/java/org/apache/rahas/impl/SAML2TokenIssuer.java>:362: warning: unmappable character for encoding ASCII
[javadoc] * Method=???urn:oasis:names:tc:SAML:2.0:cm:holder-of-key???>
[javadoc] ^
[javadoc] <https://builds.apache.org/job/Rampart/ws/trunk/modules/rampart-trust/src/main/java/org/apache/rahas/impl/SAML2TokenIssuer.java>:362: warning: unmappable character for encoding ASCII
[javadoc] * Method=???urn:oasis:names:tc:SAML:2.0:cm:holder-of-key???>
[javadoc] ^
[javadoc] <https://builds.apache.org/job/Rampart/ws/trunk/modules/rampart-trust/src/main/java/org/apache/rahas/impl/SAML2TokenIssuer.java>:362: warning: unmappable character for encoding ASCII
[javadoc] * Method=???urn:oasis:names:tc:SAML:2.0:cm:holder-of-key???>
[javadoc] ^
[javadoc] <https://builds.apache.org/job/Rampart/ws/trunk/modules/rampart-trust/src/main/java/org/apache/rahas/impl/SAML2TokenIssuer.java>:362: warning: unmappable character for encoding ASCII
[javadoc] * Method=???urn:oasis:names:tc:SAML:2.0:cm:holder-of-key???>
[javadoc] ^
[javadoc] <https://builds.apache.org/job/Rampart/ws/trunk/modules/rampart-trust/src/main/java/org/apache/rahas/impl/SAML2TokenIssuer.java>:362: warning: unmappable character for encoding ASCII
[javadoc] * Method=???urn:oasis:names:tc:SAML:2.0:cm:holder-of-key???>
[javadoc] ^
[javadoc] <https://builds.apache.org/job/Rampart/ws/trunk/modules/rampart-trust/src/main/java/org/apache/rahas/impl/SAML2TokenIssuer.java>:444: warning: unmappable character for encoding ASCII
[javadoc] * Format=???urn:oasis:names:tc:SAML:1.1:nameid-
[javadoc] ^
[javadoc] <https://builds.apache.org/job/Rampart/ws/trunk/modules/rampart-trust/src/main/java/org/apache/rahas/impl/SAML2TokenIssuer.java>:444: warning: unmappable character for encoding ASCII
[javadoc] * Format=???urn:oasis:names:tc:SAML:1.1:nameid-
[javadoc] ^
[javadoc] <https://builds.apache.org/job/Rampart/ws/trunk/modules/rampart-trust/src/main/java/org/apache/rahas/impl/SAML2TokenIssuer.java>:444: warning: unmappable character for encoding ASCII
[javadoc] * Format=???urn:oasis:names:tc:SAML:1.1:nameid-
[javadoc] ^
[javadoc] <https://builds.apache.org/job/Rampart/ws/trunk/modules/rampart-trust/src/main/java/org/apache/rahas/impl/SAML2TokenIssuer.java>:445: warning: unmappable character for encoding ASCII
[javadoc] * format:X509SubjectName???>
[javadoc] ^
[javadoc] <https://builds.apache.org/job/Rampart/ws/trunk/modules/rampart-trust/src/main/java/org/apache/rahas/impl/SAML2TokenIssuer.java>:445: warning: unmappable character for encoding ASCII
[javadoc] * format:X509SubjectName???>
[javadoc] ^
[javadoc] <https://builds.apache.org/job/Rampart/ws/trunk/modules/rampart-trust/src/main/java/org/apache/rahas/impl/SAML2TokenIssuer.java>:445: warning: unmappable character for encoding ASCII
[javadoc] * format:X509SubjectName???>
[javadoc] ^
[javadoc] Loading source files for package org.apache.rahas.impl.util...
[javadoc] <https://builds.apache.org/job/Rampart/ws/trunk/modules/rampart-trust/src/main/java/org/apache/rahas/impl/util/SAMLUtils.java>:389: warning: unmappable character for encoding ASCII
[javadoc] * Issuer=???www.opensaml.org???
[javadoc] ^
[javadoc] <https://builds.apache.org/job/Rampart/ws/trunk/modules/rampart-trust/src/main/java/org/apache/rahas/impl/util/SAMLUtils.java>:389: warning: unmappable character for encoding ASCII
[javadoc] * Issuer=???www.opensaml.org???
[javadoc] ^
[javadoc] <https://builds.apache.org/job/Rampart/ws/trunk/modules/rampart-trust/src/main/java/org/apache/rahas/impl/util/SAMLUtils.java>:389: warning: unmappable character for encoding ASCII
[javadoc] * Issuer=???www.opensaml.org???
[javadoc] ^
[javadoc] <https://builds.apache.org/job/Rampart/ws/trunk/modules/rampart-trust/src/main/java/org/apache/rahas/impl/util/SAMLUtils.java>:389: warning: unmappable character for encoding ASCII
[javadoc] * Issuer=???www.opensaml.org???
[javadoc] ^
[javadoc] <https://builds.apache.org/job/Rampart/ws/trunk/modules/rampart-trust/src/main/java/org/apache/rahas/impl/util/SAMLUtils.java>:389: warning: unmappable character for encoding ASCII
[javadoc] * Issuer=???www.opensaml.org???
[javadoc] ^
[javadoc] <https://builds.apache.org/job/Rampart/ws/trunk/modules/rampart-trust/src/main/java/org/apache/rahas/impl/util/SAMLUtils.java>:389: warning: unmappable character for encoding ASCII
[javadoc] * Issuer=???www.opensaml.org???
[javadoc] ^
[javadoc] Constructing Javadoc information...
[javadoc] Standard Doclet version 1.6.0_27
[javadoc] Building tree for all the packages and classes...
[javadoc] <https://builds.apache.org/job/Rampart/ws/trunk/modules/rampart-core/src/main/java/org/apache/rampart/NonceCache.java>:87: warning - @inheritdoc is an unknown tag -- same as a known tag except for case.
[javadoc] <https://builds.apache.org/job/Rampart/ws/trunk/modules/rampart-core/src/main/java/org/apache/rampart/NonceCache.java>:104: warning - @inheritdoc is an unknown tag -- same as a known tag except for case.
[javadoc] <https://builds.apache.org/job/Rampart/ws/trunk/modules/rampart-core/src/main/java/org/apache/rampart/NonceCache.java>:121: warning - @inheritdoc is an unknown tag -- same as a known tag except for case.
[javadoc] <https://builds.apache.org/job/Rampart/ws/trunk/modules/rampart-core/src/main/java/org/apache/rampart/builder/BindingBuilder.java>:212: warning - @return tag has no arguments.
[javadoc] <https://builds.apache.org/job/Rampart/ws/trunk/modules/rampart-core/src/main/java/org/apache/rampart/handler/PostDispatchVerificationHandler.java>:55: warning - Tag @see: can't find cleanup() in org.apache.axis2.engine.Handler
[javadoc] <https://builds.apache.org/job/Rampart/ws/trunk/modules/rampart-core/src/main/java/org/apache/rampart/util/Axis2Util.java>:203: warning - @return tag has no arguments.
[javadoc] <https://builds.apache.org/job/Rampart/ws/trunk/modules/rampart-core/src/main/java/org/apache/rampart/util/Axis2Util.java>:339: warning - @return tag has no arguments.
[javadoc] <https://builds.apache.org/job/Rampart/ws/trunk/modules/rampart-core/src/main/java/org/apache/rampart/util/RampartUtil.java>:1216: warning - @return tag has no arguments.
[javadoc] <https://builds.apache.org/job/Rampart/ws/trunk/modules/rampart-core/src/main/java/org/apache/rampart/util/RampartUtil.java>:1435: warning - @return tag has no arguments.
[javadoc] <https://builds.apache.org/job/Rampart/ws/trunk/modules/rampart-core/src/main/java/org/apache/rampart/util/RampartUtil.java>:1516: warning - @return tag has no arguments.
[javadoc] <https://builds.apache.org/job/Rampart/ws/trunk/modules/rampart-trust/src/main/java/org/apache/rahas/TrustUtil.java>:485: warning - @return tag has no arguments.
[javadoc] <https://builds.apache.org/job/Rampart/ws/trunk/modules/rampart-trust/src/main/java/org/apache/rahas/impl/SAMLTokenIssuerConfig.java>:460: warning - @return tag has no arguments.
[javadoc] <https://builds.apache.org/job/Rampart/ws/trunk/modules/rampart-trust/src/main/java/org/apache/rahas/impl/SAMLTokenIssuerConfig.java>:412: warning - @return tag has no arguments.
[javadoc] <https://builds.apache.org/job/Rampart/ws/trunk/modules/rampart-trust/src/main/java/org/apache/rahas/impl/util/SAMLCallback.java>:23: warning - @return tag has no arguments.
[javadoc] Building index for all the packages and classes...
[javadoc] Building index for all classes...
[javadoc] Generating <https://builds.apache.org/job/Rampart/ws/trunk/modules/distribution/target/apidocs/stylesheet.css...>
[javadoc] 35 warnings
[INFO] Executed tasks
[INFO]
[INFO] --- maven-assembly-plugin:2.2-beta-5:single (distribution-package) @ rampart-dist ---
[INFO] Reading assembly descriptor: bin.xml
[INFO] Reading assembly descriptor: src.xml
[WARNING] Cannot include project artifact: org.apache.rampart:rampart-dist:pom:1.7.0-SNAPSHOT; it doesn't have an associated file or directory.
[WARNING] Cannot include project artifact: org.apache.rampart:rampart-dist:pom:1.7.0-SNAPSHOT; it doesn't have an associated file or directory.
[WARNING] The following patterns were never triggered in this artifact inclusion filter:
o 'opensaml:opensaml:jar'
o 'org.opensaml:opensaml1:jar'
o 'org.apache.xerces:xercesImpl:jar'
o 'org.apache.xerces:resolver:jar'
o 'org.apache.xerces:serializer:jar'
[INFO] Building zip: <https://builds.apache.org/job/Rampart/ws/trunk/modules/distribution/target/rampart-dist-1.7.0-SNAPSHOT-bin.zip>
[INFO] Building zip: <https://builds.apache.org/job/Rampart/ws/trunk/modules/distribution/target/rampart-dist-1.7.0-SNAPSHOT-src.zip>
[INFO] Installing <https://builds.apache.org/job/Rampart/ws/trunk/modules/distribution/pom.xml> to <https://builds.apache.org/job/Rampart/ws/.repository/org/apache/rampart/rampart-dist/1.7.0-SNAPSHOT/rampart-dist-1.7.0-SNAPSHOT.pom>
[INFO] Installing <https://builds.apache.org/job/Rampart/ws/trunk/modules/distribution/target/rampart-dist-1.7.0-SNAPSHOT-bin.zip> to <https://builds.apache.org/job/Rampart/ws/.repository/org/apache/rampart/rampart-dist/1.7.0-SNAPSHOT/rampart-dist-1.7.0-SNAPSHOT-bin.zip>
[INFO] [INFO] Installing <https://builds.apache.org/job/Rampart/ws/trunk/modules/distribution/target/rampart-dist-1.7.0-SNAPSHOT-src.zip> to <https://builds.apache.org/job/Rampart/ws/.repository/org/apache/rampart/rampart-dist/1.7.0-SNAPSHOT/rampart-dist-1.7.0-SNAPSHOT-src.zip>
[INFO] --- maven-install-plugin:2.3:install (default-install) @ rampart-dist ---
[JENKINS] Archiving <https://builds.apache.org/job/Rampart/ws/trunk/modules/distribution/pom.xml> to /home/hudson/hudson/jobs/Rampart/modules/org.apache.rampart$rampart-dist/builds/2012-03-29_04-30-02/archive/org.apache.rampart/rampart-dist/1.7.0-SNAPSHOT/rampart-dist-1.7.0-SNAPSHOT.pom
[JENKINS] Archiving <https://builds.apache.org/job/Rampart/ws/trunk/modules/distribution/target/rampart-dist-1.7.0-SNAPSHOT-bin.zip> to /home/hudson/hudson/jobs/Rampart/modules/org.apache.rampart$rampart-dist/builds/2012-03-29_04-30-02/archive/org.apache.rampart/rampart-dist/1.7.0-SNAPSHOT/rampart-dist-1.7.0-SNAPSHOT-bin.zip
Build timed out (after 30 minutes). Marking the build as failed.
hudson.util.IOException2: Failed to copy <https://builds.apache.org/job/Rampart/ws/trunk/modules/distribution/target/rampart-dist-1.7.0-SNAPSHOT-bin.zip> to /home/hudson/hudson/jobs/Rampart/modules/org.apache.rampart$rampart-dist/builds/2012-03-29_04-30-02/archive/org.apache.rampart/rampart-dist/1.7.0-SNAPSHOT/rampart-dist-1.7.0-SNAPSHOT-bin.zip
at hudson.FilePath.copyTo(FilePath.java:1537)
at hudson.maven.reporters.MavenArtifact.archive(MavenArtifact.java:231)
at hudson.maven.reporters.MavenArtifactArchiver.postBuild(MavenArtifactArchiver.java:122)
at hudson.maven.Maven3Builder$MavenExecutionListener.recordProjectSucceeded(Maven3Builder.java:349)
at hudson.maven.Maven3Builder$MavenExecutionListener.projectSucceeded(Maven3Builder.java:323)
at org.apache.maven.lifecycle.internal.DefaultExecutionEventCatapult.fire(DefaultExecutionEventCatapult.java:74)
at org.apache.maven.lifecycle.internal.DefaultExecutionEventCatapult.fire(DefaultExecutionEventCatapult.java:42)
at org.apache.maven.lifecycle.internal.LifecycleModuleBuilder.buildProject(LifecycleModuleBuilder.java:91)
at org.apache.maven.lifecycle.internal.LifecycleModuleBuilder.buildProject(LifecycleModuleBuilder.java:59)
at org.apache.maven.lifecycle.internal.LifecycleStarter.singleThreadedBuild(LifecycleStarter.java:183)
at org.apache.maven.lifecycle.internal.LifecycleStarter.execute(LifecycleStarter.java:161)
at org.apache.maven.DefaultMaven.doExecute(DefaultMaven.java:319)
at org.apache.maven.DefaultMaven.execute(DefaultMaven.java:156)
at org.jvnet.hudson.maven3.launcher.Maven3Launcher.main(Maven3Launcher.java:79)
at sun.reflect.NativeMethodAccessorImpl.invoke0(Native Method)
at sun.reflect.NativeMethodAccessorImpl.invoke(NativeMethodAccessorImpl.java:39)
at sun.reflect.DelegatingMethodAccessorImpl.invoke(DelegatingMethodAccessorImpl.java:25)
at java.lang.reflect.Method.invoke(Method.java:597)
at org.codehaus.plexus.classworlds.launcher.Launcher.launchStandard(Launcher.java:329)
at org.codehaus.plexus.classworlds.launcher.Launcher.launch(Launcher.java:239)
at org.jvnet.hudson.maven3.agent.Maven3Main.launch(Maven3Main.java:158)
at hudson.maven.Maven3Builder.call(Maven3Builder.java:104)
at hudson.maven.Maven3Builder.call(Maven3Builder.java:70)
at hudson.remoting.UserRequest.perform(UserRequest.java:118)
at hudson.remoting.UserRequest.perform(UserRequest.java:48)
at hudson.remoting.Request$2.run(Request.java:287)
at hudson.remoting.InterceptingExecutorService$1.call(InterceptingExecutorService.java:72)
at java.util.concurrent.FutureTask$Sync.innerRun(FutureTask.java:303)
at java.util.concurrent.FutureTask.run(FutureTask.java:138)
at java.util.concurrent.ThreadPoolExecutor$Worker.runTask(ThreadPoolExecutor.java:886)
at java.util.concurrent.ThreadPoolExecutor$Worker.run(ThreadPoolExecutor.java:908)
at java.lang.Thread.run(Thread.java:662)
Caused by: java.io.InterruptedIOException
at hudson.remoting.ProxyOutputStream._write(ProxyOutputStream.java:120)
at hudson.remoting.ProxyOutputStream.write(ProxyOutputStream.java:103)
at hudson.remoting.RemoteOutputStream.write(RemoteOutputStream.java:110)
at hudson.remoting.RemoteOutputStream.write(RemoteOutputStream.java:110)
at hudson.Util.copyStream(Util.java:409)
at hudson.FilePath$33.invoke(FilePath.java:1564)
at hudson.FilePath$33.invoke(FilePath.java:1558)
at hudson.FilePath.act(FilePath.java:832)
at hudson.FilePath.act(FilePath.java:814)
at hudson.FilePath.copyTo(FilePath.java:1558)
at hudson.FilePath.copyTo(FilePath.java:1532)
... 31 more
Caused by: java.lang.InterruptedException
at java.lang.Object.wait(Native Method)
at java.lang.Object.wait(Object.java:485)
at hudson.remoting.PipeWindow$Real.get(PipeWindow.java:177)
at hudson.remoting.ProxyOutputStream._write(ProxyOutputStream.java:118)
... 41 more
channel stopped
hudson.remoting.ChannelClosedException: channel is already closed
at hudson.remoting.Channel.send(Channel.java:499)
at hudson.remoting.Request.callAsync(Request.java:182)
at hudson.remoting.Channel.callAsync(Channel.java:708)
at hudson.maven.AbstractMavenBuilder$FilterImpl.executeAsync(AbstractMavenBuilder.java:233)
at hudson.maven.reporters.MavenFingerprinter.postBuild(MavenFingerprinter.java:112)
at hudson.maven.Maven3Builder$MavenExecutionListener.recordProjectSucceeded(Maven3Builder.java:349)
at hudson.maven.Maven3Builder$MavenExecutionListener.projectSucceeded(Maven3Builder.java:323)
at org.apache.maven.lifecycle.internal.DefaultExecutionEventCatapult.fire(DefaultExecutionEventCatapult.java:74)
at org.apache.maven.lifecycle.internal.DefaultExecutionEventCatapult.fire(DefaultExecutionEventCatapult.java:42)
at org.apache.maven.lifecycle.internal.LifecycleModuleBuilder.buildProject(LifecycleModuleBuilder.java:91)
at org.apache.maven.lifecycle.internal.LifecycleModuleBuilder.buildProject(LifecycleModuleBuilder.java:59)
at org.apache.maven.lifecycle.internal.LifecycleStarter.singleThreadedBuild(LifecycleStarter.java:183)
at org.apache.maven.lifecycle.internal.LifecycleStarter.execute(LifecycleStarter.java:161)
at org.apache.maven.DefaultMaven.doExecute(DefaultMaven.java:319)
at org.apache.maven.DefaultMaven.execute(DefaultMaven.java:156)
at org.jvnet.hudson.maven3.launcher.Maven3Launcher.main(Maven3Launcher.java:79)
at sun.reflect.NativeMethodAccessorImpl.invoke0(Native Method)
at sun.reflect.NativeMethodAccessorImpl.invoke(NativeMethodAccessorImpl.java:39)
at sun.reflect.DelegatingMethodAccessorImpl.invoke(DelegatingMethodAccessorImpl.java:25)
at java.lang.reflect.Method.invoke(Method.java:597)
at org.codehaus.plexus.classworlds.launcher.Launcher.launchStandard(Launcher.java:329)
at org.codehaus.plexus.classworlds.launcher.Launcher.launch(Launcher.java:239)
at org.jvnet.hudson.maven3.agent.Maven3Main.launch(Maven3Main.java:158)
at hudson.maven.Maven3Builder.call(Maven3Builder.java:104)
at hudson.maven.Maven3Builder.call(Maven3Builder.java:70)
at hudson.remoting.UserRequest.perform(UserRequest.java:118)
at hudson.remoting.UserRequest.perform(UserRequest.java:48)
at hudson.remoting.Request$2.run(Request.java:287)
at hudson.remoting.InterceptingExecutorService$1.call(InterceptingExecutorService.java:72)
at java.util.concurrent.FutureTask$Sync.innerRun(FutureTask.java:303)
at java.util.concurrent.FutureTask.run(FutureTask.java:138)
at java.util.concurrent.ThreadPoolExecutor$Worker.runTask(ThreadPoolExecutor.java:886)
at java.util.concurrent.ThreadPoolExecutor$Worker.run(ThreadPoolExecutor.java:908)
at java.lang.Thread.run(Thread.java:662)
Caused by: hudson.remoting.Channel$OrderlyShutdown
at hudson.remoting.Channel$CloseCommand.execute(Channel.java:848)
at hudson.remoting.Channel$ReaderThread.run(Channel.java:1146)
Caused by: Command close created at
at hudson.remoting.Command.<init>(Command.java:51)
at hudson.remoting.Channel$CloseCommand.<init>(Channel.java:842)
at hudson.remoting.Channel$CloseCommand.<init>(Channel.java:840)
at hudson.remoting.Channel.close(Channel.java:907)
at hudson.remoting.Channel.close(Channel.java:890)
at hudson.slaves.Channels$1.close(Channels.java:91)
at hudson.maven.ProcessCache$MavenProcess.discard(ProcessCache.java:145)
at hudson.maven.MavenModuleSetBuild$RunnerImpl.doRun(MavenModuleSetBuild.java:800)
at hudson.model.AbstractBuild$AbstractRunner.run(AbstractBuild.java:473)
at hudson.model.Run.run(Run.java:1410)
at hudson.maven.MavenModuleSetBuild.run(MavenModuleSetBuild.java:481)
at hudson.model.ResourceController.execute(ResourceController.java:88)
at hudson.model.Executor.run(Executor.java:238)
[locks-and-latches] Releasing all the locks
[locks-and-latches] All the locks released
---------------------------------------------------------------------
To unsubscribe, e-mail: java-dev-unsubscribe@axis.apache.org
For additional commands, e-mail: java-dev-help@axis.apache.org
Jenkins build is back to normal : Rampart #788
Posted by Apache Jenkins Server <je...@builds.apache.org>.
See <https://builds.apache.org/job/Rampart/788/>
---------------------------------------------------------------------
To unsubscribe, e-mail: java-dev-unsubscribe@axis.apache.org
For additional commands, e-mail: java-dev-help@axis.apache.org
Build failed in Jenkins: Rampart #787
Posted by Apache Jenkins Server <je...@builds.apache.org>.
See <https://builds.apache.org/job/Rampart/787/>
------------------------------------------
Started by upstream project "Axis2" build number 1318
Building remotely on ubuntu4 in workspace <https://builds.apache.org/job/Rampart/ws/>
Updating http://svn.apache.org/repos/asf/axis/axis2/java/rampart/trunk
At revision 1307378
no change for http://svn.apache.org/repos/asf/axis/axis2/java/rampart/trunk since the previous build
[Rampart] $ /bin/bash -xe /tmp/hudson884008009846541659.sh
+ '[' -d <https://builds.apache.org/job/Rampart/ws/.repository> ']'
++ find <https://builds.apache.org/job/Rampart/ws/.repository> -type d -and -name '*-SNAPSHOT'
+ rm -rf <https://builds.apache.org/job/Rampart/ws/.repository/org/apache/woden/woden/1.0-SNAPSHOT> <https://builds.apache.org/job/Rampart/ws/.repository/org/apache/woden/woden-impl-dom/1.0-SNAPSHOT> <https://builds.apache.org/job/Rampart/ws/.repository/org/apache/woden/woden-impl-commons/1.0-SNAPSHOT> <https://builds.apache.org/job/Rampart/ws/.repository/org/apache/woden/woden-api/1.0-SNAPSHOT> <https://builds.apache.org/job/Rampart/ws/.repository/org/apache/neethi/neethi/3.0.2-SNAPSHOT> <https://builds.apache.org/job/Rampart/ws/.repository/org/apache/rampart/rampart-policy/1.7.0-SNAPSHOT> <https://builds.apache.org/job/Rampart/ws/.repository/org/apache/rampart/rampart-dist/1.7.0-SNAPSHOT> <https://builds.apache.org/job/Rampart/ws/.repository/org/apache/rampart/rampart-documentation/1.7.0-SNAPSHOT> <https://builds.apache.org/job/Rampart/ws/.repository/org/apache/rampart/rampart-core/1.7.0-SNAPSHOT> <https://builds.apache.org/job/Rampart/ws/.repository/org/apache/rampart/rampart-tests/1.7.0-SNAPSHOT> <https://builds.apache.org/job/Rampart/ws/.repository/org/apache/rampart/rampart/1.7.0-SNAPSHOT> <https://builds.apache.org/job/Rampart/ws/.repository/org/apache/rampart/rahas/1.7.0-SNAPSHOT> <https://builds.apache.org/job/Rampart/ws/.repository/org/apache/rampart/rampart-trust/1.7.0-SNAPSHOT> <https://builds.apache.org/job/Rampart/ws/.repository/org/apache/rampart/rampart-project/1.7.0-SNAPSHOT> <https://builds.apache.org/job/Rampart/ws/.repository/org/apache/rampart/rampart-integration/1.7.0-SNAPSHOT> <https://builds.apache.org/job/Rampart/ws/.repository/org/apache/axis2/addressing/1.7.0-SNAPSHOT> <https://builds.apache.org/job/Rampart/ws/.repository/org/apache/axis2/axis2-transport-local/1.7.0-SNAPSHOT> <https://builds.apache.org/job/Rampart/ws/.repository/org/apache/axis2/axis2-kernel/1.7.0-SNAPSHOT> <https://builds.apache.org/job/Rampart/ws/.repository/org/apache/axis2/axis2-transport-http/1.7.0-SNAPSHOT> <https://builds.apache.org/job/Rampart/ws/.repository/org/apache/axis2/axis2-codegen/1.7.0-SNAPSHOT> <https://builds.apache.org/job/Rampart/ws/.repository/org/apache/axis2/axis2-adb-codegen/1.7.0-SNAPSHOT> <https://builds.apache.org/job/Rampart/ws/.repository/org/apache/axis2/mex/1.7.0-SNAPSHOT> <https://builds.apache.org/job/Rampart/ws/.repository/org/apache/axis2/axis2-mtompolicy/1.7.0-SNAPSHOT> <https://builds.apache.org/job/Rampart/ws/.repository/org/apache/axis2/axis2-adb/1.7.0-SNAPSHOT> <https://builds.apache.org/job/Rampart/ws/.repository/org/apache/axis2/axis2-xmlbeans/1.7.0-SNAPSHOT> <https://builds.apache.org/job/Rampart/ws/.repository/org/apache/axis2/axis2-parent/1.7.0-SNAPSHOT> <https://builds.apache.org/job/Rampart/ws/.repository/org/apache/ws/commons/schema/XmlSchema/1.4.8-SNAPSHOT> <https://builds.apache.org/job/Rampart/ws/.repository/org/apache/ws/commons/axiom/axiom-parent/1.2.13-SNAPSHOT> <https://builds.apache.org/job/Rampart/ws/.repository/org/apache/ws/commons/axiom/axiom-impl/1.2.13-SNAPSHOT> <https://builds.apache.org/job/Rampart/ws/.repository/org/apache/ws/commons/axiom/axiom-dom/1.2.13-SNAPSHOT> <https://builds.apache.org/job/Rampart/ws/.repository/org/apache/ws/commons/axiom/axiom-api/1.2.13-SNAPSHOT>
[locks-and-latches] Checking to see if we really have the locks
[locks-and-latches] Have all the locks, build can start
Parsing POMs
Modules changed, recalculating dependency graph
[trunk] $ /home/hudson/tools/java/latest1.6/bin/java -cp /home/jenkins/jenkins-slave/maven3-agent.jar:/home/hudson/tools/maven/apache-maven-3.0.3/boot/plexus-classworlds-2.4.jar org.jvnet.hudson.maven3.agent.Maven3Main /home/hudson/tools/maven/apache-maven-3.0.3 /home/jenkins/jenkins-slave/slave.jar /home/jenkins/jenkins-slave/maven3-interceptor.jar 44612
<===[JENKINS REMOTING CAPACITY]===> channel started
log4j:WARN No appenders could be found for logger (org.apache.commons.beanutils.converters.BooleanConverter).
log4j:WARN Please initialize the log4j system properly.
Executing Maven: -B -f <https://builds.apache.org/job/Rampart/ws/trunk/pom.xml> -Dmaven.repo.local=<https://builds.apache.org/job/Rampart/ws/.repository> clean install -Drelease
[INFO] Scanning for projects...
[INFO] ------------------------------------------------------------------------
[INFO] Reactor Build Order:
[INFO]
[INFO] Apache Rampart
[INFO] Rampart - Policy
[INFO] Rampart - Trust
[INFO] Rampart - Core
[INFO] Rampart - Test Suite
[INFO] Rampart - Mar
[INFO] Rampart - Trust-Mar
[INFO] Rampart - Integration
[INFO] Rampart - Documentation
[INFO] Rampart - Distribution
[INFO]
[INFO] ------------------------------------------------------------------------
[INFO] Building Apache Rampart 1.7.0-SNAPSHOT
[INFO] ------------------------------------------------------------------------
[INFO]
[INFO] --- maven-clean-plugin:2.4.1:clean (default-clean) @ rampart-project ---
[INFO] Deleting <https://builds.apache.org/job/Rampart/ws/trunk/target>
Build timed out (after 30 minutes). Marking the build as failed.
java.lang.reflect.InvocationTargetException
at sun.reflect.NativeMethodAccessorImpl.invoke0(Native Method)
at sun.reflect.NativeMethodAccessorImpl.invoke(NativeMethodAccessorImpl.java:39)
at sun.reflect.DelegatingMethodAccessorImpl.invoke(DelegatingMethodAccessorImpl.java:25)
at java.lang.reflect.Method.invoke(Method.java:597)
at org.codehaus.plexus.classworlds.launcher.Launcher.launchStandard(Launcher.java:329)
at org.codehaus.plexus.classworlds.launcher.Launcher.launch(Launcher.java:239)
at org.jvnet.hudson.maven3.agent.Maven3Main.launch(Maven3Main.java:158)
at hudson.maven.Maven3Builder.call(Maven3Builder.java:104)
at hudson.maven.Maven3Builder.call(Maven3Builder.java:70)
at hudson.remoting.UserRequest.perform(UserRequest.java:118)
at hudson.remoting.UserRequest.perform(UserRequest.java:48)
at hudson.remoting.Request$2.run(Request.java:287)
at hudson.remoting.InterceptingExecutorService$1.call(InterceptingExecutorService.java:72)
at java.util.concurrent.FutureTask$Sync.innerRun(FutureTask.java:303)
at java.util.concurrent.FutureTask.run(FutureTask.java:138)
at java.util.concurrent.ThreadPoolExecutor$Worker.runTask(ThreadPoolExecutor.java:886)
at java.util.concurrent.ThreadPoolExecutor$Worker.run(ThreadPoolExecutor.java:908)
at java.lang.Thread.run(Thread.java:662)
Caused by: java.lang.ExceptionInInitializerError
at hudson.model.Computer.<clinit>(Computer.java:1209)
at hudson.FilePath.act(FilePath.java:832)
at hudson.FilePath.act(FilePath.java:814)
at hudson.FilePath.digest(FilePath.java:1478)
at hudson.maven.reporters.MavenFingerprinter.record(MavenFingerprinter.java:238)
at hudson.maven.reporters.MavenFingerprinter.postExecute(MavenFingerprinter.java:100)
at hudson.maven.Maven3Builder$MavenExecutionListener.recordMojoSucceeded(Maven3Builder.java:478)
at hudson.maven.Maven3Builder$MavenExecutionListener.mojoSucceeded(Maven3Builder.java:459)
at org.apache.maven.lifecycle.internal.DefaultExecutionEventCatapult.fire(DefaultExecutionEventCatapult.java:87)
at org.apache.maven.lifecycle.internal.DefaultExecutionEventCatapult.fire(DefaultExecutionEventCatapult.java:42)
at org.apache.maven.lifecycle.internal.MojoExecutor.execute(MojoExecutor.java:228)
at org.apache.maven.lifecycle.internal.MojoExecutor.execute(MojoExecutor.java:153)
at org.apache.maven.lifecycle.internal.MojoExecutor.execute(MojoExecutor.java:145)
at org.apache.maven.lifecycle.internal.LifecycleModuleBuilder.buildProject(LifecycleModuleBuilder.java:84)
at org.apache.maven.lifecycle.internal.LifecycleModuleBuilder.buildProject(LifecycleModuleBuilder.java:59)
at org.apache.maven.lifecycle.internal.LifecycleStarter.singleThreadedBuild(LifecycleStarter.java:183)
at org.apache.maven.lifecycle.internal.LifecycleStarter.execute(LifecycleStarter.java:161)
at org.apache.maven.DefaultMaven.doExecute(DefaultMaven.java:319)
at org.apache.maven.DefaultMaven.execute(DefaultMaven.java:156)
at org.jvnet.hudson.maven3.launcher.Maven3Launcher.main(Maven3Launcher.java:79)
... 18 more
Caused by: java.lang.reflect.UndeclaredThrowableException
at $Proxy1.fetch2(Unknown Source)
at hudson.remoting.RemoteClassLoader.findClass(RemoteClassLoader.java:122)
at java.lang.ClassLoader.loadClass(ClassLoader.java:306)
at java.lang.ClassLoader.loadClass(ClassLoader.java:247)
at com.thoughtworks.xstream.converters.reflection.SerializableConverter.<init>(SerializableConverter.java:73)
at com.thoughtworks.xstream.XStream.setupConverters(XStream.java:623)
at com.thoughtworks.xstream.XStream.<init>(XStream.java:445)
at com.thoughtworks.xstream.XStream.<init>(XStream.java:385)
at com.thoughtworks.xstream.XStream.<init>(XStream.java:323)
at hudson.util.XStream2.<init>(XStream2.java:75)
at jenkins.model.Jenkins.<clinit>(Jenkins.java:3677)
... 38 more
Caused by: java.lang.InterruptedException
at java.lang.Object.wait(Native Method)
at hudson.remoting.Request.call(Request.java:127)
at hudson.remoting.RemoteInvocationHandler.invoke(RemoteInvocationHandler.java:160)
... 49 more
channel stopped
[locks-and-latches] Releasing all the locks
[locks-and-latches] All the locks released
---------------------------------------------------------------------
To unsubscribe, e-mail: java-dev-unsubscribe@axis.apache.org
For additional commands, e-mail: java-dev-help@axis.apache.org