You are viewing a plain text version of this content. The canonical link for it is here.
Posted to notifications@qpid.apache.org by Apache Jenkins Server <je...@builds.apache.org> on 2014/01/09 21:02:35 UTC
Build failed in Jenkins: Qpid-Java-Java-MMS-TestMatrix » JDK 1.6 (latest),Ubuntu,java-mms.0-9-1 #1540
See <https://builds.apache.org/job/Qpid-Java-Java-MMS-TestMatrix/jdk=JDK%201.6%20(latest),label=Ubuntu,profile=java-mms.0-9-1/1540/changes>
Changes:
[kpvdr] QPID-5460: [linearstore] Recovery of store which contains prepared but incomplete transactions results in message loss
[kpvdr] QPID-5362: WIP: Linearstore: No store tools exist for examining the journals. This checkin is work-in-progress.
------------------------------------------
[...truncated 6077 lines...]
test:
[echo] Using profile:java-mms.0-9-1
[junit] Running org.apache.qpid.server.store.berkeleydb.jmx.BDBHAMessageStoreManagerMBeanTest
[junit] Tests run: 15, Failures: 0, Errors: 0, Time elapsed: 3.128 sec
[echo] Running ant for module : bdbstore/jmx
touch-failed:
[echo] Running ant for module : bdbstore/systests
prepare:
precompile:
compile:
[echo] Targeting : 1.6
copy-extra-resources:
[echo] Copying extra resources from /x1/jenkins/jenkins-slave/workspace/Qpid-Java-Java-MMS-TestMatrix/jdk/JDK 1.6 (latest)/label/Ubuntu/profile/java-mms.0-9-1/trunk/qpid/java/bdbstore/src/test/resources to /x1/jenkins/jenkins-slave/workspace/Qpid-Java-Java-MMS-TestMatrix/jdk/JDK 1.6 (latest)/label/Ubuntu/profile/java-mms.0-9-1/trunk/qpid/java/build/scratch/bdbstore/systests/classes...
copy-resources:
copy-project-resources-metainf:
copy-module-resources-metainf:
copy-module-src-resources-metainf:
copy-files-to-module-metainf:
jar.manifest:
jar.nomanifest:
jar:
precompile-tests:
compile-tests:
copy-test-resources:
jar-tests:
jar-sources:
libs:
copy-bin:
copy-etc:
postbuild:
copy-broker-plugin-jars-deps:
copy-broker-plugin-jars:
build:
test:
[echo] Using profile:java-mms.0-9-1
[junit] Running org.apache.qpid.server.store.berkeleydb.BDBBackupTest
[junit] Tests run: 0, Failures: 0, Errors: 0, Time elapsed: 0.016 sec
[junit] Running org.apache.qpid.server.store.berkeleydb.BDBMessageStoreTest
[junit] Tests run: 0, Failures: 0, Errors: 0, Time elapsed: 0.01 sec
[junit] Running org.apache.qpid.server.store.berkeleydb.BDBUpgradeTest
[junit] Tests run: 0, Failures: 0, Errors: 0, Time elapsed: 0.007 sec
[junit] Running org.apache.qpid.server.store.berkeleydb.HAClusterBlackboxTest
[junit] Tests run: 0, Failures: 0, Errors: 0, Time elapsed: 0.007 sec
[junit] Running org.apache.qpid.server.store.berkeleydb.HAClusterManagementTest
[junit] Tests run: 0, Failures: 0, Errors: 0, Time elapsed: 0.008 sec
[junit] Running org.apache.qpid.server.store.berkeleydb.HAClusterTwoNodeTest
[junit] Tests run: 0, Failures: 0, Errors: 0, Time elapsed: 0.007 sec
[junit] Running org.apache.qpid.server.store.berkeleydb.HAClusterWhiteboxTest
[junit] Tests run: 0, Failures: 0, Errors: 0, Time elapsed: 0.008 sec
[echo] Running ant for module : bdbstore/systests
touch-failed:
[echo] Running ant for module : perftests/visualisation-jfc
checkjfree-request-props:
[echo] Running ant for module : perftests/visualisation-jfc
jfree-licence-note:
[echo] *NOTE* The JFreeChart and JFreeCommon libraries required by this optional module are licensed under the LGPL Licence, which is not compatible with the Apache Licence v2.0.
[echo]
[echo] For a copy of the LGPL Licence, please see:
[echo] http://www.gnu.org/licenses/lgpl.html
[echo]
download-ivy:
load-ivy:
configure-ivy:
[ivy:configure] :: Ivy 2.2.0 - 20100923230623 :: http://ant.apache.org/ivy/ ::
[ivy:configure] :: loading settings :: file = /x1/jenkins/jenkins-slave/workspace/Qpid-Java-Java-MMS-TestMatrix/jdk/JDK 1.6 (latest)/label/Ubuntu/profile/java-mms.0-9-1/trunk/qpid/java/ivysettings.retrieve.xml
download-jfree:
[echo] Resolving and retrieving dependencies...
[ivy:resolve] :: resolving dependencies :: org/apache#qpid;0.27
[ivy:resolve] confs: [jfree]
[ivy:resolve] found jfree#jfreechart;1.0.13 in m2repo
[ivy:resolve] found jfree#jcommon;1.0.16 in m2repo
[ivy:resolve] :: resolution report :: resolve 56ms :: artifacts dl 1ms
---------------------------------------------------------------------
| | modules || artifacts |
| conf | number| search|dwnlded|evicted|| number|dwnlded|
---------------------------------------------------------------------
| jfree | 2 | 0 | 0 | 0 || 2 | 0 |
---------------------------------------------------------------------
[ivy:retrieve] :: retrieving :: org/apache#qpid [sync]
[ivy:retrieve] confs: [jfree]
[ivy:retrieve] 0 artifacts copied, 2 already retrieved (0kB/2ms)
check-jfree-jars:
jfree-licence-note-optional:
jfree-jar-required:
checkcsvjdbc-request-props:
[echo] Running ant for module : perftests/visualisation-jfc
csvjdbc-licence-note:
[echo] *NOTE* The CSVJDBC library required by this optional module is licensed under the LGPL Licence, which is not compatible with the Apache Licence v2.0.
[echo]
[echo] For a copy of the LGPL Licence, please see:
[echo] http://www.gnu.org/licenses/lgpl.html
[echo]
download-ivy:
load-ivy:
configure-ivy:
[ivy:configure] :: Ivy 2.2.0 - 20100923230623 :: http://ant.apache.org/ivy/ ::
[ivy:configure] :: loading settings :: file = /x1/jenkins/jenkins-slave/workspace/Qpid-Java-Java-MMS-TestMatrix/jdk/JDK 1.6 (latest)/label/Ubuntu/profile/java-mms.0-9-1/trunk/qpid/java/ivysettings.retrieve.xml
download-csvjdbc:
[echo] Resolving and retrieving dependencies...
[ivy:resolve] :: resolving dependencies :: org/apache#qpid;0.27
[ivy:resolve] confs: [csvjdbc]
[ivy:resolve] found net.sourceforge.csvjdbc#csvjdbc;1.0.8 in csvjdbc
[ivy:resolve] :: resolution report :: resolve 48ms :: artifacts dl 2ms
---------------------------------------------------------------------
| | modules || artifacts |
| conf | number| search|dwnlded|evicted|| number|dwnlded|
---------------------------------------------------------------------
| csvjdbc | 1 | 0 | 0 | 0 || 1 | 0 |
---------------------------------------------------------------------
[ivy:retrieve] :: retrieving :: org/apache#qpid [sync]
[ivy:retrieve] confs: [csvjdbc]
[ivy:retrieve] 0 artifacts copied, 1 already retrieved (0kB/3ms)
check-csvjdbc-jars:
csvjdbc-licence-note-optional:
csvjdbc-jar-required:
prepare:
precompile:
compile:
[echo] Targeting : 1.6
jar.manifest:
[jar] Building jar: /x1/jenkins/jenkins-slave/workspace/Qpid-Java-Java-MMS-TestMatrix/jdk/JDK 1.6 (latest)/label/Ubuntu/profile/java-mms.0-9-1/trunk/qpid/java/build/lib/qpid-perftests-visualisation-jfc-0.27.jar
copy-extra-resources:
copy-resources:
copy-project-resources-metainf:
copy-module-resources-metainf:
copy-module-src-resources-metainf:
copy-files-to-module-metainf:
jar.nomanifest:
jar:
precompile-tests:
compile-tests:
copy-test-resources:
jar-tests:
jar-sources:
libs:
copy-bin:
copy-etc:
postbuild:
copy-broker-plugin-jars-deps:
copy-broker-plugin-jars:
module.build:
build:
test:
[echo] Using profile:java-mms.0-9-1
[junit] Running org.apache.qpid.disttest.charting.chartbuilder.BaseChartBuilderTest
[junit] Tests run: 1, Failures: 0, Errors: 0, Time elapsed: 0.33 sec
[junit] Running org.apache.qpid.disttest.charting.chartbuilder.ChartBuilderFactoryTest
[junit] Tests run: 6, Failures: 0, Errors: 0, Time elapsed: 0.968 sec
[junit] Running org.apache.qpid.disttest.charting.chartbuilder.ChartProductionTest
[junit] Tests run: 8, Failures: 0, Errors: 0, Time elapsed: 1.058 sec
[junit] Running org.apache.qpid.disttest.charting.chartbuilder.ColorFactoryTest
[junit] Tests run: 2, Failures: 0, Errors: 0, Time elapsed: 0.021 sec
[junit] Running org.apache.qpid.disttest.charting.chartbuilder.TimeSeriesBuilderCallbackTest
[junit] Tests run: 1, Failures: 0, Errors: 0, Time elapsed: 0.017 sec
[junit] Running org.apache.qpid.disttest.charting.definition.ChartingDefinitionCreatorTest
[junit] Tests run: 4, Failures: 0, Errors: 0, Time elapsed: 2.144 sec
[junit] Running org.apache.qpid.disttest.charting.definition.SeriesDefinitionCreatorTest
[junit] Tests run: 4, Failures: 0, Errors: 0, Time elapsed: 0.031 sec
[junit] Running org.apache.qpid.disttest.charting.seriesbuilder.JdbcSeriesBuilderTest
[junit] Tests run: 1, Failures: 0, Errors: 0, Time elapsed: 0.13 sec
[junit] Running org.apache.qpid.disttest.charting.seriesbuilder.JdbcUrlGeneratorTest
[junit] Tests run: 4, Failures: 0, Errors: 0, Time elapsed: 0.035 sec
[junit] Running org.apache.qpid.disttest.charting.seriesbuilder.SeriesRowTest
[junit] Tests run: 5, Failures: 0, Errors: 0, Time elapsed: 0.031 sec
[junit] Running org.apache.qpid.disttest.charting.writer.ChartWriterTest
[junit] Tests run: 3, Failures: 0, Errors: 0, Time elapsed: 0.239 sec
[echo] Running ant for module : perftests/visualisation-jfc
touch-failed:
BUILD FAILED
/x1/jenkins/jenkins-slave/workspace/Qpid-Java-Java-MMS-TestMatrix/jdk/JDK 1.6 (latest)/label/Ubuntu/profile/java-mms.0-9-1/trunk/qpid/java/build.xml:107: TEST SUITE FAILED
Total time: 23 minutes 21 seconds
Build step 'Invoke Ant' marked build as failure
[locks-and-latches] Releasing all the locks
[locks-and-latches] All the locks released
Recording test results
Jenkins build is back to normal : Qpid-Java-Java-MMS-TestMatrix » JDK 1.6 (latest),Ubuntu,java-mms.0-9-1 #1542
Posted by Apache Jenkins Server <je...@builds.apache.org>.
See <https://builds.apache.org/job/Qpid-Java-Java-MMS-TestMatrix/jdk=JDK%201.6%20(latest),label=Ubuntu,profile=java-mms.0-9-1/1542/>
Build failed in Jenkins: Qpid-Java-Java-MMS-TestMatrix » JDK 1.6 (latest),Ubuntu,java-mms.0-9-1 #1541
Posted by Apache Jenkins Server <je...@builds.apache.org>.
See <https://builds.apache.org/job/Qpid-Java-Java-MMS-TestMatrix/jdk=JDK%201.6%20(latest),label=Ubuntu,profile=java-mms.0-9-1/1541/changes>
Changes:
[kwall] QPID-5429: [Java Broker] Exceptions causing startup failure now written to qpid.log too
Previously, such exceptions were only written to stderr. This change means that they written to qpid.log too,
allowing configuration problems etc to be understood by refering to the one file.
[aconway] QPID-5428: Heartbeats not in use when attempting to connect with python client.
Heartbeats ignored when opening a connection, could hang indefinitely
Need to cover 3 cases (test included):
- Connect sucessful but then broker stalls.
- Connect to a stalled broker that never responds.
- Fail-over to a stalled broker that never responds
All cases are handled by the following fixes to driver.py:
- Check for heartbeats even before engine._connected since we may time out
before receiving open-ok if the peer is stalled and never sends data.
- Set _last_in and _last_out so that we time heartbeats from the start of the
connection if no data is ever sent or received.
- Call self.update_status in Driver.timeout to detect connection closed due to
heartbeat timeout (rather than a readable or writeable event.)
Make update_status a no-op if engine or transport are not yet set up.
- Don't consider reconnect complete in connect(), wait till we get the open-ok.
See the comment on Driver._check_retry_ok()
[aconway] QPID-5454: Sporadic core dump in ha_tests.ReplicationTests.test_auto_delete_failover
Due to race condition Bridge::cancel using a deleted Connection object.
If the bridge is being cancelled because it is about to be created on
a new connection, then it should not attempt to send a cancel to the
remote peer since that connection is no longer valid.
------------------------------------------
[...truncated 6139 lines...]
test:
[echo] Using profile:java-mms.0-9-1
[junit] Running org.apache.qpid.server.store.berkeleydb.jmx.BDBHAMessageStoreManagerMBeanTest
[junit] Tests run: 15, Failures: 0, Errors: 0, Time elapsed: 0.451 sec
[echo] Running ant for module : bdbstore/jmx
touch-failed:
[echo] Running ant for module : bdbstore/systests
prepare:
precompile:
compile:
[echo] Targeting : 1.6
copy-extra-resources:
[echo] Copying extra resources from /home/hudson/jenkins-slave/workspace/Qpid-Java-Java-MMS-TestMatrix/jdk/JDK 1.6 (latest)/label/Ubuntu/profile/java-mms.0-9-1/trunk/qpid/java/bdbstore/src/test/resources to /home/hudson/jenkins-slave/workspace/Qpid-Java-Java-MMS-TestMatrix/jdk/JDK 1.6 (latest)/label/Ubuntu/profile/java-mms.0-9-1/trunk/qpid/java/build/scratch/bdbstore/systests/classes...
copy-resources:
copy-project-resources-metainf:
copy-module-resources-metainf:
copy-module-src-resources-metainf:
copy-files-to-module-metainf:
jar.manifest:
jar.nomanifest:
jar:
precompile-tests:
compile-tests:
copy-test-resources:
jar-tests:
jar-sources:
libs:
copy-bin:
copy-etc:
postbuild:
copy-broker-plugin-jars-deps:
copy-broker-plugin-jars:
build:
test:
[echo] Using profile:java-mms.0-9-1
[junit] Running org.apache.qpid.server.store.berkeleydb.BDBBackupTest
[junit] Tests run: 0, Failures: 0, Errors: 0, Time elapsed: 0.021 sec
[junit] Running org.apache.qpid.server.store.berkeleydb.BDBMessageStoreTest
[junit] Tests run: 0, Failures: 0, Errors: 0, Time elapsed: 0.012 sec
[junit] Running org.apache.qpid.server.store.berkeleydb.BDBUpgradeTest
[junit] Tests run: 0, Failures: 0, Errors: 0, Time elapsed: 0.01 sec
[junit] Running org.apache.qpid.server.store.berkeleydb.HAClusterBlackboxTest
[junit] Tests run: 0, Failures: 0, Errors: 0, Time elapsed: 0.009 sec
[junit] Running org.apache.qpid.server.store.berkeleydb.HAClusterManagementTest
[junit] Tests run: 0, Failures: 0, Errors: 0, Time elapsed: 0.009 sec
[junit] Running org.apache.qpid.server.store.berkeleydb.HAClusterTwoNodeTest
[junit] Tests run: 0, Failures: 0, Errors: 0, Time elapsed: 0.009 sec
[junit] Running org.apache.qpid.server.store.berkeleydb.HAClusterWhiteboxTest
[junit] Tests run: 0, Failures: 0, Errors: 0, Time elapsed: 0.008 sec
[echo] Running ant for module : bdbstore/systests
touch-failed:
[echo] Running ant for module : perftests/visualisation-jfc
checkjfree-request-props:
[echo] Running ant for module : perftests/visualisation-jfc
jfree-licence-note:
[echo] *NOTE* The JFreeChart and JFreeCommon libraries required by this optional module are licensed under the LGPL Licence, which is not compatible with the Apache Licence v2.0.
[echo]
[echo] For a copy of the LGPL Licence, please see:
[echo] http://www.gnu.org/licenses/lgpl.html
[echo]
download-ivy:
load-ivy:
configure-ivy:
[ivy:configure] :: Ivy 2.2.0 - 20100923230623 :: http://ant.apache.org/ivy/ ::
[ivy:configure] :: loading settings :: file = /home/hudson/jenkins-slave/workspace/Qpid-Java-Java-MMS-TestMatrix/jdk/JDK 1.6 (latest)/label/Ubuntu/profile/java-mms.0-9-1/trunk/qpid/java/ivysettings.retrieve.xml
download-jfree:
[echo] Resolving and retrieving dependencies...
[ivy:resolve] :: resolving dependencies :: org/apache#qpid;0.27
[ivy:resolve] confs: [jfree]
[ivy:resolve] found jfree#jfreechart;1.0.13 in m2repo
[ivy:resolve] found jfree#jcommon;1.0.16 in m2repo
[ivy:resolve] :: resolution report :: resolve 95ms :: artifacts dl 12ms
---------------------------------------------------------------------
| | modules || artifacts |
| conf | number| search|dwnlded|evicted|| number|dwnlded|
---------------------------------------------------------------------
| jfree | 2 | 0 | 0 | 0 || 2 | 0 |
---------------------------------------------------------------------
[ivy:retrieve] :: retrieving :: org/apache#qpid [sync]
[ivy:retrieve] confs: [jfree]
[ivy:retrieve] 0 artifacts copied, 2 already retrieved (0kB/15ms)
check-jfree-jars:
jfree-licence-note-optional:
jfree-jar-required:
checkcsvjdbc-request-props:
[echo] Running ant for module : perftests/visualisation-jfc
csvjdbc-licence-note:
[echo] *NOTE* The CSVJDBC library required by this optional module is licensed under the LGPL Licence, which is not compatible with the Apache Licence v2.0.
[echo]
[echo] For a copy of the LGPL Licence, please see:
[echo] http://www.gnu.org/licenses/lgpl.html
[echo]
download-ivy:
load-ivy:
configure-ivy:
[ivy:configure] :: Ivy 2.2.0 - 20100923230623 :: http://ant.apache.org/ivy/ ::
[ivy:configure] :: loading settings :: file = /home/hudson/jenkins-slave/workspace/Qpid-Java-Java-MMS-TestMatrix/jdk/JDK 1.6 (latest)/label/Ubuntu/profile/java-mms.0-9-1/trunk/qpid/java/ivysettings.retrieve.xml
download-csvjdbc:
[echo] Resolving and retrieving dependencies...
[ivy:resolve] :: resolving dependencies :: org/apache#qpid;0.27
[ivy:resolve] confs: [csvjdbc]
[ivy:resolve] found net.sourceforge.csvjdbc#csvjdbc;1.0.8 in csvjdbc
[ivy:resolve] :: resolution report :: resolve 93ms :: artifacts dl 15ms
---------------------------------------------------------------------
| | modules || artifacts |
| conf | number| search|dwnlded|evicted|| number|dwnlded|
---------------------------------------------------------------------
| csvjdbc | 1 | 0 | 0 | 0 || 1 | 0 |
---------------------------------------------------------------------
[ivy:retrieve] :: retrieving :: org/apache#qpid [sync]
[ivy:retrieve] confs: [csvjdbc]
[ivy:retrieve] 0 artifacts copied, 1 already retrieved (0kB/11ms)
check-csvjdbc-jars:
csvjdbc-licence-note-optional:
csvjdbc-jar-required:
prepare:
precompile:
compile:
[echo] Targeting : 1.6
jar.manifest:
[jar] Building jar: /home/hudson/jenkins-slave/workspace/Qpid-Java-Java-MMS-TestMatrix/jdk/JDK 1.6 (latest)/label/Ubuntu/profile/java-mms.0-9-1/trunk/qpid/java/build/lib/qpid-perftests-visualisation-jfc-0.27.jar
copy-extra-resources:
copy-resources:
copy-project-resources-metainf:
copy-module-resources-metainf:
copy-module-src-resources-metainf:
copy-files-to-module-metainf:
jar.nomanifest:
jar:
precompile-tests:
compile-tests:
copy-test-resources:
jar-tests:
jar-sources:
libs:
copy-bin:
copy-etc:
postbuild:
copy-broker-plugin-jars-deps:
copy-broker-plugin-jars:
module.build:
build:
test:
[echo] Using profile:java-mms.0-9-1
[junit] Running org.apache.qpid.disttest.charting.chartbuilder.BaseChartBuilderTest
[junit] Tests run: 1, Failures: 0, Errors: 0, Time elapsed: 1.091 sec
[junit] Running org.apache.qpid.disttest.charting.chartbuilder.ChartBuilderFactoryTest
[junit] Tests run: 6, Failures: 0, Errors: 0, Time elapsed: 0.016 sec
[junit] Running org.apache.qpid.disttest.charting.chartbuilder.ChartProductionTest
[junit] Tests run: 8, Failures: 0, Errors: 0, Time elapsed: 3.288 sec
[junit] Running org.apache.qpid.disttest.charting.chartbuilder.ColorFactoryTest
[junit] Tests run: 2, Failures: 0, Errors: 0, Time elapsed: 0.01 sec
[junit] Running org.apache.qpid.disttest.charting.chartbuilder.TimeSeriesBuilderCallbackTest
[junit] Tests run: 1, Failures: 0, Errors: 0, Time elapsed: 0.013 sec
[junit] Running org.apache.qpid.disttest.charting.definition.ChartingDefinitionCreatorTest
[junit] Tests run: 4, Failures: 0, Errors: 0, Time elapsed: 0.042 sec
[junit] Running org.apache.qpid.disttest.charting.definition.SeriesDefinitionCreatorTest
[junit] Tests run: 4, Failures: 0, Errors: 0, Time elapsed: 0.012 sec
[junit] Running org.apache.qpid.disttest.charting.seriesbuilder.JdbcSeriesBuilderTest
[junit] Tests run: 1, Failures: 0, Errors: 0, Time elapsed: 0.337 sec
[junit] Running org.apache.qpid.disttest.charting.seriesbuilder.JdbcUrlGeneratorTest
[junit] Tests run: 4, Failures: 0, Errors: 0, Time elapsed: 0.009 sec
[junit] Running org.apache.qpid.disttest.charting.seriesbuilder.SeriesRowTest
[junit] Tests run: 5, Failures: 0, Errors: 0, Time elapsed: 0.008 sec
[junit] Running org.apache.qpid.disttest.charting.writer.ChartWriterTest
[junit] Tests run: 3, Failures: 0, Errors: 0, Time elapsed: 0.309 sec
[echo] Running ant for module : perftests/visualisation-jfc
touch-failed:
BUILD FAILED
/home/hudson/jenkins-slave/workspace/Qpid-Java-Java-MMS-TestMatrix/jdk/JDK 1.6 (latest)/label/Ubuntu/profile/java-mms.0-9-1/trunk/qpid/java/build.xml:107: TEST SUITE FAILED
Total time: 19 minutes 1 second
Build step 'Invoke Ant' marked build as failure
[locks-and-latches] Releasing all the locks
[locks-and-latches] All the locks released
Recording test results