You are viewing a plain text version of this content. The canonical link for it is here.
Posted to notifications@maven.apache.org by Apache Jenkins Server <je...@builds.apache.org> on 2017/01/14 05:14:17 UTC
Build failed in Jenkins: maven-plugin-tools-windows #116
See <https://builds.apache.org/job/maven-plugin-tools-windows/116/changes>
Changes:
[hboutemy] [MPLUGIN-319] renamed parameter, improved documentation, and removed readonly
[hboutemy] [MPLUGIN-319] improved javadoc
[hboutemy] [MPLUGIN-319] added @since
------------------------------------------
[...truncated 1092 lines...]
[INFO] Building: mplugin-223\pom.xml
[INFO] run script verify.groovy
[INFO] ..SUCCESS (8.2 s)
[INFO] Building: mplugin-272_java8\pom.xml
[INFO] ..SKIPPED due to JRE version
[INFO] Building: mplugin-299_no-configuration\pom.xml
[INFO] ..SUCCESS (12.1 s)
[INFO] Building: mplugin-305_defaultMojoDependencies\pom.xml
[INFO] run script verify.groovy
[INFO] ..SUCCESS (9.9 s)
[INFO] Building: mplugin-305_emptyMojoDependencies\pom.xml
[INFO] run script verify.groovy
[INFO] ..SUCCESS (8.1 s)
[INFO] Building: mplugin-305_singleMojoDependencies\pom.xml
[INFO] run script verify.groovy
[INFO] ..SUCCESS (8.5 s)
[INFO] Building: mplugin-319_report-since\pom.xml
[INFO] run script verify.groovy
[INFO] ..SUCCESS (8.7 s)
[INFO] Building: packaging-jar\pom.xml
[INFO] run script verify.groovy
[INFO] ..SUCCESS (10.8 s)
[INFO] Building: plugin-info-jdk\pom.xml
[INFO] run script verify.groovy
[INFO] ..FAILED (14.8 s)
[INFO] The post-build script did not succeed. assert new File( basedir, 'property/target/site/plugin-info.html' ).text.contains( '<td>1.3</td>' )
| | | |
| | | false
| | <!DOCTYPE html PUBLIC "-//W3C//DTD XHTML 1.0 Transitional//EN" "http://www.w3.org/TR/xhtml1/DTD/xhtml1-transitional.dtd">
| | <!-- Generated by Apache Maven Doxia Site Renderer 1.4 at 2017-01-14 -->
| | <html xmlns="http://www.w3.org/1999/xhtml" xml:lang="en" lang="en">
| | <head>
| | <meta http-equiv="Content-Type" content="text/html; charset=UTF-8" />
| | <title>target bytecode defined by maven.compiler.target property - Plugin Documentation</title>
| | <style type="text/css" media="all">
| | @import url("./css/maven-base.css");
| | @import url("./css/maven-theme.css");
| | @import url("./css/site.css");
| | </style>
| | <link rel="stylesheet" href="./css/print.css" type="text/css" media="print" />
| | <meta name="Date-Revision-yyyymmdd" content="20170114" />
| | <meta http-equiv="Content-Language" content="en" />
| |
| | </head>
| | <body class="composite">
| | <div id="banner">
| | <div id="bannerLeft">
| | target bytecode defined by maven.compiler.target property
| | </div>
| | <div class="clear">
| | <hr/>
| | </div>
| | </div>
| | <div id="breadcrumbs">
| |
| |
| | <div class="xleft">
| | <span id="publishDate">Last Published: 2017-01-14</span>
| | | <span id="projectVersion">Version: 1.0-SNAPSHOT</span>
| | </div>
| | <div class="xright"> <a href="${project.url}" title="target bytecode defined by maven.compiler.target property">target bytecode defined by maven.compiler.target property</a>
| |
| |
| | </div>
| | <div class="clear">
| | <hr/>
| | </div>
| | </div>
| | <div id="leftColumn">
| | <div id="navcolumn">
| |
| |
| | <h5>Parent Project</h5>
| | <ul>
| | <li class="none">
| | <a href="../index.html" title="parent">parent</a>
| | </li>
| | </ul>
| | <h5>Project Documentation</h5>
| | <ul>
| | <li class="collapsed">
| | <a href="project-info.html" title="Project Information">Project Information</a>
| | </li>
| | <li class="expanded">
| | <a href="project-reports.html" title="Project Reports">Project Reports</a>
| | <ul>
| | <li class="none">
| | <strong>Plugin Documentation</strong>
| | </li>
| | </ul>
| | </li>
| | </ul>
| | <a href="http://maven.apache.org/" title="Built by Maven" class="poweredBy">
| | <img class="poweredBy" alt="Built by Maven" src="./images/logos/maven-feather.png" />
| | </a>
| |
| |
| | </div>
| | </div>
| | <div id="bodyColumn">
| | <div id="contentBox">
| | <div class="section">
| | <h2>Plugin Documentation<a name="Plugin_Documentation"></a></h2><a name="Plugin_Documentation"></a>
| | <p>No goals defined in this plugin.</p></div>
| | </div>
| | </div>
| | <div class="clear">
| | <hr/>
| | </div>
| | <div id="footer">
| | <div class="xright">
| | Copyright © 2017.
| | All Rights Reserved.
| |
| | </div>
| | <div class="clear">
| | <hr/>
| | </div>
| | </div>
| | </body>
| | </html>
| F:\jenkins\jenkins-slave\workspace\maven-plugin-tools-windows\maven-plugin-plugin\target\it\plugin-info-jdk
F:\jenkins\jenkins-slave\workspace\maven-plugin-tools-windows\maven-plugin-plugin\target\it\plugin-info-jdk\property\target\site\plugin-info.html
[INFO] Building: plugin-info-jdk-default-version\pom.xml
[INFO] run script verify.groovy
[INFO] ..SUCCESS (8.2 s)
[INFO] Building: plugin-report\pom.xml
[INFO] run script verify.bsh
[INFO] ..SUCCESS (27.3 s)
[INFO] Building: plugin-report-annotations\pom.xml
[INFO] run script verify.bsh
[INFO] ..SUCCESS (12.9 s)
[INFO] Building: skip\pom.xml
[INFO] run script verify.groovy
[INFO] ..SUCCESS (6.5 s)
[INFO] Building: source-encoding\pom.xml
[INFO] run script verify.groovy
[INFO] ..SUCCESS (8.2 s)
[INFO] -------------------------------------------------
[INFO] Build Summary:
[INFO] Passed: 28, Failed: 1, Errors: 0, Skipped: 2
[INFO] -------------------------------------------------
[ERROR] The following builds failed:
[ERROR] * plugin-info-jdk\pom.xml
[INFO] -------------------------------------------------
[INFO] ------------------------------------------------------------------------
[INFO] Reactor Summary:
[INFO]
[INFO] Maven Plugin Tools ................................ SUCCESS [15.415s]
[INFO] Maven Plugin Tools Extractor API .................. SUCCESS [1:05.172s]
[INFO] Maven Plugin Tools Generators ..................... SUCCESS [11.208s]
[INFO] Maven Plugin Tool for Java with Javadoc Tags ...... SUCCESS [11.829s]
[INFO] Maven Plugin Tools Java 5 Annotations ............. SUCCESS [5.708s]
[INFO] Maven Plugin Tool for Java with Annotations ....... SUCCESS [13.592s]
[INFO] Maven Plugin Tools Javadoc Taglets ................ SUCCESS [19.703s]
[INFO] Maven Script Mojo Support ......................... SUCCESS [3.243s]
[INFO] Maven Plugin Metadata Model ....................... SUCCESS [9.508s]
[INFO] Maven Plugin Tool for Ant ......................... SUCCESS [7.105s]
[INFO] Maven Ant Mojo Support ............................ SUCCESS [7.585s]
[INFO] Maven Plugin Tool for Beanshell ................... SUCCESS [4.735s]
[INFO] Maven Beanshell Mojo Support ...................... SUCCESS [5.439s]
[INFO] Maven Plugin Plugin ............................... FAILURE [6:23.556s]
[INFO] ------------------------------------------------------------------------
[INFO] BUILD FAILURE
[INFO] ------------------------------------------------------------------------
[INFO] Total time: 9:58.921s
[INFO] Finished at: Sat Jan 14 05:13:11 PST 2017
[INFO] Final Memory: 64M/844M
[INFO] ------------------------------------------------------------------------
Waiting for Jenkins to finish collecting data
[ERROR] Failed to execute goal org.apache.maven.plugins:maven-invoker-plugin:1.10:run (integration-test) on project maven-plugin-plugin: 1 build failed. See console output above for details. -> [Help 1]
org.apache.maven.lifecycle.LifecycleExecutionException: Failed to execute goal org.apache.maven.plugins:maven-invoker-plugin:1.10:run (integration-test) on project maven-plugin-plugin: 1 build failed. See console output above for details.
at org.apache.maven.lifecycle.internal.MojoExecutor.execute(MojoExecutor.java:213)
at org.apache.maven.lifecycle.internal.MojoExecutor.execute(MojoExecutor.java:153)
at org.apache.maven.lifecycle.internal.MojoExecutor.execute(MojoExecutor.java:145)
at org.apache.maven.lifecycle.internal.LifecycleModuleBuilder.buildProject(LifecycleModuleBuilder.java:84)
at org.apache.maven.lifecycle.internal.LifecycleModuleBuilder.buildProject(LifecycleModuleBuilder.java:59)
at org.apache.maven.lifecycle.internal.LifecycleStarter.singleThreadedBuild(LifecycleStarter.java:183)
at org.apache.maven.lifecycle.internal.LifecycleStarter.execute(LifecycleStarter.java:161)
at org.apache.maven.DefaultMaven.doExecute(DefaultMaven.java:320)
at org.apache.maven.DefaultMaven.execute(DefaultMaven.java:156)
at org.jvnet.hudson.maven3.launcher.Maven3Launcher.main(Maven3Launcher.java:117)
at sun.reflect.NativeMethodAccessorImpl.invoke0(Native Method)
at sun.reflect.NativeMethodAccessorImpl.invoke(NativeMethodAccessorImpl.java:57)
at sun.reflect.DelegatingMethodAccessorImpl.invoke(DelegatingMethodAccessorImpl.java:43)
at java.lang.reflect.Method.invoke(Method.java:606)
at org.codehaus.plexus.classworlds.launcher.Launcher.launchStandard(Launcher.java:329)
at org.codehaus.plexus.classworlds.launcher.Launcher.launch(Launcher.java:239)
at org.jvnet.hudson.maven3.agent.Maven3Main.launch(Maven3Main.java:181)
at sun.reflect.NativeMethodAccessorImpl.invoke0(Native Method)
at sun.reflect.NativeMethodAccessorImpl.invoke(NativeMethodAccessorImpl.java:57)
at sun.reflect.DelegatingMethodAccessorImpl.invoke(DelegatingMethodAccessorImpl.java:43)
at java.lang.reflect.Method.invoke(Method.java:606)
at hudson.maven.Maven3Builder.call(Maven3Builder.java:136)
at hudson.maven.Maven3Builder.call(Maven3Builder.java:71)
at hudson.remoting.UserRequest.perform(UserRequest.java:120)
at hudson.remoting.UserRequest.perform(UserRequest.java:48)
at hudson.remoting.Request$2.run(Request.java:326)
at hudson.remoting.InterceptingExecutorService$1.call(InterceptingExecutorService.java:68)
at java.util.concurrent.FutureTask.run(FutureTask.java:262)
at java.util.concurrent.ThreadPoolExecutor.runWorker(ThreadPoolExecutor.java:1145)
at java.util.concurrent.ThreadPoolExecutor$Worker.run(ThreadPoolExecutor.java:615)
at java.lang.Thread.run(Thread.java:745)
Caused by: org.apache.maven.plugin.MojoFailureException: 1 build failed. See console output above for details.
at org.apache.maven.plugin.invoker.InvokerSession.handleFailures(InvokerSession.java:258)
at org.apache.maven.plugin.invoker.InvokerMojo.processResults(InvokerMojo.java:69)
at org.apache.maven.plugin.invoker.AbstractInvokerMojo.execute(AbstractInvokerMojo.java:741)
at org.apache.maven.plugin.DefaultBuildPluginManager.executeMojo(DefaultBuildPluginManager.java:101)
at org.apache.maven.lifecycle.internal.MojoExecutor.execute(MojoExecutor.java:209)
... 30 more
[ERROR]
[ERROR] Re-run Maven using the -X switch to enable full debug logging.
[ERROR]
[ERROR] For more information about the errors and possible solutions, please read the following articles:
[ERROR] [Help 1] http://cwiki.apache.org/confluence/display/MAVEN/MojoFailureException
[ERROR]
[ERROR] After correcting the problems, you can resume the build with the command
[ERROR] mvn <goals> -rf :maven-plugin-plugin
[JENKINS] Archiving F:\jenkins\jenkins-slave\workspace\maven-plugin-tools-windows\maven-plugin-plugin\pom.xml to org.apache.maven.plugins/maven-plugin-plugin/3.6-SNAPSHOT/maven-plugin-plugin-3.6-SNAPSHOT.pom
[JENKINS] Archiving F:\jenkins\jenkins-slave\workspace\maven-plugin-tools-windows\maven-plugin-plugin\target\maven-plugin-plugin-3.6-SNAPSHOT.jar to org.apache.maven.plugins/maven-plugin-plugin/3.6-SNAPSHOT/maven-plugin-plugin-3.6-SNAPSHOT.jar
[JENKINS] Archiving F:\jenkins\jenkins-slave\workspace\maven-plugin-tools-windows\maven-plugin-tools-java\pom.xml to org.apache.maven.plugin-tools/maven-plugin-tools-java/3.6-SNAPSHOT/maven-plugin-tools-java-3.6-SNAPSHOT.pom
[JENKINS] Archiving F:\jenkins\jenkins-slave\workspace\maven-plugin-tools-windows\maven-plugin-tools-java\target\maven-plugin-tools-java-3.6-SNAPSHOT.jar to org.apache.maven.plugin-tools/maven-plugin-tools-java/3.6-SNAPSHOT/maven-plugin-tools-java-3.6-SNAPSHOT.jar
[JENKINS] Archiving F:\jenkins\jenkins-slave\workspace\maven-plugin-tools-windows\maven-script\maven-plugin-tools-ant\pom.xml to org.apache.maven.plugin-tools/maven-plugin-tools-ant/3.6-SNAPSHOT/maven-plugin-tools-ant-3.6-SNAPSHOT.pom
[JENKINS] Archiving F:\jenkins\jenkins-slave\workspace\maven-plugin-tools-windows\maven-script\maven-plugin-tools-ant\target\maven-plugin-tools-ant-3.6-SNAPSHOT.jar to org.apache.maven.plugin-tools/maven-plugin-tools-ant/3.6-SNAPSHOT/maven-plugin-tools-ant-3.6-SNAPSHOT.jar
[JENKINS] Archiving F:\jenkins\jenkins-slave\workspace\maven-plugin-tools-windows\maven-script\pom.xml to org.apache.maven.plugin-tools/maven-script/3.6-SNAPSHOT/maven-script-3.6-SNAPSHOT.pom
[JENKINS] Archiving F:\jenkins\jenkins-slave\workspace\maven-plugin-tools-windows\maven-script\target\maven-script-3.6-SNAPSHOT-site.xml to org.apache.maven.plugin-tools/maven-script/3.6-SNAPSHOT/maven-script-3.6-SNAPSHOT-site.xml
[JENKINS] Archiving F:\jenkins\jenkins-slave\workspace\maven-plugin-tools-windows\maven-plugin-tools-javadoc\pom.xml to org.apache.maven.plugin-tools/maven-plugin-tools-javadoc/3.6-SNAPSHOT/maven-plugin-tools-javadoc-3.6-SNAPSHOT.pom
[JENKINS] Archiving F:\jenkins\jenkins-slave\workspace\maven-plugin-tools-windows\maven-plugin-tools-javadoc\target\maven-plugin-tools-javadoc-3.6-SNAPSHOT.jar to org.apache.maven.plugin-tools/maven-plugin-tools-javadoc/3.6-SNAPSHOT/maven-plugin-tools-javadoc-3.6-SNAPSHOT.jar
[JENKINS] Archiving <https://builds.apache.org/job/maven-plugin-tools-windows/ws/pom.xml> to org.apache.maven.plugin-tools/maven-plugin-tools/3.6-SNAPSHOT/maven-plugin-tools-3.6-SNAPSHOT.pom
[JENKINS] Archiving <https://builds.apache.org/job/maven-plugin-tools-windows/ws/target\maven-plugin-tools-3.6-SNAPSHOT-site.xml> to org.apache.maven.plugin-tools/maven-plugin-tools/3.6-SNAPSHOT/maven-plugin-tools-3.6-SNAPSHOT-site.xml
[JENKINS] Archiving F:\jenkins\jenkins-slave\workspace\maven-plugin-tools-windows\maven-plugin-annotations\pom.xml to org.apache.maven.plugin-tools/maven-plugin-annotations/3.6-SNAPSHOT/maven-plugin-annotations-3.6-SNAPSHOT.pom
[JENKINS] Archiving F:\jenkins\jenkins-slave\workspace\maven-plugin-tools-windows\maven-plugin-annotations\target\maven-plugin-annotations-3.6-SNAPSHOT.jar to org.apache.maven.plugin-tools/maven-plugin-annotations/3.6-SNAPSHOT/maven-plugin-annotations-3.6-SNAPSHOT.jar
[JENKINS] Archiving F:\jenkins\jenkins-slave\workspace\maven-plugin-tools-windows\maven-script\maven-script-ant\pom.xml to org.apache.maven.plugin-tools/maven-script-ant/3.6-SNAPSHOT/maven-script-ant-3.6-SNAPSHOT.pom
[JENKINS] Archiving F:\jenkins\jenkins-slave\workspace\maven-plugin-tools-windows\maven-script\maven-script-ant\target\maven-script-ant-3.6-SNAPSHOT.jar to org.apache.maven.plugin-tools/maven-script-ant/3.6-SNAPSHOT/maven-script-ant-3.6-SNAPSHOT.jar
[JENKINS] Archiving F:\jenkins\jenkins-slave\workspace\maven-plugin-tools-windows\maven-script\maven-script-beanshell\pom.xml to org.apache.maven.plugin-tools/maven-script-beanshell/3.6-SNAPSHOT/maven-script-beanshell-3.6-SNAPSHOT.pom
[JENKINS] Archiving F:\jenkins\jenkins-slave\workspace\maven-plugin-tools-windows\maven-script\maven-script-beanshell\target\maven-script-beanshell-3.6-SNAPSHOT.jar to org.apache.maven.plugin-tools/maven-script-beanshell/3.6-SNAPSHOT/maven-script-beanshell-3.6-SNAPSHOT.jar
[JENKINS] Archiving F:\jenkins\jenkins-slave\workspace\maven-plugin-tools-windows\maven-plugin-tools-generators\pom.xml to org.apache.maven.plugin-tools/maven-plugin-tools-generators/3.6-SNAPSHOT/maven-plugin-tools-generators-3.6-SNAPSHOT.pom
[JENKINS] Archiving F:\jenkins\jenkins-slave\workspace\maven-plugin-tools-windows\maven-plugin-tools-generators\target\maven-plugin-tools-generators-3.6-SNAPSHOT.jar to org.apache.maven.plugin-tools/maven-plugin-tools-generators/3.6-SNAPSHOT/maven-plugin-tools-generators-3.6-SNAPSHOT.jar
[JENKINS] Archiving F:\jenkins\jenkins-slave\workspace\maven-plugin-tools-windows\maven-plugin-tools-api\pom.xml to org.apache.maven.plugin-tools/maven-plugin-tools-api/3.6-SNAPSHOT/maven-plugin-tools-api-3.6-SNAPSHOT.pom
[JENKINS] Archiving F:\jenkins\jenkins-slave\workspace\maven-plugin-tools-windows\maven-plugin-tools-api\target\maven-plugin-tools-api-3.6-SNAPSHOT.jar to org.apache.maven.plugin-tools/maven-plugin-tools-api/3.6-SNAPSHOT/maven-plugin-tools-api-3.6-SNAPSHOT.jar
[JENKINS] Archiving F:\jenkins\jenkins-slave\workspace\maven-plugin-tools-windows\maven-script\maven-plugin-tools-beanshell\pom.xml to org.apache.maven.plugin-tools/maven-plugin-tools-beanshell/3.6-SNAPSHOT/maven-plugin-tools-beanshell-3.6-SNAPSHOT.pom
[JENKINS] Archiving F:\jenkins\jenkins-slave\workspace\maven-plugin-tools-windows\maven-script\maven-plugin-tools-beanshell\target\maven-plugin-tools-beanshell-3.6-SNAPSHOT.jar to org.apache.maven.plugin-tools/maven-plugin-tools-beanshell/3.6-SNAPSHOT/maven-plugin-tools-beanshell-3.6-SNAPSHOT.jar
[JENKINS] Archiving F:\jenkins\jenkins-slave\workspace\maven-plugin-tools-windows\maven-plugin-tools-annotations\pom.xml to org.apache.maven.plugin-tools/maven-plugin-tools-annotations/3.6-SNAPSHOT/maven-plugin-tools-annotations-3.6-SNAPSHOT.pom
[JENKINS] Archiving F:\jenkins\jenkins-slave\workspace\maven-plugin-tools-windows\maven-plugin-tools-annotations\target\maven-plugin-tools-annotations-3.6-SNAPSHOT.jar to org.apache.maven.plugin-tools/maven-plugin-tools-annotations/3.6-SNAPSHOT/maven-plugin-tools-annotations-3.6-SNAPSHOT.jar
[JENKINS] Archiving F:\jenkins\jenkins-slave\workspace\maven-plugin-tools-windows\maven-plugin-tools-annotations\target\maven-plugin-tools-annotations-3.6-SNAPSHOT-tests.jar to org.apache.maven.plugin-tools/maven-plugin-tools-annotations/3.6-SNAPSHOT/maven-plugin-tools-annotations-3.6-SNAPSHOT-tests.jar
[JENKINS] Archiving F:\jenkins\jenkins-slave\workspace\maven-plugin-tools-windows\maven-plugin-tools-annotations\target\maven-plugin-tools-annotations-3.6-SNAPSHOT-test-sources.jar to org.apache.maven.plugin-tools/maven-plugin-tools-annotations/3.6-SNAPSHOT/maven-plugin-tools-annotations-3.6-SNAPSHOT-test-sources.jar
[JENKINS] Archiving F:\jenkins\jenkins-slave\workspace\maven-plugin-tools-windows\maven-script\maven-plugin-tools-model\pom.xml to org.apache.maven.plugin-tools/maven-plugin-tools-model/3.6-SNAPSHOT/maven-plugin-tools-model-3.6-SNAPSHOT.pom
[JENKINS] Archiving F:\jenkins\jenkins-slave\workspace\maven-plugin-tools-windows\maven-script\maven-plugin-tools-model\target\maven-plugin-tools-model-3.6-SNAPSHOT.jar to org.apache.maven.plugin-tools/maven-plugin-tools-model/3.6-SNAPSHOT/maven-plugin-tools-model-3.6-SNAPSHOT.jar
channel stopped
Jenkins build is back to normal : maven-plugin-tools-windows #117
Posted by Apache Jenkins Server <je...@builds.apache.org>.
See <https://builds.apache.org/job/maven-plugin-tools-windows/117/changes>