You are viewing a plain text version of this content. The canonical link for it is here.
Posted to dev@sling.apache.org by "Bertrand Delacretaz (Jira)" <ji...@apache.org> on 2020/11/10 18:05:00 UTC

[jira] [Updated] (SLING-9892) adapter-annotations integration tests sometimes fail

     [ https://issues.apache.org/jira/browse/SLING-9892?page=com.atlassian.jira.plugin.system.issuetabpanels:all-tabpanel ]

Bertrand Delacretaz updated SLING-9892:
---------------------------------------
    Fix Version/s: Adapter Annotations 2.0.2

> adapter-annotations integration tests sometimes fail
> ----------------------------------------------------
>
>                 Key: SLING-9892
>                 URL: https://issues.apache.org/jira/browse/SLING-9892
>             Project: Sling
>          Issue Type: Bug
>          Components: Engine, Extensions
>    Affects Versions: Adapter Annotations (JSON) 1.0.0
>            Reporter: Bertrand Delacretaz
>            Priority: Minor
>             Fix For: Adapter Annotations 2.0.2
>
>
> I have marked two such failing builds at [https://ci-builds.apache.org/job/Sling/job/modules/job/sling-org-apache-sling-adapter-annotations/job/master/] as "keep forever", the error is apparently always
> {code}
> [INFO] [ERROR] Tests run: 1, Failures: 0, Errors: 1, Skipped: 0, Time elapsed: 11.235 s <<< FAILURE! - in org.apache.sling.adapter.annotations.AdapterRegistrationIT
> [INFO] [ERROR] org.apache.sling.adapter.annotations.AdapterRegistrationIT  Time elapsed: 11.21 s  <<< ERROR!
> [INFO] java.lang.RuntimeException: Could not read content from response
> [INFO] 	at org.apache.sling.adapter.annotations.AdapterRegistrationIT.setUpAdaptions(AdapterRegistrationIT.java:58)
> [INFO] Caused by: org.apache.http.MalformedChunkCodingException: CRLF expected at end of chunk
> [INFO] 	at org.apache.sling.adapter.annotations.AdapterRegistrationIT.setUpAdaptions(AdapterRegistrationIT.java:58)
> [INFO] 
> {code}



--
This message was sent by Atlassian Jira
(v8.3.4#803005)