You are viewing a plain text version of this content. The canonical link for it is here.
Posted to dev@lucene.apache.org by Apache Jenkins Server <je...@builds.apache.org> on 2019/01/04 13:05:45 UTC

[JENKINS] Lucene-Solr-Tests-7.x - Build # 1186 - Unstable

Build: https://builds.apache.org/job/Lucene-Solr-Tests-7.x/1186/

1 tests failed.
FAILED:  org.apache.solr.core.TestDynamicLoading.testDynamicLoading

Error Message:
Could not get expected value  'org.apache.solr.core.BlobStoreTestRequestHandler' for path 'overlay/requestHandler/\/test1/class' full output: {   "responseHeader":{     "status":0,     "QTime":0},   "overlay":{     "znodeVersion":0,     "runtimeLib":{"colltest":{         "name":"colltest",         "version":1}}}},  from server:  null

Stack Trace:
java.lang.AssertionError: Could not get expected value  'org.apache.solr.core.BlobStoreTestRequestHandler' for path 'overlay/requestHandler/\/test1/class' full output: {
  "responseHeader":{
    "status":0,
    "QTime":0},
  "overlay":{
    "znodeVersion":0,
    "runtimeLib":{"colltest":{
        "name":"colltest",
        "version":1}}}},  from server:  null
	at __randomizedtesting.SeedInfo.seed([A6F39AE2C0D7A026:7EBEB7B5370A0586]:0)
	at org.junit.Assert.fail(Assert.java:88)
	at org.junit.Assert.assertTrue(Assert.java:41)
	at org.apache.solr.core.TestSolrConfigHandler.testForResponseElement(TestSolrConfigHandler.java:590)
	at org.apache.solr.core.TestDynamicLoading.testDynamicLoading(TestDynamicLoading.java:80)
	at sun.reflect.NativeMethodAccessorImpl.invoke0(Native Method)
	at sun.reflect.NativeMethodAccessorImpl.invoke(NativeMethodAccessorImpl.java:62)
	at sun.reflect.DelegatingMethodAccessorImpl.invoke(DelegatingMethodAccessorImpl.java:43)
	at java.lang.reflect.Method.invoke(Method.java:498)
	at com.carrotsearch.randomizedtesting.RandomizedRunner.invoke(RandomizedRunner.java:1750)
	at com.carrotsearch.randomizedtesting.RandomizedRunner$8.evaluate(RandomizedRunner.java:938)
	at com.carrotsearch.randomizedtesting.RandomizedRunner$9.evaluate(RandomizedRunner.java:974)
	at com.carrotsearch.randomizedtesting.RandomizedRunner$10.evaluate(RandomizedRunner.java:988)
	at org.apache.solr.BaseDistributedSearchTestCase$ShardsRepeatRule$ShardsFixedStatement.callStatement(BaseDistributedSearchTestCase.java:1063)
	at org.apache.solr.BaseDistributedSearchTestCase$ShardsRepeatRule$ShardsStatement.evaluate(BaseDistributedSearchTestCase.java:1035)
	at com.carrotsearch.randomizedtesting.rules.SystemPropertiesRestoreRule$1.evaluate(SystemPropertiesRestoreRule.java:57)
	at org.apache.lucene.util.TestRuleSetupTeardownChained$1.evaluate(TestRuleSetupTeardownChained.java:49)
	at org.apache.lucene.util.AbstractBeforeAfterRule$1.evaluate(AbstractBeforeAfterRule.java:45)
	at org.apache.lucene.util.TestRuleThreadAndTestName$1.evaluate(TestRuleThreadAndTestName.java:48)
	at org.apache.lucene.util.TestRuleIgnoreAfterMaxFailures$1.evaluate(TestRuleIgnoreAfterMaxFailures.java:64)
	at org.apache.lucene.util.TestRuleMarkFailure$1.evaluate(TestRuleMarkFailure.java:47)
	at com.carrotsearch.randomizedtesting.rules.StatementAdapter.evaluate(StatementAdapter.java:36)
	at com.carrotsearch.randomizedtesting.ThreadLeakControl$StatementRunner.run(ThreadLeakControl.java:368)
	at com.carrotsearch.randomizedtesting.ThreadLeakControl.forkTimeoutingTask(ThreadLeakControl.java:817)
	at com.carrotsearch.randomizedtesting.ThreadLeakControl$3.evaluate(ThreadLeakControl.java:468)
	at com.carrotsearch.randomizedtesting.RandomizedRunner.runSingleTest(RandomizedRunner.java:947)
	at com.carrotsearch.randomizedtesting.RandomizedRunner$5.evaluate(RandomizedRunner.java:832)
	at com.carrotsearch.randomizedtesting.RandomizedRunner$6.evaluate(RandomizedRunner.java:883)
	at com.carrotsearch.randomizedtesting.RandomizedRunner$7.evaluate(RandomizedRunner.java:894)
	at com.carrotsearch.randomizedtesting.rules.StatementAdapter.evaluate(StatementAdapter.java:36)
	at com.carrotsearch.randomizedtesting.rules.SystemPropertiesRestoreRule$1.evaluate(SystemPropertiesRestoreRule.java:57)
	at org.apache.lucene.util.AbstractBeforeAfterRule$1.evaluate(AbstractBeforeAfterRule.java:45)
	at com.carrotsearch.randomizedtesting.rules.StatementAdapter.evaluate(StatementAdapter.java:36)
	at org.apache.lucene.util.TestRuleStoreClassName$1.evaluate(TestRuleStoreClassName.java:41)
	at com.carrotsearch.randomizedtesting.rules.NoShadowingOrOverridesOnMethodsRule$1.evaluate(NoShadowingOrOverridesOnMethodsRule.java:40)
	at com.carrotsearch.randomizedtesting.rules.NoShadowingOrOverridesOnMethodsRule$1.evaluate(NoShadowingOrOverridesOnMethodsRule.java:40)
	at com.carrotsearch.randomizedtesting.rules.StatementAdapter.evaluate(StatementAdapter.java:36)
	at com.carrotsearch.randomizedtesting.rules.StatementAdapter.evaluate(StatementAdapter.java:36)
	at com.carrotsearch.randomizedtesting.rules.StatementAdapter.evaluate(StatementAdapter.java:36)
	at org.apache.lucene.util.TestRuleAssertionsRequired$1.evaluate(TestRuleAssertionsRequired.java:53)
	at org.apache.lucene.util.TestRuleMarkFailure$1.evaluate(TestRuleMarkFailure.java:47)
	at org.apache.lucene.util.TestRuleIgnoreAfterMaxFailures$1.evaluate(TestRuleIgnoreAfterMaxFailures.java:64)
	at org.apache.lucene.util.TestRuleIgnoreTestSuites$1.evaluate(TestRuleIgnoreTestSuites.java:54)
	at com.carrotsearch.randomizedtesting.rules.StatementAdapter.evaluate(StatementAdapter.java:36)
	at com.carrotsearch.randomizedtesting.ThreadLeakControl$StatementRunner.run(ThreadLeakControl.java:368)
	at java.lang.Thread.run(Thread.java:748)




Build Log:
[...truncated 12973 lines...]
   [junit4] Suite: org.apache.solr.core.TestDynamicLoading
   [junit4]   2> 656630 INFO  (SUITE-TestDynamicLoading-seed#[A6F39AE2C0D7A026]-worker) [    ] o.a.s.SolrTestCaseJ4 SecureRandom sanity checks: test.solr.allowed.securerandom=null & java.security.egd=file:/dev/./urandom
   [junit4]   2> Creating dataDir: /home/jenkins/jenkins-slave/workspace/Lucene-Solr-Tests-7.x/solr/build/solr-core/test/J1/temp/solr.core.TestDynamicLoading_A6F39AE2C0D7A026-001/init-core-data-001
   [junit4]   2> 656631 WARN  (SUITE-TestDynamicLoading-seed#[A6F39AE2C0D7A026]-worker) [    ] o.a.s.SolrTestCaseJ4 startTrackingSearchers: numOpens=39 numCloses=39
   [junit4]   2> 656631 INFO  (SUITE-TestDynamicLoading-seed#[A6F39AE2C0D7A026]-worker) [    ] o.a.s.SolrTestCaseJ4 Using PointFields (NUMERIC_POINTS_SYSPROP=true) w/NUMERIC_DOCVALUES_SYSPROP=false
   [junit4]   2> 656633 INFO  (SUITE-TestDynamicLoading-seed#[A6F39AE2C0D7A026]-worker) [    ] o.a.s.SolrTestCaseJ4 Randomized ssl (false) and clientAuth (true) via: @org.apache.solr.util.RandomizeSSL(reason=, ssl=NaN, value=NaN, clientAuth=NaN)
   [junit4]   2> 656633 INFO  (SUITE-TestDynamicLoading-seed#[A6F39AE2C0D7A026]-worker) [    ] o.a.s.BaseDistributedSearchTestCase Setting hostContext system property: /
   [junit4]   2> 656725 INFO  (TEST-TestDynamicLoading.testDynamicLoading-seed#[A6F39AE2C0D7A026]) [    ] o.a.s.c.ZkTestServer STARTING ZK TEST SERVER
   [junit4]   2> 656741 INFO  (ZkTestServer Run Thread) [    ] o.a.s.c.ZkTestServer client port:0.0.0.0/0.0.0.0:0
   [junit4]   2> 656741 INFO  (ZkTestServer Run Thread) [    ] o.a.s.c.ZkTestServer Starting server
   [junit4]   2> 656849 INFO  (TEST-TestDynamicLoading.testDynamicLoading-seed#[A6F39AE2C0D7A026]) [    ] o.a.s.c.ZkTestServer start zk server on port:36305
   [junit4]   2> 656849 INFO  (TEST-TestDynamicLoading.testDynamicLoading-seed#[A6F39AE2C0D7A026]) [    ] o.a.s.c.ZkTestServer parse host and port list: 127.0.0.1:36305
   [junit4]   2> 656849 INFO  (TEST-TestDynamicLoading.testDynamicLoading-seed#[A6F39AE2C0D7A026]) [    ] o.a.s.c.ZkTestServer connecting to 127.0.0.1 36305
   [junit4]   2> 657048 INFO  (zkConnectionManagerCallback-996-thread-1) [    ] o.a.s.c.c.ConnectionManager zkClient has connected
   [junit4]   2> 657292 INFO  (zkConnectionManagerCallback-998-thread-1) [    ] o.a.s.c.c.ConnectionManager zkClient has connected
   [junit4]   2> 657293 INFO  (TEST-TestDynamicLoading.testDynamicLoading-seed#[A6F39AE2C0D7A026]) [    ] o.a.s.c.ZkTestServer put /home/jenkins/jenkins-slave/workspace/Lucene-Solr-Tests-7.x/solr/core/src/test-files/solr/collection1/conf/solrconfig-tlog.xml to /configs/conf1/solrconfig.xml
   [junit4]   2> 657294 INFO  (TEST-TestDynamicLoading.testDynamicLoading-seed#[A6F39AE2C0D7A026]) [    ] o.a.s.c.ZkTestServer put /home/jenkins/jenkins-slave/workspace/Lucene-Solr-Tests-7.x/solr/core/src/test-files/solr/collection1/conf/schema.xml to /configs/conf1/schema.xml
   [junit4]   2> 657327 INFO  (TEST-TestDynamicLoading.testDynamicLoading-seed#[A6F39AE2C0D7A026]) [    ] o.a.s.c.ZkTestServer put /home/jenkins/jenkins-slave/workspace/Lucene-Solr-Tests-7.x/solr/core/src/test-files/solr/collection1/conf/solrconfig.snippet.randomindexconfig.xml to /configs/conf1/solrconfig.snippet.randomindexconfig.xml
   [junit4]   2> 657328 INFO  (TEST-TestDynamicLoading.testDynamicLoading-seed#[A6F39AE2C0D7A026]) [    ] o.a.s.c.ZkTestServer put /home/jenkins/jenkins-slave/workspace/Lucene-Solr-Tests-7.x/solr/core/src/test-files/solr/collection1/conf/stopwords.txt to /configs/conf1/stopwords.txt
   [junit4]   2> 657329 INFO  (TEST-TestDynamicLoading.testDynamicLoading-seed#[A6F39AE2C0D7A026]) [    ] o.a.s.c.ZkTestServer put /home/jenkins/jenkins-slave/workspace/Lucene-Solr-Tests-7.x/solr/core/src/test-files/solr/collection1/conf/protwords.txt to /configs/conf1/protwords.txt
   [junit4]   2> 657330 INFO  (TEST-TestDynamicLoading.testDynamicLoading-seed#[A6F39AE2C0D7A026]) [    ] o.a.s.c.ZkTestServer put /home/jenkins/jenkins-slave/workspace/Lucene-Solr-Tests-7.x/solr/core/src/test-files/solr/collection1/conf/currency.xml to /configs/conf1/currency.xml
   [junit4]   2> 657331 INFO  (TEST-TestDynamicLoading.testDynamicLoading-seed#[A6F39AE2C0D7A026]) [    ] o.a.s.c.ZkTestServer put /home/jenkins/jenkins-slave/workspace/Lucene-Solr-Tests-7.x/solr/core/src/test-files/solr/collection1/conf/enumsConfig.xml to /configs/conf1/enumsConfig.xml
   [junit4]   2> 657365 INFO  (TEST-TestDynamicLoading.testDynamicLoading-seed#[A6F39AE2C0D7A026]) [    ] o.a.s.c.ZkTestServer put /home/jenkins/jenkins-slave/workspace/Lucene-Solr-Tests-7.x/solr/core/src/test-files/solr/collection1/conf/open-exchange-rates.json to /configs/conf1/open-exchange-rates.json
   [junit4]   2> 657366 INFO  (TEST-TestDynamicLoading.testDynamicLoading-seed#[A6F39AE2C0D7A026]) [    ] o.a.s.c.ZkTestServer put /home/jenkins/jenkins-slave/workspace/Lucene-Solr-Tests-7.x/solr/core/src/test-files/solr/collection1/conf/mapping-ISOLatin1Accent.txt to /configs/conf1/mapping-ISOLatin1Accent.txt
   [junit4]   2> 657367 INFO  (TEST-TestDynamicLoading.testDynamicLoading-seed#[A6F39AE2C0D7A026]) [    ] o.a.s.c.ZkTestServer put /home/jenkins/jenkins-slave/workspace/Lucene-Solr-Tests-7.x/solr/core/src/test-files/solr/collection1/conf/old_synonyms.txt to /configs/conf1/old_synonyms.txt
   [junit4]   2> 657367 INFO  (TEST-TestDynamicLoading.testDynamicLoading-seed#[A6F39AE2C0D7A026]) [    ] o.a.s.c.ZkTestServer put /home/jenkins/jenkins-slave/workspace/Lucene-Solr-Tests-7.x/solr/core/src/test-files/solr/collection1/conf/synonyms.txt to /configs/conf1/synonyms.txt
   [junit4]   2> 657401 INFO  (TEST-TestDynamicLoading.testDynamicLoading-seed#[A6F39AE2C0D7A026]) [    ] o.a.s.c.AbstractFullDistribZkTestBase Will use NRT replicas unless explicitly asked otherwise
   [junit4]   2> 658602 WARN  (TEST-TestDynamicLoading.testDynamicLoading-seed#[A6F39AE2C0D7A026]) [    ] o.e.j.s.AbstractConnector Ignoring deprecated socket close linger time
   [junit4]   2> 658603 INFO  (TEST-TestDynamicLoading.testDynamicLoading-seed#[A6F39AE2C0D7A026]) [    ] o.a.s.c.s.e.JettySolrRunner Start Jetty (original configured port=0)
   [junit4]   2> 658603 INFO  (TEST-TestDynamicLoading.testDynamicLoading-seed#[A6F39AE2C0D7A026]) [    ] o.a.s.c.s.e.JettySolrRunner Trying to start Jetty on port 0 try number 1 ...
   [junit4]   2> 658603 INFO  (TEST-TestDynamicLoading.testDynamicLoading-seed#[A6F39AE2C0D7A026]) [    ] o.e.j.s.Server jetty-9.4.14.v20181114; built: 2018-11-14T21:20:31.478Z; git: c4550056e785fb5665914545889f21dc136ad9e6; jvm 1.8.0_191-b12
   [junit4]   2> 658652 INFO  (TEST-TestDynamicLoading.testDynamicLoading-seed#[A6F39AE2C0D7A026]) [    ] o.e.j.s.session DefaultSessionIdManager workerName=node0
   [junit4]   2> 658652 INFO  (TEST-TestDynamicLoading.testDynamicLoading-seed#[A6F39AE2C0D7A026]) [    ] o.e.j.s.session No SessionScavenger set, using defaults
   [junit4]   2> 658652 INFO  (TEST-TestDynamicLoading.testDynamicLoading-seed#[A6F39AE2C0D7A026]) [    ] o.e.j.s.session node0 Scavenging every 600000ms
   [junit4]   2> 658653 INFO  (TEST-TestDynamicLoading.testDynamicLoading-seed#[A6F39AE2C0D7A026]) [    ] o.e.j.s.h.ContextHandler Started o.e.j.s.ServletContextHandler@6fdcc9c5{/,null,AVAILABLE}
   [junit4]   2> 658654 INFO  (TEST-TestDynamicLoading.testDynamicLoading-seed#[A6F39AE2C0D7A026]) [    ] o.e.j.s.AbstractConnector Started ServerConnector@6aefe1f2{HTTP/1.1,[http/1.1]}{127.0.0.1:37697}
   [junit4]   2> 658654 INFO  (TEST-TestDynamicLoading.testDynamicLoading-seed#[A6F39AE2C0D7A026]) [    ] o.e.j.s.Server Started @659073ms
   [junit4]   2> 658654 INFO  (TEST-TestDynamicLoading.testDynamicLoading-seed#[A6F39AE2C0D7A026]) [    ] o.a.s.c.s.e.JettySolrRunner Jetty properties: {solr.data.dir=/home/jenkins/jenkins-slave/workspace/Lucene-Solr-Tests-7.x/solr/build/solr-core/test/J1/temp/solr.core.TestDynamicLoading_A6F39AE2C0D7A026-001/tempDir-001/control/data, hostContext=/, hostPort=37697, coreRootDirectory=/home/jenkins/jenkins-slave/workspace/Lucene-Solr-Tests-7.x/solr/build/solr-core/test/J1/../../../../../../../../../../home/jenkins/jenkins-slave/workspace/Lucene-Solr-Tests-7.x/solr/build/solr-core/test/J1/temp/solr.core.TestDynamicLoading_A6F39AE2C0D7A026-001/control-001/cores}
   [junit4]   2> 658655 ERROR (TEST-TestDynamicLoading.testDynamicLoading-seed#[A6F39AE2C0D7A026]) [    ] o.a.s.u.StartupLoggingUtils Missing Java Option solr.log.dir. Logging may be missing or incomplete.
   [junit4]   2> 658655 INFO  (TEST-TestDynamicLoading.testDynamicLoading-seed#[A6F39AE2C0D7A026]) [    ] o.a.s.s.SolrDispatchFilter Using logger factory org.apache.logging.slf4j.Log4jLoggerFactory
   [junit4]   2> 658655 INFO  (TEST-TestDynamicLoading.testDynamicLoading-seed#[A6F39AE2C0D7A026]) [    ] o.a.s.s.SolrDispatchFilter  ___      _       Welcome to Apache Solr? version 7.7.0
   [junit4]   2> 658655 INFO  (TEST-TestDynamicLoading.testDynamicLoading-seed#[A6F39AE2C0D7A026]) [    ] o.a.s.s.SolrDispatchFilter / __| ___| |_ _   Starting in cloud mode on port null
   [junit4]   2> 658655 INFO  (TEST-TestDynamicLoading.testDynamicLoading-seed#[A6F39AE2C0D7A026]) [    ] o.a.s.s.SolrDispatchFilter \__ \/ _ \ | '_|  Install dir: null
   [junit4]   2> 658655 INFO  (TEST-TestDynamicLoading.testDynamicLoading-seed#[A6F39AE2C0D7A026]) [    ] o.a.s.s.SolrDispatchFilter |___/\___/_|_|    Start time: 2019-01-04T11:09:52.978Z
   [junit4]   2> 658877 INFO  (zkConnectionManagerCallback-1000-thread-1) [    ] o.a.s.c.c.ConnectionManager zkClient has connected
   [junit4]   2> 658924 INFO  (TEST-TestDynamicLoading.testDynamicLoading-seed#[A6F39AE2C0D7A026]) [    ] o.a.s.s.SolrDispatchFilter Loading solr.xml from SolrHome (not found in ZooKeeper)
   [junit4]   2> 658924 INFO  (TEST-TestDynamicLoading.testDynamicLoading-seed#[A6F39AE2C0D7A026]) [    ] o.a.s.c.SolrXmlConfig Loading container configuration from /home/jenkins/jenkins-slave/workspace/Lucene-Solr-Tests-7.x/solr/build/solr-core/test/J1/temp/solr.core.TestDynamicLoading_A6F39AE2C0D7A026-001/control-001/solr.xml
   [junit4]   2> 658927 INFO  (TEST-TestDynamicLoading.testDynamicLoading-seed#[A6F39AE2C0D7A026]) [    ] o.a.s.c.SolrXmlConfig Configuration parameter autoReplicaFailoverWorkLoopDelay is ignored
   [junit4]   2> 658927 INFO  (TEST-TestDynamicLoading.testDynamicLoading-seed#[A6F39AE2C0D7A026]) [    ] o.a.s.c.SolrXmlConfig Configuration parameter autoReplicaFailoverBadNodeExpiration is ignored
   [junit4]   2> 658945 INFO  (TEST-TestDynamicLoading.testDynamicLoading-seed#[A6F39AE2C0D7A026]) [    ] o.a.s.c.SolrXmlConfig MBean server found: com.sun.jmx.mbeanserver.JmxMBeanServer@95cb3e3, but no JMX reporters were configured - adding default JMX reporter.
   [junit4]   2> 659597 INFO  (TEST-TestDynamicLoading.testDynamicLoading-seed#[A6F39AE2C0D7A026]) [    ] o.a.s.c.ZkContainer Zookeeper client=127.0.0.1:36305/solr
   [junit4]   2> 659689 INFO  (zkConnectionManagerCallback-1004-thread-1) [    ] o.a.s.c.c.ConnectionManager zkClient has connected
   [junit4]   2> 659802 INFO  (zkConnectionManagerCallback-1006-thread-1) [    ] o.a.s.c.c.ConnectionManager zkClient has connected
   [junit4]   2> 660271 INFO  (TEST-TestDynamicLoading.testDynamicLoading-seed#[A6F39AE2C0D7A026]) [n:127.0.0.1:37697_    ] o.a.s.c.OverseerElectionContext I am going to be the leader 127.0.0.1:37697_
   [junit4]   2> 660271 INFO  (TEST-TestDynamicLoading.testDynamicLoading-seed#[A6F39AE2C0D7A026]) [n:127.0.0.1:37697_    ] o.a.s.c.Overseer Overseer (id=73954048067764228-127.0.0.1:37697_-n_0000000000) starting
   [junit4]   2> 660313 INFO  (zkConnectionManagerCallback-1013-thread-1) [    ] o.a.s.c.c.ConnectionManager zkClient has connected
   [junit4]   2> 660347 INFO  (TEST-TestDynamicLoading.testDynamicLoading-seed#[A6F39AE2C0D7A026]) [n:127.0.0.1:37697_    ] o.a.s.c.s.i.ZkClientClusterStateProvider Cluster at 127.0.0.1:36305/solr ready
   [junit4]   2> 660348 INFO  (OverseerStateUpdate-73954048067764228-127.0.0.1:37697_-n_0000000000) [n:127.0.0.1:37697_    ] o.a.s.c.Overseer Starting to work on the main queue : 127.0.0.1:37697_
   [junit4]   2> 660362 INFO  (TEST-TestDynamicLoading.testDynamicLoading-seed#[A6F39AE2C0D7A026]) [n:127.0.0.1:37697_    ] o.a.s.c.ZkController Register node as live in ZooKeeper:/live_nodes/127.0.0.1:37697_
   [junit4]   2> 660394 INFO  (zkCallback-1012-thread-1) [    ] o.a.s.c.c.ZkStateReader Updated live nodes from ZooKeeper... (0) -> (1)
   [junit4]   2> 660395 INFO  (zkCallback-1005-thread-1) [    ] o.a.s.c.c.ZkStateReader Updated live nodes from ZooKeeper... (0) -> (1)
   [junit4]   2> 660499 INFO  (TEST-TestDynamicLoading.testDynamicLoading-seed#[A6F39AE2C0D7A026]) [n:127.0.0.1:37697_    ] o.a.s.h.a.MetricsHistoryHandler No .system collection, keeping metrics history in memory.
   [junit4]   2> 660587 INFO  (TEST-TestDynamicLoading.testDynamicLoading-seed#[A6F39AE2C0D7A026]) [n:127.0.0.1:37697_    ] o.a.s.m.r.SolrJmxReporter JMX monitoring for 'solr.node' (registry 'solr.node') enabled at server: com.sun.jmx.mbeanserver.JmxMBeanServer@95cb3e3
   [junit4]   2> 660659 INFO  (TEST-TestDynamicLoading.testDynamicLoading-seed#[A6F39AE2C0D7A026]) [n:127.0.0.1:37697_    ] o.a.s.m.r.SolrJmxReporter JMX monitoring for 'solr.jvm' (registry 'solr.jvm') enabled at server: com.sun.jmx.mbeanserver.JmxMBeanServer@95cb3e3
   [junit4]   2> 660660 INFO  (TEST-TestDynamicLoading.testDynamicLoading-seed#[A6F39AE2C0D7A026]) [n:127.0.0.1:37697_    ] o.a.s.m.r.SolrJmxReporter JMX monitoring for 'solr.jetty' (registry 'solr.jetty') enabled at server: com.sun.jmx.mbeanserver.JmxMBeanServer@95cb3e3
   [junit4]   2> 660661 INFO  (TEST-TestDynamicLoading.testDynamicLoading-seed#[A6F39AE2C0D7A026]) [n:127.0.0.1:37697_    ] o.a.s.c.CorePropertiesLocator Found 0 core definitions underneath /home/jenkins/jenkins-slave/workspace/Lucene-Solr-Tests-7.x/solr/build/solr-core/test/J1/../../../../../../../../../../home/jenkins/jenkins-slave/workspace/Lucene-Solr-Tests-7.x/solr/build/solr-core/test/J1/temp/solr.core.TestDynamicLoading_A6F39AE2C0D7A026-001/control-001/cores
   [junit4]   2> 660751 INFO  (zkConnectionManagerCallback-1019-thread-1) [    ] o.a.s.c.c.ConnectionManager zkClient has connected
   [junit4]   2> 660752 INFO  (TEST-TestDynamicLoading.testDynamicLoading-seed#[A6F39AE2C0D7A026]) [    ] o.a.s.c.c.ZkStateReader Updated live nodes from ZooKeeper... (0) -> (1)
   [junit4]   2> 660753 INFO  (TEST-TestDynamicLoading.testDynamicLoading-seed#[A6F39AE2C0D7A026]) [    ] o.a.s.c.s.i.ZkClientClusterStateProvider Cluster at 127.0.0.1:36305/solr ready
   [junit4]   2> 660757 INFO  (qtp1299815458-3298) [n:127.0.0.1:37697_    ] o.a.s.h.a.CollectionsHandler Invoked Collection Action :create with params collection.configName=conf1&name=control_collection&nrtReplicas=1&action=CREATE&numShards=1&createNodeSet=127.0.0.1:37697_&wt=javabin&version=2 and sendToOCPQueue=true
   [junit4]   2> 660781 INFO  (OverseerThreadFactory-1216-thread-1-processing-n:127.0.0.1:37697_) [n:127.0.0.1:37697_    ] o.a.s.c.a.c.CreateCollectionCmd Create collection control_collection
   [junit4]   2> 660901 INFO  (qtp1299815458-3300) [n:127.0.0.1:37697_    ] o.a.s.s.HttpSolrCall [admin] webapp=null path=/admin/metrics params={prefix=CONTAINER.fs.usableSpace,CONTAINER.fs.totalSpace,CORE.coreName&wt=javabin&version=2&group=solr.node,solr.core} status=0 QTime=0
   [junit4]   2> 660913 INFO  (qtp1299815458-3301) [n:127.0.0.1:37697_    ] o.a.s.s.HttpSolrCall [admin] webapp=null path=/admin/metrics params={prefix=CONTAINER.fs.usableSpace,CONTAINER.fs.totalSpace,CORE.coreName&wt=javabin&version=2&group=solr.node,solr.core} status=0 QTime=0
   [junit4]   2> 660914 INFO  (qtp1299815458-3297) [n:127.0.0.1:37697_    ] o.a.s.s.HttpSolrCall [admin] webapp=null path=/admin/metrics params={prefix=CONTAINER.fs.usableSpace,CONTAINER.fs.totalSpace,CORE.coreName&wt=javabin&version=2&group=solr.node,solr.core} status=0 QTime=0
   [junit4]   2> 660917 INFO  (qtp1299815458-3299) [n:127.0.0.1:37697_    ] o.a.s.s.HttpSolrCall [admin] webapp=null path=/admin/metrics params={prefix=CONTAINER.fs.usableSpace,CONTAINER.fs.totalSpace,CORE.coreName&wt=javabin&version=2&group=solr.node,solr.core} status=0 QTime=0
   [junit4]   2> 660918 INFO  (qtp1299815458-3300) [n:127.0.0.1:37697_    ] o.a.s.s.HttpSolrCall [admin] webapp=null path=/admin/metrics params={prefix=CONTAINER.fs.usableSpace,CONTAINER.fs.totalSpace,CORE.coreName&wt=javabin&version=2&group=solr.node,solr.core} status=0 QTime=0
   [junit4]   2> 660929 INFO  (qtp1299815458-3301) [n:127.0.0.1:37697_    x:control_collection_shard1_replica_n1] o.a.s.h.a.CoreAdminOperation core create command qt=/admin/cores&collection.configName=conf1&newCollection=true&name=control_collection_shard1_replica_n1&action=CREATE&numShards=1&collection=control_collection&shard=shard1&wt=javabin&version=2&replicaType=NRT
   [junit4]   2> 660929 INFO  (qtp1299815458-3301) [n:127.0.0.1:37697_    x:control_collection_shard1_replica_n1] o.a.s.c.TransientSolrCoreCacheDefault Allocating transient cache for 4 transient cores
   [junit4]   2> 662021 INFO  (qtp1299815458-3301) [n:127.0.0.1:37697_ c:control_collection s:shard1  x:control_collection_shard1_replica_n1] o.a.s.c.SolrConfig Using Lucene MatchVersion: 7.7.0
   [junit4]   2> 662098 INFO  (qtp1299815458-3301) [n:127.0.0.1:37697_ c:control_collection s:shard1  x:control_collection_shard1_replica_n1] o.a.s.s.IndexSchema [control_collection_shard1_replica_n1] Schema name=test
   [junit4]   2> 662676 INFO  (qtp1299815458-3301) [n:127.0.0.1:37697_ c:control_collection s:shard1  x:control_collection_shard1_replica_n1] o.a.s.s.IndexSchema Loaded schema test/1.0 with uniqueid field id
   [junit4]   2> 662759 INFO  (qtp1299815458-3301) [n:127.0.0.1:37697_ c:control_collection s:shard1  x:control_collection_shard1_replica_n1] o.a.s.c.CoreContainer Creating SolrCore 'control_collection_shard1_replica_n1' using configuration from collection control_collection, trusted=true
   [junit4]   2> 662768 INFO  (qtp1299815458-3301) [n:127.0.0.1:37697_ c:control_collection s:shard1  x:control_collection_shard1_replica_n1] o.a.s.m.r.SolrJmxReporter JMX monitoring for 'solr.core.control_collection.shard1.replica_n1' (registry 'solr.core.control_collection.shard1.replica_n1') enabled at server: com.sun.jmx.mbeanserver.JmxMBeanServer@95cb3e3
   [junit4]   2> 662768 INFO  (qtp1299815458-3301) [n:127.0.0.1:37697_ c:control_collection s:shard1  x:control_collection_shard1_replica_n1] o.a.s.c.SolrCore [[control_collection_shard1_replica_n1] ] Opening new SolrCore at [/home/jenkins/jenkins-slave/workspace/Lucene-Solr-Tests-7.x/solr/build/solr-core/test/J1/temp/solr.core.TestDynamicLoading_A6F39AE2C0D7A026-001/control-001/cores/control_collection_shard1_replica_n1], dataDir=[/home/jenkins/jenkins-slave/workspace/Lucene-Solr-Tests-7.x/solr/build/solr-core/test/J1/../../../../../../../../../../home/jenkins/jenkins-slave/workspace/Lucene-Solr-Tests-7.x/solr/build/solr-core/test/J1/temp/solr.core.TestDynamicLoading_A6F39AE2C0D7A026-001/control-001/cores/control_collection_shard1_replica_n1/data/]
   [junit4]   2> 662770 INFO  (qtp1299815458-3301) [n:127.0.0.1:37697_ c:control_collection s:shard1  x:control_collection_shard1_replica_n1] o.a.s.u.RandomMergePolicy RandomMergePolicy wrapping class org.apache.lucene.index.TieredMergePolicy: [TieredMergePolicy: maxMergeAtOnce=46, maxMergeAtOnceExplicit=10, maxMergedSegmentMB=98.2646484375, floorSegmentMB=1.8544921875, forceMergeDeletesPctAllowed=10.709214999013286, segmentsPerTier=24.0, maxCFSSegmentSizeMB=8.796093022207999E12, noCFSRatio=0.0, deletesPctAllowed=22.324336285338156
   [junit4]   2> 662789 WARN  (qtp1299815458-3301) [n:127.0.0.1:37697_ c:control_collection s:shard1  x:control_collection_shard1_replica_n1] o.a.s.c.RequestHandlers INVALID paramSet a in requestHandler {type = requestHandler,name = /dump,class = DumpRequestHandler,attributes = {initParams=a, name=/dump, class=DumpRequestHandler},args = {defaults={a=A,b=B}}}
   [junit4]   2> 662897 INFO  (qtp1299815458-3301) [n:127.0.0.1:37697_ c:control_collection s:shard1  x:control_collection_shard1_replica_n1] o.a.s.u.UpdateHandler Using UpdateLog implementation: org.apache.solr.update.UpdateLog
   [junit4]   2> 662898 INFO  (qtp1299815458-3301) [n:127.0.0.1:37697_ c:control_collection s:shard1  x:control_collection_shard1_replica_n1] o.a.s.u.UpdateLog Initializing UpdateLog: dataDir= defaultSyncLevel=FLUSH numRecordsToKeep=100 maxNumLogsToKeep=10 numVersionBuckets=65536
   [junit4]   2> 662900 INFO  (qtp1299815458-3301) [n:127.0.0.1:37697_ c:control_collection s:shard1  x:control_collection_shard1_replica_n1] o.a.s.u.CommitTracker Hard AutoCommit: disabled
   [junit4]   2> 662900 INFO  (qtp1299815458-3301) [n:127.0.0.1:37697_ c:control_collection s:shard1  x:control_collection_shard1_replica_n1] o.a.s.u.CommitTracker Soft AutoCommit: disabled
   [junit4]   2> 662901 INFO  (qtp1299815458-3301) [n:127.0.0.1:37697_ c:control_collection s:shard1  x:control_collection_shard1_replica_n1] o.a.s.u.RandomMergePolicy RandomMergePolicy wrapping class org.apache.lucene.index.TieredMergePolicy: [TieredMergePolicy: maxMergeAtOnce=18, maxMergeAtOnceExplicit=45, maxMergedSegmentMB=93.8154296875, floorSegmentMB=1.8330078125, forceMergeDeletesPctAllowed=27.785245084607737, segmentsPerTier=49.0, maxCFSSegmentSizeMB=8.796093022207999E12, noCFSRatio=0.12407939940405194, deletesPctAllowed=29.903567428749096
   [junit4]   2> 662901 INFO  (qtp1299815458-3301) [n:127.0.0.1:37697_ c:control_collection s:shard1  x:control_collection_shard1_replica_n1] o.a.s.s.SolrIndexSearcher Opening [Searcher@c51b731[control_collection_shard1_replica_n1] main]
   [junit4]   2> 662915 INFO  (qtp1299815458-3301) [n:127.0.0.1:37697_ c:control_collection s:shard1  x:control_collection_shard1_replica_n1] o.a.s.r.ManagedResourceStorage Configured ZooKeeperStorageIO with znodeBase: /configs/conf1
   [junit4]   2> 662915 INFO  (qtp1299815458-3301) [n:127.0.0.1:37697_ c:control_collection s:shard1  x:control_collection_shard1_replica_n1] o.a.s.r.ManagedResourceStorage Loaded null at path _rest_managed.json using ZooKeeperStorageIO:path=/configs/conf1
   [junit4]   2> 662915 INFO  (qtp1299815458-3301) [n:127.0.0.1:37697_ c:control_collection s:shard1  x:control_collection_shard1_replica_n1] o.a.s.h.ReplicationHandler Commits will be reserved for 10000ms.
   [junit4]   2> 662916 INFO  (qtp1299815458-3301) [n:127.0.0.1:37697_ c:control_collection s:shard1  x:control_collection_shard1_replica_n1] o.a.s.u.UpdateLog Could not find max version in index or recent updates, using new clock 1621727848420081664
   [junit4]   2> 662918 INFO  (searcherExecutor-1221-thread-1-processing-n:127.0.0.1:37697_ x:control_collection_shard1_replica_n1 c:control_collection s:shard1) [n:127.0.0.1:37697_ c:control_collection s:shard1  x:control_collection_shard1_replica_n1] o.a.s.c.SolrCore [control_collection_shard1_replica_n1] Registered new searcher Searcher@c51b731[control_collection_shard1_replica_n1] main{ExitableDirectoryReader(UninvertingDirectoryReader())}
   [junit4]   2> 662929 INFO  (qtp1299815458-3301) [n:127.0.0.1:37697_ c:control_collection s:shard1  x:control_collection_shard1_replica_n1] o.a.s.c.ZkShardTerms Successful update of terms at /collections/control_collection/terms/shard1 to Terms{values={core_node2=0}, version=0}
   [junit4]   2> 662929 INFO  (qtp1299815458-3301) [n:127.0.0.1:37697_ c:control_collection s:shard1  x:control_collection_shard1_replica_n1] o.a.s.c.ShardLeaderElectionContextBase make sure parent is created /collections/control_collection/leaders/shard1
   [junit4]   2> 662940 INFO  (qtp1299815458-3301) [n:127.0.0.1:37697_ c:control_collection s:shard1  x:control_collection_shard1_replica_n1] o.a.s.c.ShardLeaderElectionContext Enough replicas found to continue.
   [junit4]   2> 662940 INFO  (qtp1299815458-3301) [n:127.0.0.1:37697_ c:control_collection s:shard1  x:control_collection_shard1_replica_n1] o.a.s.c.ShardLeaderElectionContext I may be the new leader - try and sync
   [junit4]   2> 662940 INFO  (qtp1299815458-3301) [n:127.0.0.1:37697_ c:control_collection s:shard1  x:control_collection_shard1_replica_n1] o.a.s.c.SyncStrategy Sync replicas to http://127.0.0.1:37697/control_collection_shard1_replica_n1/
   [junit4]   2> 662940 INFO  (qtp1299815458-3301) [n:127.0.0.1:37697_ c:control_collection s:shard1  x:control_collection_shard1_replica_n1] o.a.s.c.SyncStrategy Sync Success - now sync replicas to me
   [junit4]   2> 662940 INFO  (qtp1299815458-3301) [n:127.0.0.1:37697_ c:control_collection s:shard1  x:control_collection_shard1_replica_n1] o.a.s.c.SyncStrategy http://127.0.0.1:37697/control_collection_shard1_replica_n1/ has no replicas
   [junit4]   2> 662940 INFO  (qtp1299815458-3301) [n:127.0.0.1:37697_ c:control_collection s:shard1  x:control_collection_shard1_replica_n1] o.a.s.c.ShardLeaderElectionContext Found all replicas participating in election, clear LIR
   [junit4]   2> 662941 INFO  (qtp1299815458-3301) [n:127.0.0.1:37697_ c:control_collection s:shard1  x:control_collection_shard1_replica_n1] o.a.s.c.ShardLeaderElectionContextBase Creating leader registration node /collections/control_collection/leaders/shard1/leader after winning as /collections/control_collection/leader_elect/shard1/election/73954048067764228-core_node2-n_0000000000
   [junit4]   2> 662949 INFO  (qtp1299815458-3301) [n:127.0.0.1:37697_ c:control_collection s:shard1  x:control_collection_shard1_replica_n1] o.a.s.c.ShardLeaderElectionContext I am the new leader: http://127.0.0.1:37697/control_collection_shard1_replica_n1/ shard1
   [junit4]   2> 663076 INFO  (zkCallback-1005-thread-1) [    ] o.a.s.c.c.ZkStateReader A cluster state change: [WatchedEvent state:SyncConnected type:NodeDataChanged path:/collections/control_collection/state.json] for collection [control_collection] has occurred - updating... (live nodes size: [1])
   [junit4]   2> 663076 INFO  (zkCallback-1005-thread-2) [    ] o.a.s.c.c.ZkStateReader A cluster state change: [WatchedEvent state:SyncConnected type:NodeDataChanged path:/collections/control_collection/state.json] for collection [control_collection] has occurred - updating... (live nodes size: [1])
   [junit4]   2> 663078 INFO  (qtp1299815458-3301) [n:127.0.0.1:37697_ c:control_collection s:shard1  x:control_collection_shard1_replica_n1] o.a.s.c.ZkController I am the leader, no recovery necessary
   [junit4]   2> 663097 INFO  (qtp1299815458-3301) [n:127.0.0.1:37697_ c:control_collection s:shard1  x:control_collection_shard1_replica_n1] o.a.s.s.HttpSolrCall [admin] webapp=null path=/admin/cores params={qt=/admin/cores&collection.configName=conf1&newCollection=true&name=control_collection_shard1_replica_n1&action=CREATE&numShards=1&collection=control_collection&shard=shard1&wt=javabin&version=2&replicaType=NRT} status=0 QTime=2168
   [junit4]   2> 663099 INFO  (qtp1299815458-3298) [n:127.0.0.1:37697_    ] o.a.s.h.a.CollectionsHandler Wait for new collection to be active for at most 45 seconds. Check all shard replicas
   [junit4]   2> 663182 INFO  (zkCallback-1005-thread-1) [    ] o.a.s.c.c.ZkStateReader A cluster state change: [WatchedEvent state:SyncConnected type:NodeDataChanged path:/collections/control_collection/state.json] for collection [control_collection] has occurred - updating... (live nodes size: [1])
   [junit4]   2> 663182 INFO  (zkCallback-1005-thread-2) [    ] o.a.s.c.c.ZkStateReader A cluster state change: [WatchedEvent state:SyncConnected type:NodeDataChanged path:/collections/control_collection/state.json] for collection [control_collection] has occurred - updating... (live nodes size: [1])
   [junit4]   2> 663183 INFO  (qtp1299815458-3298) [n:127.0.0.1:37697_    ] o.a.s.s.HttpSolrCall [admin] webapp=null path=/admin/collections params={collection.configName=conf1&name=control_collection&nrtReplicas=1&action=CREATE&numShards=1&createNodeSet=127.0.0.1:37697_&wt=javabin&version=2} status=0 QTime=2426
   [junit4]   2> 663183 INFO  (zkCallback-1005-thread-3) [    ] o.a.s.c.c.ZkStateReader A cluster state change: [WatchedEvent state:SyncConnected type:NodeDataChanged path:/collections/control_collection/state.json] for collection [control_collection] has occurred - updating... (live nodes size: [1])
   [junit4]   2> 663188 INFO  (zkConnectionManagerCallback-1024-thread-1) [    ] o.a.s.c.c.ConnectionManager zkClient has connected
   [junit4]   2> 663189 INFO  (TEST-TestDynamicLoading.testDynamicLoading-seed#[A6F39AE2C0D7A026]) [    ] o.a.s.c.c.ZkStateReader Updated live nodes from ZooKeeper... (0) -> (1)
   [junit4]   2> 663206 INFO  (TEST-TestDynamicLoading.testDynamicLoading-seed#[A6F39AE2C0D7A026]) [    ] o.a.s.c.s.i.ZkClientClusterStateProvider Cluster at 127.0.0.1:36305/solr ready
   [junit4]   2> 663206 INFO  (TEST-TestDynamicLoading.testDynamicLoading-seed#[A6F39AE2C0D7A026]) [    ] o.a.s.c.ChaosMonkey monkey: init - expire sessions:false cause connection loss:false
   [junit4]   2> 663207 INFO  (qtp1299815458-3301) [n:127.0.0.1:37697_    ] o.a.s.h.a.CollectionsHandler Invoked Collection Action :create with params collection.configName=conf1&name=collection1&nrtReplicas=1&action=CREATE&numShards=2&createNodeSet=&stateFormat=1&wt=javabin&version=2 and sendToOCPQueue=true
   [junit4]   2> 663210 INFO  (OverseerThreadFactory-1216-thread-2-processing-n:127.0.0.1:37697_) [n:127.0.0.1:37697_    ] o.a.s.c.a.c.CreateCollectionCmd Create collection collection1
   [junit4]   2> 663210 INFO  (OverseerCollectionConfigSetProcessor-73954048067764228-127.0.0.1:37697_-n_0000000000) [n:127.0.0.1:37697_    ] o.a.s.c.OverseerTaskQueue Response ZK path: /overseer/collection-queue-work/qnr-0000000000 doesn't exist.  Requestor may have disconnected from ZooKeeper
   [junit4]   2> 663413 WARN  (OverseerThreadFactory-1216-thread-2-processing-n:127.0.0.1:37697_) [n:127.0.0.1:37697_    ] o.a.s.c.a.c.CreateCollectionCmd It is unusual to create a collection (collection1) without cores.
   [junit4]   2> 663416 INFO  (qtp1299815458-3301) [n:127.0.0.1:37697_    ] o.a.s.h.a.CollectionsHandler Wait for new collection to be active for at most 45 seconds. Check all shard replicas
   [junit4]   2> 663416 INFO  (qtp1299815458-3301) [n:127.0.0.1:37697_    ] o.a.s.s.HttpSolrCall [admin] webapp=null path=/admin/collections params={collection.configName=conf1&name=collection1&nrtReplicas=1&action=CREATE&numShards=2&createNodeSet=&stateFormat=1&wt=javabin&version=2} status=0 QTime=209
   [junit4]   2> 663418 INFO  (TEST-TestDynamicLoading.testDynamicLoading-seed#[A6F39AE2C0D7A026]) [    ] o.a.s.c.AbstractFullDistribZkTestBase Creating jetty instances pullReplicaCount=0 numOtherReplicas=4
   [junit4]   2> 663703 INFO  (TEST-TestDynamicLoading.testDynamicLoading-seed#[A6F39AE2C0D7A026]) [    ] o.a.s.c.AbstractFullDistribZkTestBase create jetty 1 in directory /home/jenkins/jenkins-slave/workspace/Lucene-Solr-Tests-7.x/solr/build/solr-core/test/J1/temp/solr.core.TestDynamicLoading_A6F39AE2C0D7A026-001/shard-1-001 of type NRT
   [junit4]   2> 663720 WARN  (closeThreadPool-1025-thread-1) [    ] o.e.j.s.AbstractConnector Ignoring deprecated socket close linger time
   [junit4]   2> 663721 INFO  (closeThreadPool-1025-thread-1) [    ] o.a.s.c.s.e.JettySolrRunner Start Jetty (original configured port=0)
   [junit4]   2> 663721 INFO  (closeThreadPool-1025-thread-1) [    ] o.a.s.c.s.e.JettySolrRunner Trying to start Jetty on port 0 try number 1 ...
   [junit4]   2> 663721 INFO  (closeThreadPool-1025-thread-1) [    ] o.e.j.s.Server jetty-9.4.14.v20181114; built: 2018-11-14T21:20:31.478Z; git: c4550056e785fb5665914545889f21dc136ad9e6; jvm 1.8.0_191-b12
   [junit4]   2> 663722 INFO  (closeThreadPool-1025-thread-1) [    ] o.e.j.s.session DefaultSessionIdManager workerName=node0
   [junit4]   2> 663722 INFO  (closeThreadPool-1025-thread-1) [    ] o.e.j.s.session No SessionScavenger set, using defaults
   [junit4]   2> 663722 INFO  (closeThreadPool-1025-thread-1) [    ] o.e.j.s.session node0 Scavenging every 600000ms
   [junit4]   2> 663722 INFO  (closeThreadPool-1025-thread-1) [    ] o.e.j.s.h.ContextHandler Started o.e.j.s.ServletContextHandler@35607899{/,null,AVAILABLE}
   [junit4]   2> 663723 INFO  (closeThreadPool-1025-thread-1) [    ] o.e.j.s.AbstractConnector Started ServerConnector@44b9e271{HTTP/1.1,[http/1.1]}{127.0.0.1:36853}
   [junit4]   2> 663723 INFO  (closeThreadPool-1025-thread-1) [    ] o.e.j.s.Server Started @664142ms
   [junit4]   2> 663723 INFO  (closeThreadPool-1025-thread-1) [    ] o.a.s.c.s.e.JettySolrRunner Jetty properties: {solr.data.dir=/home/jenkins/jenkins-slave/workspace/Lucene-Solr-Tests-7.x/solr/build/solr-core/test/J1/temp/solr.core.TestDynamicLoading_A6F39AE2C0D7A026-001/tempDir-001/jetty1, replicaType=NRT, solrconfig=solrconfig.xml, hostContext=/, hostPort=36853, coreRootDirectory=/home/jenkins/jenkins-slave/workspace/Lucene-Solr-Tests-7.x/solr/build/solr-core/test/J1/temp/solr.core.TestDynamicLoading_A6F39AE2C0D7A026-001/shard-1-001/cores}
   [junit4]   2> 663723 ERROR (closeThreadPool-1025-thread-1) [    ] o.a.s.u.StartupLoggingUtils Missing Java Option solr.log.dir. Logging may be missing or incomplete.
   [junit4]   2> 663723 INFO  (closeThreadPool-1025-thread-1) [    ] o.a.s.s.SolrDispatchFilter Using logger factory org.apache.logging.slf4j.Log4jLoggerFactory
   [junit4]   2> 663723 INFO  (closeThreadPool-1025-thread-1) [    ] o.a.s.s.SolrDispatchFilter  ___      _       Welcome to Apache Solr? version 7.7.0
   [junit4]   2> 663723 INFO  (closeThreadPool-1025-thread-1) [    ] o.a.s.s.SolrDispatchFilter / __| ___| |_ _   Starting in cloud mode on port null
   [junit4]   2> 663723 INFO  (closeThreadPool-1025-thread-1) [    ] o.a.s.s.SolrDispatchFilter \__ \/ _ \ | '_|  Install dir: null
   [junit4]   2> 663723 INFO  (closeThreadPool-1025-thread-1) [    ] o.a.s.s.SolrDispatchFilter |___/\___/_|_|    Start time: 2019-01-04T11:09:58.046Z
   [junit4]   2> 663762 INFO  (zkConnectionManagerCallback-1027-thread-1) [    ] o.a.s.c.c.ConnectionManager zkClient has connected
   [junit4]   2> 663763 INFO  (closeThreadPool-1025-thread-1) [    ] o.a.s.s.SolrDispatchFilter Loading solr.xml from SolrHome (not found in ZooKeeper)
   [junit4]   2> 663763 INFO  (closeThreadPool-1025-thread-1) [    ] o.a.s.c.SolrXmlConfig Loading container configuration from /home/jenkins/jenkins-slave/workspace/Lucene-Solr-Tests-7.x/solr/build/solr-core/test/J1/temp/solr.core.TestDynamicLoading_A6F39AE2C0D7A026-001/shard-1-001/solr.xml
   [junit4]   2> 663775 INFO  (closeThreadPool-1025-thread-1) [    ] o.a.s.c.SolrXmlConfig Configuration parameter autoReplicaFailoverWorkLoopDelay is ignored
   [junit4]   2> 663775 INFO  (closeThreadPool-1025-thread-1) [    ] o.a.s.c.SolrXmlConfig Configuration parameter autoReplicaFailoverBadNodeExpiration is ignored
   [junit4]   2> 663790 INFO  (closeThreadPool-1025-thread-1) [    ] o.a.s.c.SolrXmlConfig MBean server found: com.sun.jmx.mbeanserver.JmxMBeanServer@95cb3e3, but no JMX reporters were configured - adding default JMX reporter.
   [junit4]   2> 664268 INFO  (closeThreadPool-1025-thread-1) [    ] o.a.s.c.ZkContainer Zookeeper client=127.0.0.1:36305/solr
   [junit4]   2> 664287 INFO  (zkConnectionManagerCallback-1031-thread-1) [    ] o.a.s.c.c.ConnectionManager zkClient has connected
   [junit4]   2> 664324 INFO  (zkConnectionManagerCallback-1033-thread-1) [    ] o.a.s.c.c.ConnectionManager zkClient has connected
   [junit4]   2> 664341 INFO  (closeThreadPool-1025-thread-1) [n:127.0.0.1:36853_    ] o.a.s.c.c.ZkStateReader Updated live nodes from ZooKeeper... (0) -> (1)
   [junit4]   2> 664360 INFO  (closeThreadPool-1025-thread-1) [n:127.0.0.1:36853_    ] o.a.s.c.ZkController Publish node=127.0.0.1:36853_ as DOWN
   [junit4]   2> 664361 INFO  (closeThreadPool-1025-thread-1) [n:127.0.0.1:36853_    ] o.a.s.c.TransientSolrCoreCacheDefault Allocating transient cache for 4 transient cores
   [junit4]   2> 664361 INFO  (closeThreadPool-1025-thread-1) [n:127.0.0.1:36853_    ] o.a.s.c.ZkController Register node as live in ZooKeeper:/live_nodes/127.0.0.1:36853_
   [junit4]   2> 664363 INFO  (zkCallback-1023-thread-1) [    ] o.a.s.c.c.ZkStateReader Updated live nodes from ZooKeeper... (1) -> (2)
   [junit4]   2> 664363 INFO  (zkCallback-1032-thread-1) [    ] o.a.s.c.c.ZkStateReader Updated live nodes from ZooKeeper... (1) -> (2)
   [junit4]   2> 664380 INFO  (zkCallback-1012-thread-1) [    ] o.a.s.c.c.ZkStateReader Updated live nodes from ZooKeeper... (1) -> (2)
   [junit4]   2> 664396 INFO  (zkCallback-1005-thread-3) [    ] o.a.s.c.c.ZkStateReader Updated live nodes from ZooKeeper... (1) -> (2)
   [junit4]   2> 664462 INFO  (zkConnectionManagerCallback-1040-thread-1) [    ] o.a.s.c.c.ConnectionManager zkClient has connected
   [junit4]   2> 664463 INFO  (closeThreadPool-1025-thread-1) [n:127.0.0.1:36853_    ] o.a.s.c.c.ZkStateReader Updated live nodes from ZooKeeper... (0) -> (2)
   [junit4]   2> 664464 INFO  (closeThreadPool-1025-thread-1) [n:127.0.0.1:36853_    ] o.a.s.c.s.i.ZkClientClusterStateProvider Cluster at 127.0.0.1:36305/solr ready
   [junit4]   2> 664464 INFO  (closeThreadPool-1025-thread-1) [n:127.0.0.1:36853_    ] o.a.s.h.a.MetricsHistoryHandler No .system collection, keeping metrics history in memory.
   [junit4]   2> 664554 INFO  (closeThreadPool-1025-thread-1) [n:127.0.0.1:36853_    ] o.a.s.m.r.SolrJmxReporter JMX monitoring for 'solr.node' (registry 'solr.node') enabled at server: com.sun.jmx.mbeanserver.JmxMBeanServer@95cb3e3
   [junit4]   2> 664591 INFO  (closeThreadPool-1025-thread-1) [n:127.0.0.1:36853_    ] o.a.s.m.r.SolrJmxReporter JMX monitoring for 'solr.jvm' (registry 'solr.jvm') enabled at server: com.sun.jmx.mbeanserver.JmxMBeanServer@95cb3e3
   [junit4]   2> 664591 INFO  (closeThreadPool-1025-thread-1) [n:127.0.0.1:36853_    ] o.a.s.m.r.SolrJmxReporter JMX monitoring for 'solr.jetty' (registry 'solr.jetty') enabled at server: com.sun.jmx.mbeanserver.JmxMBeanServer@95cb3e3
   [junit4]   2> 664676 INFO  (closeThreadPool-1025-thread-1) [n:127.0.0.1:36853_    ] o.a.s.c.CorePropertiesLocator Found 0 core definitions underneath /home/jenkins/jenkins-slave/workspace/Lucene-Solr-Tests-7.x/solr/build/solr-core/test/J1/temp/solr.core.TestDynamicLoading_A6F39AE2C0D7A026-001/shard-1-001/cores
   [junit4]   2> 664849 INFO  (TEST-TestDynamicLoading.testDynamicLoading-seed#[A6F39AE2C0D7A026]) [    ] o.a.s.c.AbstractFullDistribZkTestBase create jetty 2 in directory /home/jenkins/jenkins-slave/workspace/Lucene-Solr-Tests-7.x/solr/build/solr-core/test/J1/temp/solr.core.TestDynamicLoading_A6F39AE2C0D7A026-001/shard-2-001 of type NRT
   [junit4]   2> 664850 WARN  (closeThreadPool-1025-thread-1) [    ] o.e.j.s.AbstractConnector Ignoring deprecated socket close linger time
   [junit4]   2> 664883 INFO  (closeThreadPool-1025-thread-1) [    ] o.a.s.c.s.e.JettySolrRunner Start Jetty (original configured port=0)
   [junit4]   2> 664883 INFO  (closeThreadPool-1025-thread-1) [    ] o.a.s.c.s.e.JettySolrRunner Trying to start Jetty on port 0 try number 1 ...
   [junit4]   2> 664883 INFO  (closeThreadPool-1025-thread-1) [    ] o.e.j.s.Server jetty-9.4.14.v20181114; built: 2018-11-14T21:20:31.478Z; git: c4550056e785fb5665914545889f21dc136ad9e6; jvm 1.8.0_191-b12
   [junit4]   2> 664996 INFO  (closeThreadPool-1025-thread-1) [    ] o.e.j.s.session DefaultSessionIdManager workerName=node0
   [junit4]   2> 664996 INFO  (closeThreadPool-1025-thread-1) [    ] o.e.j.s.session No SessionScavenger set, using defaults
   [junit4]   2> 664996 INFO  (closeThreadPool-1025-thread-1) [    ] o.e.j.s.session node0 Scavenging every 600000ms
   [junit4]   2> 665008 INFO  (closeThreadPool-1025-thread-1) [    ] o.e.j.s.h.ContextHandler Started o.e.j.s.ServletContextHandler@4fba4476{/,null,AVAILABLE}
   [junit4]   2> 665029 INFO  (closeThreadPool-1025-thread-1) [    ] o.e.j.s.AbstractConnector Started ServerConnector@334a5f36{HTTP/1.1,[http/1.1]}{127.0.0.1:39623}
   [junit4]   2> 665029 INFO  (closeThreadPool-1025-thread-1) [    ] o.e.j.s.Server Started @665448ms
   [junit4]   2> 665029 INFO  (closeThreadPool-1025-thread-1) [    ] o.a.s.c.s.e.JettySolrRunner Jetty properties: {solr.data.dir=/home/jenkins/jenkins-slave/workspace/Lucene-Solr-Tests-7.x/solr/build/solr-core/test/J1/temp/solr.core.TestDynamicLoading_A6F39AE2C0D7A026-001/tempDir-001/jetty2, solrconfig=solrconfig.xml, hostContext=/, hostPort=39623, coreRootDirectory=/home/jenkins/jenkins-slave/workspace/Lucene-Solr-Tests-7.x/solr/build/solr-core/test/J1/../../../../../../../../../../home/jenkins/jenkins-slave/workspace/Lucene-Solr-Tests-7.x/solr/build/solr-core/test/J1/temp/solr.core.TestDynamicLoading_A6F39AE2C0D7A026-001/shard-2-001/cores}
   [junit4]   2> 665029 ERROR (closeThreadPool-1025-thread-1) [    ] o.a.s.u.StartupLoggingUtils Missing Java Option solr.log.dir. Logging may be missing or incomplete.
   [junit4]   2> 665029 INFO  (closeThreadPool-1025-thread-1) [    ] o.a.s.s.SolrDispatchFilter Using logger factory org.apache.logging.slf4j.Log4jLoggerFactory
   [junit4]   2> 665029 INFO  (closeThreadPool-1025-thread-1) [    ] o.a.s.s.SolrDispatchFilter  ___      _       Welcome to Apache Solr? version 7.7.0
   [junit4]   2> 665029 INFO  (closeThreadPool-1025-thread-1) [    ] o.a.s.s.SolrDispatchFilter / __| ___| |_ _   Starting in cloud mode on port null
   [junit4]   2> 665029 INFO  (closeThreadPool-1025-thread-1) [    ] o.a.s.s.SolrDispatchFilter \__ \/ _ \ | '_|  Install dir: null
   [junit4]   2> 665029 INFO  (closeThreadPool-1025-thread-1) [    ] o.a.s.s.SolrDispatchFilter |___/\___/_|_|    Start time: 2019-01-04T11:09:59.352Z
   [junit4]   2> 665050 INFO  (zkConnectionManagerCallback-1043-thread-1) [    ] o.a.s.c.c.ConnectionManager zkClient has connected
   [junit4]   2> 665073 INFO  (closeThreadPool-1025-thread-1) [    ] o.a.s.s.SolrDispatchFilter Loading solr.xml from SolrHome (not found in ZooKeeper)
   [junit4]   2> 665073 INFO  (closeThreadPool-1025-thread-1) [    ] o.a.s.c.SolrXmlConfig Loading container configuration from /home/jenkins/jenkins-slave/workspace/Lucene-Solr-Tests-7.x/solr/build/solr-core/test/J1/temp/solr.core.TestDynamicLoading_A6F39AE2C0D7A026-001/shard-2-001/solr.xml
   [junit4]   2> 665077 INFO  (closeThreadPool-1025-thread-1) [    ] o.a.s.c.SolrXmlConfig Configuration parameter autoReplicaFailoverWorkLoopDelay is ignored
   [junit4]   2> 665077 INFO  (closeThreadPool-1025-thread-1) [    ] o.a.s.c.SolrXmlConfig Configuration parameter autoReplicaFailoverBadNodeExpiration is ignored
   [junit4]   2> 665091 INFO  (closeThreadPool-1025-thread-1) [    ] o.a.s.c.SolrXmlConfig MBean server found: com.sun.jmx.mbeanserver.JmxMBeanServer@95cb3e3, but no JMX reporters were configured - adding default JMX reporter.
   [junit4]   2> 665248 INFO  (OverseerCollectionConfigSetProcessor-73954048067764228-127.0.0.1:37697_-n_0000000000) [n:127.0.0.1:37697_    ] o.a.s.c.OverseerTaskQueue Response ZK path: /overseer/collection-queue-work/qnr-0000000002 doesn't exist.  Requestor may have disconnected from ZooKeeper
   [junit4]   2> 666326 INFO  (closeThreadPool-1025-thread-1) [    ] o.a.s.c.ZkContainer Zookeeper client=127.0.0.1:36305/solr
   [junit4]   2> 666328 INFO  (zkConnectionManagerCallback-1047-thread-1) [    ] o.a.s.c.c.ConnectionManager zkClient has connected
   [junit4]   2> 666379 INFO  (zkConnectionManagerCallback-1049-thread-1) [    ] o.a.s.c.c.ConnectionManager zkClient has connected
   [junit4]   2> 666435 INFO  (closeThreadPool-1025-thread-1) [    ] o.a.s.c.c.ZkStateReader Updated live nodes from ZooKeeper... (0) -> (2)
   [junit4]   2> 666471 INFO  (closeThreadPool-1025-thread-1) [    ] o.a.s.c.ZkController Publish node=127.0.0.1:39623_ as DOWN
   [junit4]   2> 666472 INFO  (closeThreadPool-1025-thread-1) [    ] o.a.s.c.TransientSolrCoreCacheDefault Allocating transient cache for 4 transient cores
   [junit4]   2> 666472 INFO  (closeThreadPool-1025-thread-1) [    ] o.a.s.c.ZkController Register node as live in ZooKeeper:/live_nodes/127.0.0.1:39623_
   [junit4]   2> 666473 INFO  (zkCallback-1023-thread-1) [    ] o.a.s.c.c.ZkStateReader Updated live nodes from ZooKeeper... (2) -> (3)
   [junit4]   2> 666473 INFO  (zkCallback-1012-thread-1) [    ] o.a.s.c.c.ZkStateReader Updated live nodes from ZooKeeper... (2) -> (3)
   [junit4]   2> 666474 INFO  (zkCallback-1005-thread-4) [    ] o.a.s.c.c.ZkStateReader Updated live nodes from ZooKeeper... (2) -> (3)
   [junit4]   2> 666474 INFO  (TEST-TestDynamicLoading.testDynamicLoading-seed#[A6F39AE2C0D7A026]) [    ] o.a.s.c.AbstractFullDistribZkTestBase create jetty 3 in directory /home/jenkins/jenkins-slave/workspace/Lucene-Solr-Tests-7.x/solr/build/solr-core/test/J1/temp/solr.core.TestDynamicLoading_A6F39AE2C0D7A026-001/shard-3-001 of type NRT
   [junit4]   2> 666487 INFO  (zkCallback-1048-thread-1) [    ] o.a.s.c.c.ZkStateReader Updated live nodes from ZooKeeper... (2) -> (3)
   [junit4]   2> 666488 WARN  (closeThreadPool-1025-thread-2) [    ] o.e.j.s.AbstractConnector Ignoring deprecated socket close linger time
   [junit4]   2> 666488 INFO  (closeThreadPool-1025-thread-2) [    ] o.a.s.c.s.e.JettySolrRunner Start Jetty (original configured port=0)
   [junit4]   2> 666488 INFO  (closeThreadPool-1025-thread-2) [    ] o.a.s.c.s.e.JettySolrRunner Trying to start Jetty on port 0 try number 1 ...
   [junit4]   2> 666488 INFO  (closeThreadPool-1025-thread-2) [    ] o.e.j.s.Server jetty-9.4.14.v20181114; built: 2018-11-14T21:20:31.478Z; git: c4550056e785fb5665914545889f21dc136ad9e6; jvm 1.8.0_191-b12
   [junit4]   2> 666511 INFO  (zkCallback-1039-thread-1) [    ] o.a.s.c.c.ZkStateReader Updated live nodes from ZooKeeper... (2) -> (3)
   [junit4]   2> 666544 INFO  (closeThreadPool-1025-thread-2) [    ] o.e.j.s.session DefaultSessionIdManager workerName=node0
   [junit4]   2> 666544 INFO  (closeThreadPool-1025-thread-2) [    ] o.e.j.s.session No SessionScavenger set, using defaults
   [junit4]   2> 666544 INFO  (closeThreadPool-1025-thread-2) [    ] o.e.j.s.session node0 Scavenging every 600000ms
   [junit4]   2> 666545 INFO  (zkCallback-1032-thread-1) [    ] o.a.s.c.c.ZkStateReader Updated live nodes from ZooKeeper... (2) -> (3)
   [junit4]   2> 666568 INFO  (closeThreadPool-1025-thread-2) [    ] o.e.j.s.h.ContextHandler Started o.e.j.s.ServletContextHandler@1fdbd4cd{/,null,AVAILABLE}
   [junit4]   2> 666601 INFO  (closeThreadPool-1025-thread-2) [    ] o.e.j.s.AbstractConnector Started ServerConnector@432b471b{HTTP/1.1,[http/1.1]}{127.0.0.1:43756}
   [junit4]   2> 666601 INFO  (closeThreadPool-1025-thread-2) [    ] o.e.j.s.Server Started @667020ms
   [junit4]   2> 666601 INFO  (closeThreadPool-1025-thread-2) [    ] o.a.s.c.s.e.JettySolrRunner Jetty properties: {solr.data.dir=/home/jenkins/jenkins-slave/workspace/Lucene-Solr-Tests-7.x/solr/build/solr-core/test/J1/temp/solr.core.TestDynamicLoading_A6F39AE2C0D7A026-001/tempDir-001/jetty3, replicaType=NRT, solrconfig=solrconfig.xml, hostContext=/, hostPort=43756, coreRootDirectory=/home/jenkins/jenkins-slave/workspace/Lucene-Solr-Tests-7.x/solr/build/solr-core/test/J1/temp/solr.core.TestDynamicLoading_A6F39AE2C0D7A026-001/shard-3-001/cores}
   [junit4]   2> 666601 ERROR (closeThreadPool-1025-thread-2) [    ] o.a.s.u.StartupLoggingUtils Missing Java Option solr.log.dir. Logging may be missing or incomplete.
   [junit4]   2> 666624 INFO  (closeThreadPool-1025-thread-2) [    ] o.a.s.s.SolrDispatchFilter Using logger factory org.apache.logging.slf4j.Log4jLoggerFactory
   [junit4]   2> 666624 INFO  (closeThreadPool-1025-thread-2) [    ] o.a.s.s.SolrDispatchFilter  ___      _       Welcome to Apache Solr? version 7.7.0
   [junit4]   2> 666624 INFO  (closeThreadPool-1025-thread-2) [    ] o.a.s.s.SolrDispatchFilter / __| ___| |_ _   Starting in cloud mode on port null
   [junit4]   2> 666624 INFO  (closeThreadPool-1025-thread-2) [    ] o.a.s.s.SolrDispatchFilter \__ \/ _ \ | '_|  Install dir: null
   [junit4]   2> 666624 INFO  (closeThreadPool-1025-thread-2) [    ] o.a.s.s.SolrDispatchFilter |___/\___/_|_|    Start time: 2019-01-04T11:10:00.947Z
   [junit4]   2> 666728 INFO  (zkConnectionManagerCallback-1058-thread-1) [    ] o.a.s.c.c.ConnectionManager zkClient has connected
   [junit4]   2> 666729 INFO  (closeThreadPool-1025-thread-2) [    ] o.a.s.s.SolrDispatchFilter Loading solr.xml from SolrHome (not found in ZooKeeper)
   [junit4]   2> 666729 INFO  (closeThreadPool-1025-thread-2) [    ] o.a.s.c.SolrXmlConfig Loading container configuration from /home/jenkins/jenkins-slave/workspace/Lucene-Solr-Tests-7.x/solr/build/solr-core/test/J1/temp/solr.core.TestDynamicLoading_A6F39AE2C0D7A026-001/shard-3-001/solr.xml
   [junit4]   2> 666746 INFO  (closeThreadPool-1025-thread-2) [    ] o.a.s.c.SolrXmlConfig Configuration parameter autoReplicaFailoverWorkLoopDelay is ignored
   [junit4]   2> 666746 INFO  (closeThreadPool-1025-thread-2) [    ] o.a.s.c.SolrXmlConfig Configuration parameter autoReplicaFailoverBadNodeExpiration is ignored
   [junit4]   2> 666747 INFO  (zkConnectionManagerCallback-1056-thread-1) [    ] o.a.s.c.c.ConnectionManager zkClient has connected
   [junit4]   2> 666765 INFO  (closeThreadPool-1025-thread-1) [    ] o.a.s.c.c.ZkStateReader Updated live nodes from ZooKeeper... (0) -> (3)
   [junit4]   2> 666766 INFO  (closeThreadPool-1025-thread-1) [    ] o.a.s.c.s.i.ZkClientClusterStateProvider Cluster at 127.0.0.1:36305/solr ready
   [junit4]   2> 666780 INFO  (closeThreadPool-1025-thread-2) [    ] o.a.s.c.SolrXmlConfig MBean server found: com.sun.jmx.mbeanserver.JmxMBeanServer@95cb3e3, but no JMX reporters were configured - adding default JMX reporter.
   [junit4]   2> 666819 INFO  (closeThreadPool-1025-thread-1) [    ] o.a.s.h.a.MetricsHistoryHandler No .system collection, keeping metrics history in memory.
   [junit4]   2> 666954 INFO  (closeThreadPool-1025-thread-1) [    ] o.a.s.m.r.SolrJmxReporter JMX monitoring for 'solr.node' (registry 'solr.node') enabled at server: com.sun.jmx.mbeanserver.JmxMBeanServer@95cb3e3
   [junit4]   2> 666991 INFO  (closeThreadPool-1025-thread-1) [    ] o.a.s.m.r.SolrJmxReporter JMX monitoring for 'solr.jvm' (registry 'solr.jvm') enabled at server: com.sun.jmx.mbeanserver.JmxMBeanServer@95cb3e3
   [junit4]   2> 666992 INFO  (closeThreadPool-1025-thread-1) [    ] o.a.s.m.r.SolrJmxReporter JMX monitoring for 'solr.jetty' (registry 'solr.jetty') enabled at server: com.sun.jmx.mbeanserver.JmxMBeanServer@95cb3e3
   [junit4]   2> 667022 INFO  (closeThreadPool-1025-thread-1) [    ] o.a.s.c.CorePropertiesLocator Found 0 core definitions underneath /home/jenkins/jenkins-slave/workspace/Lucene-Solr-Tests-7.x/solr/build/solr-core/test/J1/../../../../../../../../../../home/jenkins/jenkins-slave/workspace/Lucene-Solr-Tests-7.x/solr/build/solr-core/test/J1/temp/solr.core.TestDynamicLoading_A6F39AE2C0D7A026-001/shard-2-001/cores
   [junit4]   2> 667489 INFO  (closeThreadPool-1025-thread-2) [    ] o.a.s.c.ZkContainer Zookeeper client=127.0.0.1:36305/solr
   [junit4]   2> 667491 INFO  (zkConnectionManagerCallback-1063-thread-1) [    ] o.a.s.c.c.ConnectionManager zkClient has connected
   [junit4]   2> 667518 INFO  (zkConnectionManagerCallback-1065-thread-1) [    ] o.a.s.c.c.ConnectionManager zkClient has connected
   [junit4]   2> 667541 INFO  (closeThreadPool-1025-thread-2) [n:127.0.0.1:43756_    ] o.a.s.c.c.ZkStateReader Updated live nodes from ZooKeeper... (0) -> (3)
   [junit4]   2> 667544 INFO  (closeThreadPool-1025-thread-2) [n:127.0.0.1:43756_    ] o.a.s.c.ZkController Publish node=127.0.0.1:43756_ as DOWN
   [junit4]   2> 667557 INFO  (closeThreadPool-1025-thread-2) [n:127.0.0.1:43756_    ] o.a.s.c.TransientSolrCoreCacheDefault Allocating transient cache for 4 transient cores
   [junit4]   2> 667557 INFO  (closeThreadPool-1025-thread-2) [n:127.0.0.1:43756_    ] o.a.s.c.ZkController Register node as live in ZooKeeper:/live_nodes/127.0.0.1:43756_
   [junit4]   2> 667577 INFO  (zkCallback-1012-thread-1) [    ] o.a.s.c.c.ZkStateReader Updated live nodes from ZooKeeper... (3) -> (4)
   [junit4]   2> 667578 INFO  (zkCallback-1032-thread-1) [    ] o.a.s.c.c.ZkStateReader Updated live nodes from ZooKeeper... (3) -> (4)
   [junit4]   2> 667581 INFO  (zkCallback-1005-thread-4) [    ] o.a.s.c.c.ZkStateReader Updated live nodes from ZooKeeper... (3) -> (4)
   [junit4]   2> 667582 INFO  (zkCallback-1023-thread-1) [    ] o.a.s.c.c.ZkStateReader Updated live nodes from ZooKeeper... (3) -> (4)
   [junit4]   2> 667598 INFO  (zkCallback-1048-thread-1) [    ] o.a.s.c.c.ZkStateReader Updated live nodes from ZooKeeper... (3) -> (4)
   [junit4]   2> 667598 INFO  (zkCallback-1039-thread-1) [    ] o.a.s.c.c.ZkStateReader Updated live nodes from ZooKeeper... (3) -> (4)
   [junit4]   2> 667614 INFO  (zkCallback-1064-thread-1) [    ] o.a.s.c.c.ZkStateReader Updated live nodes from ZooKeeper... (3) -> (4)
   [junit4]   2> 667650 INFO  (zkCallback-1055-thread-1) [    ] o.a.s.c.c.ZkStateReader Updated live nodes from ZooKeeper... (3) -> (4)
   [junit4]   2> 667673 INFO  (zkConnectionManagerCallback-1072-thread-1) [    ] o.a.s.c.c.ConnectionManager zkClient has connected
   [junit4]   2> 670772 INFO  (closeThreadPool-1025-thread-2) [n:127.0.0.1:43756_    ] o.a.s.c.c.ZkStateReader Updated live nodes from ZooKeeper... (0) -> (4)
   [junit4]   2> 670774 INFO  (closeThreadPool-1025-thread-2) [n:127.0.0.1:43756_    ] o.a.s.c.s.i.ZkClientClusterStateProvider Cluster at 127.0.0.1:36305/solr ready
   [junit4]   2> 670800 INFO  (closeThreadPool-1025-thread-2) [n:127.0.0.1:43756_    ] o.a.s.h.a.MetricsHistoryHandler No .system collection, keeping metrics history in memory.
   [junit4]   2> 670817 INFO  (closeThreadPool-1025-thread-2) [n:127.0.0.1:43756_    ] o.a.s.m.r.SolrJmxReporter JMX monitoring for 'solr.node' (registry 'solr.node') enabled at server: com.sun.jmx.mbeanserver.JmxMBeanServer@95cb3e3
   [junit4]   2> 670825 INFO  (TEST-TestDynamicLoading.testDynamicLoading-seed#[A6F39AE2C0D7A026]) [    ] o.a.s.c.AbstractFullDistribZkTestBase create jetty 4 in directory /home/jenkins/jenkins-slave/workspace/Lucene-Solr-Tests-7.x/solr/build/solr-core/test/J1/temp/solr.core.TestDynamicLoading_A6F39AE2C0D7A026-001/shard-4-001 of type NRT
   [junit4]   2> 670828 WARN  (closeThreadPool-1025-thread-1) [    ] o.e.j.s.AbstractConnector Ignoring deprecated socket close linger time
   [junit4]   2> 670828 INFO  (closeThreadPool-1025-thread-1) [    ] o.a.s.c.s.e.JettySolrRunner Start Jetty (original configured port=0)
   [junit4]   2> 670828 INFO  (closeThreadPool-1025-thread-1) [    ] o.a.s.c.s.e.JettySolrRunner Trying to start Jetty on port 0 try number 1 ...
   [junit4]   2> 670828 INFO  (closeThreadPool-1025-thread-1) [    ] o.e.j.s.Server jetty-9.4.14.v20181114; built: 2018-11-14T21:20:31.478Z; git: c4550056e785fb5665914545889f21dc136ad9e6; jvm 1.8.0_191-b12
   [junit4]   2> 670832 INFO  (closeThreadPool-1025-thread-2) [n:127.0.0.1:43756_    ] o.a.s.m.r.SolrJmxReporter JMX monitoring for 'solr.jvm' (registry 'solr.jvm') enabled at server: com.sun.jmx.mbeanserver.JmxMBeanServer@95cb3e3
   [junit4]   2> 670832 INFO  (closeThreadPool-1025-thread-2) [n:127.0.0.1:43756_    ] o.a.s.m.r.SolrJmxReporter JMX monitoring for 'solr.jetty' (registry 'solr.jetty') enabled at server: com.sun.jmx.mbeanserver.JmxMBeanServer@95cb3e3
   [junit4]   2> 670834 INFO  (closeThreadPool-1025-thread-2) [n:127.0.0.1:43756_    ] o.a.s.c.CorePropertiesLocator Found 0 core definitions underneath /home/jenkins/jenkins-slave/workspace/Lucene-Solr-Tests-7.x/solr/build/solr-core/test/J1/temp/solr.core.TestDynamicLoading_A6F39AE2C0D7A026-001/shard-3-001/cores
   [junit4]   2> 670840 INFO  (closeThreadPool-1025-thread-1) [    ] o.e.j.s.session DefaultSessionIdManager workerName=node0
   [junit4]   2> 670840 INFO  (closeThreadPool-1025-thread-1) [    ] o.e.j.s.session No SessionScavenger set, using defaults
   [junit4]   2> 670840 INFO  (closeThreadPool-1025-thread-1) [    ] o.e.j.s.session node0 Scavenging every 600000ms
   [junit4]   2> 670840 INFO  (closeThreadPool-1025-thread-1) [    ] o.e.j.s.h.ContextHandler Started o.e.j.s.ServletContextHandler@4a96755f{/,null,AVAILABLE}
   [junit4]   2> 670841 INFO  (closeThreadPool-1025-thread-1) [    ] o.e.j.s.AbstractConnector Started ServerConnector@2d12934a{HTTP/1.1,[http/1.1]}{127.0.0.1:36547}
   [junit4]   2> 670841 INFO  (closeThreadPool-1025-thread-1) [    ] o.e.j.s.Server Started @671261ms
   [junit4]   2> 670842 INFO  (closeThreadPool-1025-thread-1) [    ] o.a.s.c.s.e.JettySolrRunner Jetty properties: {solr.data.dir=/home/jenkins/jenkins-slave/workspace/Lucene-Solr-Tests-7.x/solr/build/solr-core/test/J1/temp/solr.core.TestDynamicLoading_A6F39AE2C0D7A026-001/tempDir-001/jetty4, replicaType=NRT, solrconfig=solrconfig.xml, hostContext=/, hostPort=36547, coreRootDirectory=/home/jenkins/jenkins-slave/workspace/Lucene-Solr-Tests-7.x/solr/build/solr-core/test/J1/../../../../../../../../../../home/jenkins/jenkins-slave/workspace/Lucene-Solr-Tests-7.x/solr/build/solr-core/test/J1/temp/solr.core.TestDynamicLoading_A6F39AE2C0D7A026-001/shard-4-001/cores}
   [junit4]   2> 670842 ERROR (closeThreadPool-1025-thread-1) [    ] o.a.s.u.StartupLoggingUtils Missing Java Option solr.log.dir. Logging may be missing or incomplete.
   [junit4]   2> 670842 INFO  (closeThreadPool-1025-thread-1) [    ] o.a.s.s.SolrDispatchFilter Using logger factory org.apache.logging.slf4j.Log4jLoggerFactory
   [junit4]   2> 670844 INFO  (closeThreadPool-1025-thread-1) [    ] o.a.s.s.SolrDispatchFilter  ___      _       Welcome to Apache Solr? version 7.7.0
   [junit4]   2> 670844 INFO  (closeThreadPool-1025-thread-1) [    ] o.a.s.s.SolrDispatchFilter / __| ___| |_ _   Starting in cloud mode on port null
   [junit4]   2> 670844 INFO  (closeThreadPool-1025-thread-1) [    ] o.a.s.s.SolrDispatchFilter \__ \/ _ \ | '_|  Install dir: null
   [junit4]   2> 670844 INFO  (closeThreadPool-1025-thread-1) [    ] o.a.s.s.SolrDispatchFilter |___/\___/_|_|    Start time: 2019-01-04T11:10:05.167Z
   [junit4]   2> 670870 INFO  (zkConnectionManagerCallback-1075-thread-1) [    ] o.a.s.c.c.ConnectionManager zkClient has connected
   [junit4]   2> 670872 INFO  (closeThreadPool-1025-thread-1) [    ] o.a.s.s.SolrDispatchFilter Loading solr.xml from SolrHome (not found in ZooKeeper)
   [junit4]   2> 670872 INFO  (closeThreadPool-1025-thread-1) [    ] o.a.s.c.SolrXmlConfig Loading container configuration from /home/jenkins/jenkins-slave/workspace/Lucene-Solr-Tests-7.x/solr/build/solr-core/test/J1/temp/solr.core.TestDynamicLoading_A6F39AE2C0D7A026-001/shard-4-001/solr.xml
   [junit4]   2> 670875 INFO  (closeThreadPool-1025-thread-1) [    ] o.a.s.c.SolrXmlConfig Configuration parameter autoReplicaFailoverWorkLoopDelay is ignored
   [junit4]   2> 670875 INFO  (closeThreadPool-1025-thread-1) [    ] o.a.s.c.SolrXmlConfig Configuration parameter autoReplicaFailoverBadNodeExpiration is ignored
   [junit4]   2> 670877 INFO  (closeThreadPool-1025-thread-1) [    ] o.a.s.c.SolrXmlConfig MBean server found: com.sun.jmx.mbeanserver.JmxMBeanServer@95cb3e3, but no JMX reporters were configured - adding default JMX reporter.
   [junit4]   2> 671023 INFO  (closeThreadPool-1025-thread-1) [    ] o.a.s.c.ZkContainer Zookeeper client=127.0.0.1:36305/solr
   [junit4]   2> 671025 INFO  (zkConnectionManagerCallback-1079-thread-1) [    ] o.a.s.c.c.ConnectionManager zkClient has connected
   [junit4]   2> 671027 INFO  (zkConnectionManagerCallback-1081-thread-1) [    ] o.a.s.c.c.ConnectionManager zkClient has connected
   [junit4]   2> 671032 INFO  (closeThreadPool-1025-thread-1) [    ] o.a.s.c.c.ZkStateReader Updated live nodes from ZooKeeper... (0) -> (4)
   [junit4]   2> 671038 INFO  (closeThreadPool-1025-thread-1) [    ] o.a.s.c.ZkController Publish node=127.0.0.1:36547_ as DOWN
   [junit4]   2> 671040 INFO  (closeThreadPool-1025-thread-1) [    ] o.a.s.c.TransientSolrCoreCacheDefault Allocating transient cache for 4 transient cores
   [junit4]   2> 671040 INFO  (closeThreadPool-1025-thread-1) [    ] o.a.s.c.ZkController Register node as live in ZooKeeper:/live_nodes/127.0.0.1:36547_
   [junit4]   2> 671049 INFO  (zkCallback-1032-thread-1) [    ] o.a.s.c.c.ZkStateReader Updated live nodes from ZooKeeper... (4) -> (5)
   [junit4]   2> 671050 INFO  (zkCallback-1012-thread-1) [    ] o.a.s.c.c.ZkStateReader Updated live nodes from ZooKeeper... (4) -> (5)
   [junit4]   2> 671050 INFO  (zkCallback-1023-thread-1) [    ] o.a.s.c.c.ZkStateReader Updated live nodes from ZooKeeper... (4) -> (5)
   [junit4]   2> 671050 INFO  (zkCallback-1048-thread-1) [    ] o.a.s.c.c.ZkStateReader Updated live nodes from ZooKeeper... (4) -> (5)
   [junit4]   2> 671050 INFO  (zkCallback-1039-thread-1) [    ] o.a.s.c.c.ZkStateReader Updated live nodes from ZooKeeper... (4) -> (5)
   [junit4]   2> 671051 INFO  (zkCallback-1005-thread-4) [    ] o.a.s.c.c.ZkStateReader Updated live nodes from ZooKeeper... (4) -> (5)
   [junit4]   2> 671051 INFO  (zkCallback-1064-thread-1) [    ] o.a.s.c.c.ZkStateReader Updated live nodes from ZooKeeper... (4) -> (5)
   [junit4]   2> 671051 INFO  (zkCallback-1055-thread-1) [    ] o.a.s.c.c.ZkStateReader Updated live nodes from ZooKeeper... (4) -> (5)
   [junit4]   2> 671053 INFO  (zkCallback-1071-thread-1) [    ] o.a.s.c.c.ZkStateReader Updated live nodes from ZooKeeper... (4) -> (5)
   [junit4]   2> 671053 INFO  (zkCallback-1080-thread-1) [    ] o.a.s.c.c.ZkStateReader Updated live nodes from ZooKeeper... (4) -> (5)
   [junit4]   2> 671089 INFO  (zkConnectionManagerCallback-1088-thread-1) [    ] o.a.s.c.c.ConnectionManager zkClient has connected
   [junit4]   2> 671090 INFO  (closeThreadPool-1025-thread-1) [    ] o.a.s.c.c.ZkStateReader Updated live nodes from ZooKeeper... (0) -> (5)
   [junit4]   2> 671092 INFO  (closeThreadPool-1025-thread-1) [    ] o.a.s.c.s.i.ZkClientClusterStateProvider Cluster at 127.0.0.1:36305/solr ready
   [junit4]   2> 671092 INFO  (closeThreadPool-1025-thread-1) [    ] o.a.s.h.a.MetricsHistoryHandler No .system collection, keeping metrics history in memory.
   [junit4]   2> 671106 INFO  (closeThreadPool-1025-thread-1) [    ] o.a.s.m.r.SolrJmxReporter JMX monitoring for 'solr.node' (registry 'solr.node') enabled at server: com.sun.jmx.mbeanserver.JmxMBeanServer@95cb3e3
   [junit4]   2> 671114 INFO  (closeThreadPool-1025-thread-1) [    ] o.a.s.m.r.SolrJmxReporter JMX monitoring for 'solr.jvm' (registry 'solr.jvm') enabled at server: com.sun.jmx.mbeanserver.JmxMBeanServer@95cb3e3
   [junit4]   2> 671114 INFO  (closeThreadPool-1025-thread-1) [    ] o.a.s.m.r.SolrJmxReporter JMX monitoring for 'solr.jetty' (registry 'solr.jetty') enabled at server: com.sun.jmx.mbeanserver.JmxMBeanServer@95cb3e3
   [junit4]   2> 671115 INFO  (closeThreadPool-1025-thread-1) [    ] o.a.s.c.CorePropertiesLocator Found 0 core definitions underneath /home/jenkins/jenkins-slave/workspace/Lucene-Solr-Tests-7.x/solr/build/solr-core/test/J1/../../../../../../../../../../home/jenkins/jenkins-slave/workspace/Lucene-Solr-Tests-7.x/solr/build/solr-core/test/J1/temp/solr.core.TestDynamicLoading_A6F39AE2C0D7A026-001/shard-4-001/cores
   [junit4]   2> 671163 INFO  (qtp286262693-3458) [n:127.0.0.1:36547_    ] o.a.s.h.a.CollectionsHandler Invoked Collection Action :addreplica with params node=127.0.0.1:36853_&action=ADDREPLICA&collection=collection1&shard=shard2&type=NRT&wt=javabin&version=2 and sendToOCPQueue=true
   [junit4]   2> 671165 INFO  (qtp286262693-3457) [n:127.0.0.1:36547_    ] o.a.s.h.a.CollectionsHandler Invoked Collection Action :addreplica with params node=127.0.0.1:36547_&action=ADDREPLICA&collection=collection1&shard=shard1&type=NRT&wt=javabin&version=2 and sendToOCPQueue=true
   [junit4]   2> 671165 INFO  (qtp286262693-3459) [n:127.0.0.1:36547_    ] o.a.s.h.a.CollectionsHandler Invoked Collection Action :addreplica with params node=127.0.0.1:39623_&action=ADDREPLICA&collection=collection1&shard=shard1&type=NRT&wt=javabin&version=2 and sendToOCPQueue=true
   [junit4]   2> 671166 INFO  (qtp286262693-3455) [n:127.0.0.1:36547_    ] o.a.s.h.a.CollectionsHandler Invoked Collection Action :addreplica with params node=127.0.0.1:43756_&action=ADDREPLICA&collection=collection1&shard=shard2&type=NRT&wt=javabin&version=2 and sendToOCPQueue=true
   [junit4]   2> 671178 INFO  (qtp286262693-3460) [n:127.0.0.1:36547_    ] o.a.s.s.HttpSolrCall [admin] webapp=null path=/admin/metrics params={prefix=CONTAINER.fs.usableSpace,CONTAINER.fs.totalSpace,CORE.coreName&wt=javabin&version=2&group=solr.node,solr.core} status=0 QTime=0
   [junit4]   2> 671182 INFO  (qtp286262693-3495) [n:127.0.0.1:36547_    ] o.a.s.s.HttpSolrCall [admin] webapp=null path=/admin/metrics params={prefix=CONTAINER.fs.usableSpace,CONTAINER.fs.totalSpace,CORE.coreName&wt=javabin&version=2&group=solr.node,solr.core} status=0 QTime=0
   [junit4]   2> 671183 INFO  (qtp286262693-3495) [n:127.0.0.1:36547_    ] o.a.s.s.HttpSolrCall [admin] webapp=null path=/admin/metrics params={prefix=CONTAINER.fs.usableSpace,CONTAINER.fs.totalSpace,CORE.coreName&wt=javabin&version=2&group=solr.node,solr.core} status=0 QTime=0
   [junit4]   2> 671184 INFO  (qtp286262693-3495) [n:127.0.0.1:36547_    ] o.a.s.s.HttpSolrCall [admin] webapp=null path=/admin/metrics params={prefix=CONTAINER.fs.usableSpace,CONTAINER.fs.totalSpace,CORE.coreName&wt=javabin&version=2&group=solr.node,solr.core} status=0 QTime=0
   [junit4]   2> 671185 INFO  (qtp286262693-3495) [n:127.0.0.1:36547_    ] o.a.s.s.HttpSolrCall [admin] webapp=null path=/admin/metrics params={prefix=CONTAINER.fs.usableSpace,CONTAINER.fs.totalSpace,CORE.coreName&wt=javabin&version=2&group=solr.node,solr.core} status=0 QTime=0
   [junit4]   2> 671197 INFO  (qtp48678091-3360) [n:127.0.0.1:36853_    ] o.a.s.s.HttpSolrCall [admin] webapp=null path=/admin/metrics params={prefix=CONTAINER.fs.usableSpace,CONTAINER.fs.totalSpace,CORE.coreName&wt=javabin&version=2&group=solr.node,solr.core} status=0 QTime=0
   [junit4]   2> 671198 INFO  (qtp48678091-3361) [n:127.0.0.1:36853_    ] o.a.s.s.HttpSolrCall [admin] webapp=null path=/admin/metrics params={prefix=CONTAINER.fs.usableSpace,CONTAINER.fs.totalSpace,CORE.coreName&wt=javabin&version=2&group=solr.node,solr.core} status=0 QTime=0
   [junit4]   2> 671199 INFO  (qtp48678091-3362) [n:127.0.0.1:36853_    ] o.a.s.s.HttpSolrCall [admin] webapp=null path=/admin/metrics params={prefix=CONTAINER.fs.usableSpace,CONTAINER.fs.totalSpace,CORE.coreName&wt=javabin&version=2&group=solr.node,solr.core} status=0 QTime=0
   [junit4]   2> 671200 INFO  (qtp48678091-3363) [n:127.0.0.1:36853_    ] o.a.s.s.HttpSolrCall [admin] webapp=null path=/admin/metrics params={prefix=CONTAINER.fs.usableSpace,CONTAINER.fs.totalSpace,CORE.coreName&wt=javabin&version=2&group=solr.node,solr.core} status=0 QTime=0
   [junit4]   2> 671201 INFO  (qtp48678091-3359) [n:127.0.0.1:36853_    ] o.a.s.s.HttpSolrCall [admin] webapp=null path=/admin/metrics params={prefix=CONTAINER.fs.usableSpace,CONTAINER.fs.totalSpace,CORE.coreName&wt=javabin&version=2&group=solr.node,solr.core} status=0 QTime=0
   [junit4]   2> 671204 INFO  (qtp1299815458-3298) [n:127.0.0.1:37697_    ] o.a.s.s.HttpSolrCall [admin] webapp=null path=/admin/metrics params={wt=javabin&version=2&key=solr.core.control_collection.shard1.replica_n1:INDEX.sizeInBytes} status=0 QTime=1
   [junit4]   2> 671205 INFO  (qtp1299815458-3297) [n:127.0.0.1:37697_    ] o.a.s.s.HttpSolrCall [admin] webapp=null path=/admin/metrics params={wt=javabin&version=2&key=solr.core.control_collection.shard1.replica_n1:INDEX.sizeInBytes} status=0 QTime=0
   [junit4]   2> 671206 INFO  (qtp1299815458-3299) [n:127.0.0.1:37697_    ] o.a.s.s.HttpSolrCall [admin] webapp=null path=/admin/metrics params={wt=javabin&version=2&key=solr.core.control_collection.shard1.replica_n1:INDEX.sizeInBytes} status=0 QTime=0
   [junit4]   2> 671207 INFO  (qtp1299815458-3300) [n:127.0.0.1:37697_    ] o.a.s.s.HttpSolrCall [admin] webapp=null path=/admin/metrics params={prefix=CONTAINER.fs.usableSpace,CONTAINER.fs.totalSpace,CORE.coreName&wt=javabin&version=2&group=solr.node,solr.core} status=0 QTime=0
   [junit4]   2> 671208 INFO  (qtp1299815458-3301) [n:127.0.0.1:37697_    ] o.a.s.s.HttpSolrCall [admin] webapp=null path=/admin/metrics params={prefix=CONTAINER.fs.usableSpace,CONTAINER.fs.totalSpace,CORE.coreName&wt=javabin&version=2&group=solr.node,solr.core} status=0 QTime=0
   [junit4]   2> 671209 INFO  (qtp1299815458-3298) [n:127.0.0.1:37697_    ] o.a.s.s.HttpSolrCall [admin] webapp=null path=/admin/metrics params={prefix=CONTAINER.fs.usableSpace,CONTAINER.fs.totalSpace,CORE.coreName&wt=javabin&version=2&group=solr.node,solr.core} status=0 QTime=0
   [junit4]   2> 671210 INFO  (qtp1299815458-3297) [n:127.0.0.1:37697_    ] o.a.s.s.HttpSolrCall [admin] webapp=null path=/admin/metrics params={prefix=CONTAINER.fs.usableSpace,CONTAINER.fs.totalSpace,CORE.coreName&wt=javabin&version=2&group=solr.node,solr.core} status=0 QTime=0
   [junit4]   2> 671211 INFO  (qtp1299815458-3299) [n:127.0.0.1:37697_    ] o.a.s.s.HttpSolrCall [admin] webapp=null path=/admin/metrics params={prefix=CONTAINER.fs.usableSpace,CONTAINER.fs.totalSpace,CORE.coreName&wt=javabin&version=2&group=solr.node,solr.core} status=0 QTime=0
   [junit4]   2> 671213 INFO  (qtp1007351383-3392) [n:127.0.0.1:39623_    ] o.a.s.s.HttpSolrCall [admin] webapp=null path=/admin/metrics params={prefix=CONTAINER.fs.usableSpace,CONTAINER.fs.totalSpace,CORE.coreName&wt=javabin&version=2&group=solr.node,solr.core} status=0 QTime=0
   [junit4]   2> 671214 INFO  (qtp1007351383-3393) [n:127.0.0.1:39623_    ] o.a.s.s.HttpSolrCall [admin] webapp=null path=/admin/metrics params={prefix=CONTAINER.fs.usableSpace,CONTAINER.fs.totalSpace,CORE.coreName&wt=javabin&version=2&group=solr.node,solr.core} status=0 QTime=0
   [junit4]   2> 671215 INFO  (qtp1007351383-3394) [n:127.0.0.1:39623_    ] o.a.s.s.HttpSolrCall [admin] webapp=null path=/admin/metrics params={prefix=CONTAINER.fs.usableSpace,CONTAINER.fs.totalSpace,CORE.coreName&wt=javabin&version=2&group=solr.node,solr.core} status=0 QTime=0
   [junit4]   2> 671216 INFO  (qtp1007351383-3395) [n:127.0.0.1:39623_    ] o.a.s.s.HttpSolrCall [admin] webapp=null path=/admin/metrics params={prefix=CONTAINER.fs.usableSpace,CONTAINER.fs.totalSpace,CORE.coreName&wt=javabin&version=2&group=solr.node,solr.core} status=0 QTime=0
   [junit4]   2> 671217 INFO  (qtp1007351383-3391) [n:127.0.0.1:39623_    ] o.a.s.s.HttpSolrCall [admin] webapp=null path=/admin/metrics params={prefix=CONTAINER.fs.usableSpace,CONTAINER.fs.totalSpace,CORE.coreName&wt=javabin&version=2&group=solr.node,solr.core} status=0 QTime=0
   [junit4]   2> 671219 INFO  (qtp1839694479-3417) [n:127.0.0.1:43756_    ] o.a.s.s.HttpSolrCall [admin] webapp=null path=/admin/metrics params={prefix=CONTAINER.fs.usableSpace,CONTAINER.fs.totalSpace,CORE.coreName&wt=javabin&version=2&group=solr.node,solr.core} status=0 QTime=0
   [junit4]   2> 671220 INFO  (qtp1839694479-3418) [n:127.0.0.1:43756_    ] o.a.s.s.HttpSolrCall [admin] webapp=null path=/admin/metrics params={prefix=CONTAINER.fs.usableSpace,CONTAINER.fs.totalSpace,CORE.coreName&wt=javabin&version=2&group=solr.node,solr.core} status=0 QTime=0
   [junit4]   2> 671221 INFO  (qtp1839694479-3420) [n:127.0.0.1:43756_    ] o.a.s.s.HttpSolrCall [admin] webapp=null path=/admin/metrics params={prefix=CONTAINER.fs.usableSpace,CONTAINER.fs.totalSpace,CORE.coreName&wt=javabin&version=2&group=solr.node,solr.core} status=0 QTime=0
   [junit4]   2> 671222 INFO  (qtp1839694479-3419) [n:127.0.0.1:43756_    ] o.a.s.s.HttpSolrCall [admin] webapp=null path=/admin/metrics params={prefix=CONTAINER.fs.usableSpace,CONTAINER.fs.totalSpace,CORE.coreName&wt=javabin&version=2&group=solr.node,solr.core} status=0 QTime=0
   [junit4]   2> 671222 INFO  (qtp1839694479-3416) [n:127.0.0.1:43756_    ] o.a.s.s.HttpSolrCall [admin] webapp=null path=/admin/metrics params={prefix=CONTAINER.fs.usableSpace,CONTAINER.fs.totalSpace,CORE.coreName&wt=javabin&version=2&group=solr.node,solr.core} status=0 QTime=0
   [junit4]   2> 671223 INFO  (OverseerThreadFactory-1216-thread-3-processing-n:127.0.0.1:37697_) [n:127.0.0.1:37697_ c:collection1 s:shard2  ] o.a.s.c.a.c.AddReplicaCmd Node Identified 127.0.0.1:36853_ for creating new replica of shard shard2 for collection collection1
   [junit4]   2> 671223 INFO  (OverseerThreadFactory-1216-thread-4-processing-n:127.0.0.1:37697_) [n:127.0.0.1:37697_ c:collection1 s:shard1  ] o.a.s.c.a.c.AddReplicaCmd Node Identified 127.0.0.1:36547_ for creating new replica of shard shard1 for collection collection1
   [junit4]   2> 671225 INFO  (OverseerThreadFactory-1216-thread-4-processing-n:127.0.0.1:37697_) [n:127.0.0.1:37697_ c:collection1 s:shard1  ] o.a.s.c.a.c.AddReplicaCmd Returning CreateReplica command.
   [junit4]   2> 671226 INFO  (OverseerThreadFactory-1216-thread-3-processing-n:127.0.0.1:37697_) [n:127.0.0.1:37697_ c:collection1 s:shard2  ] o.a.s.c.a.c.AddReplicaCmd Returning CreateReplica command.
   [junit4]   2> 671227 INFO  (qtp286262693-3460) [n:127.0.0.1:36547_    x:collection1_shard1_replica_n1] o.a.s.h.a.CoreAdminOperation core create command qt=/admin/cores&collection.configName=conf1&name=collection1_shard1_replica_n1&action=CREATE&collection=collection1&shard=shard1&wt=javabin&version=2&replicaType=NRT
   [junit4]   2> 671228 INFO  (qtp48678091-3361) [n:127.0.0.1:36853_    x:collection1_shard2_replica_n2] o.a.s.h.a.CoreAdminOperation core create command qt=/admin/cores&collection.configName=conf1&name=collection1_shard2_replica_n2&action=CREATE&collection=collection1&shard=shard2&wt=javabin&version=2&replicaType=NRT
   [junit4]   2> 672243 INFO  (qtp48678091-3361) [n:127.0.0.1:36853_ c:collection1 s:shard2  x:collection1_shard2_replica_n2] o.a.s.c.SolrConfig Using Lucene MatchVersion: 7.7.0
   [junit4]   2> 672243 INFO  (qtp286262693-3460) [n:127.0.0.1:36547_ c:collection1 s:shard1  x:collection1_shard1_replica_n1] o.a.s.c.SolrConfig Using Lucene MatchVersion: 7.7.0
   [junit4]   2> 672262 INFO  (qtp48678091-3361) [n:127.0.0.1:36853_ c:collection1 s:shard2  x:collection1_shard2_replica_n2] o.a.s.s.IndexSchema [collection1_shard2_replica_n2] Schema name=test
   [junit4]   2> 672262 INFO  (qtp286262693-3460) [n:127.0.0.1:36547_ c:collection1 s:shard1  x:collection1_shard1_replica_n1] o.a.s.s.IndexSchema [collection1_shard1_replica_n1] Schema name=test
   [junit4]   2> 672352 INFO  (qtp48678091-3361) [n:127.0.0.1:36853_ c:collection1 s:shard2  x:collection1_shard2_replica_n2] o.a.s.s.IndexSchema Loaded schema test/1.0 with uniqueid field id
   [junit4]   2> 672353 INFO  (qtp286262693-3460) [n:127.0.0.1:36547_ c:collection1 s:shard1  x:collection1_shard1_replica_n1] o.a.s.s.IndexSchema Loaded schema test/1.0 with uniqueid field id
   [junit4]   2> 672369 INFO  (qtp286262693-3460) [n:127.0.0.1:36547_ c:collection1 s:shard1  x:collection1_shard1_replica_n1] o.a.s.c.CoreContainer Creating SolrCore 'collection1_shard1_replica_n1' using configuration from collection collection1, trusted=true
   [junit4]   2> 672370 INFO  (qtp286262693-3460) [n:127.0.0.1:36547_ c:collection1 s:shard1  x:collection1_shard1_replica_n1] o.a.s.m.r.SolrJmxReporter JMX monitoring for 'solr.core.collection1.shard1.replica_n1' (registry 'solr.core.collection1.shard1.replica_n1') enabled at server: com.sun.jmx.mbeanserver.JmxMBeanServer@95cb3e3
   [junit4]   2> 672370 INFO  (qtp286262693-3460) [n:127.0.0.1:36547_ c:collection1 s:shard1  x:collection1_shard1_replica_n1] o.a.s.c.SolrCore [[collection1_shard1_replica_n1] ] Opening new SolrCore at [/home/jenkins/jenkins-slave/workspace/Lucene-Solr-Tests-7.x/solr/build/solr-core/test/J1/temp/solr.core.TestDynamicLoading_A6F39AE2C0D7A026-001/shard-4-001/cores/collection1_shard1_replica_n1], dataDir=[/home/jenkins/jenkins-slave/workspace/Lucene-Solr-Tests-7.x/solr/build/solr-core/test/J1/../../../../../../../../../../home/jenkins/jenkins-slave/workspace/Lucene-Solr-Tests-7.x/solr/build/solr-core/test/J1/temp/solr.core.TestDynamicLoading_A6F39AE2C0D7A026-001/shard-4-001/cores/collection1_shard1_replica_n1/data/]
   [junit4]   2> 672372 INFO  (qtp286262693-3460) [n:127.0.0.1:36547_ c:collection1 s:shard1  x:collection1_shard1_replica_n1] o.a.s.u.RandomMergePolicy RandomMergePolicy wrapping class org.apache.lucene.index.TieredMergePolicy: [TieredMergePolicy: maxMergeAtOnce=46, maxMergeAtOnceExplicit=10, maxMergedSegmentMB=98.2646484375, floorSegmentMB=1.8544921875, forceMergeDeletesPctAllowed=10.709214999013286, segmentsPerTier=24.0, maxCFSSegmentSizeMB=8.796093022207999E12, noCFSRatio=0.0, deletesPctAllowed=22.324336285338156
   [junit4]   2> 672375 WARN  (qtp286262693-3460) [n:127.0.0.1:36547_ c:collection1 s:shard1  x:collection1_shard1_replica_n1] o.a.s.c.RequestHandlers INVALID paramSet a in requestHandler {type = requestHandler,name = /dump,class = DumpRequestHandler,attributes = {initParams=a, name=/dump, class=DumpRequestHandler},args = {defaults={a=A,b=B}}}
   [junit4]   2> 672383 INFO  (qtp48678091-3361) [n:127.0.0.1:36853_ c:collection1 s:shard2  x:collection1_shard2_replica_n2] o.a.s.c.CoreContainer Creating SolrCore 'collection1_shard2_replica_n2' using configuration from collection collection1, trusted=true
   [junit4]   2> 672383 INFO  (qtp48678091-3361) [n:127.0.0.1:36853_ c:collection1 s:shard2  x:collection1_shard2_replica_n2] o.a.s.m.r.SolrJmxReporter JMX monitoring for 'solr.core.collection1.shard2.replica_n2' (registry 'solr.core.collection1.shard2.replica_n2') enabled at server: com.sun.jmx.mbeanserver.JmxMBeanServer@95cb3e3
   [junit4]   2> 672383 INFO  (qtp48678091-3361) [n:127.0.0.1:36853_ c:collection1 s:shard2  x:collection1_shard2_replica_n2] o.a.s.c.SolrCore [[collection1_shard2_replica_n2] ] Opening new SolrCore at [/home/jenkins/jenkins-slave/workspace/Lucene-Solr-Tests-7.x/solr/build/solr-core/test/J1/temp/solr.core.TestDynamicLoading_A6F39AE2C0D7A026-001/shard-1-001/cores/collection1_shard2_replica_n2], dataDir=[/home/jenkins/jenkins-slave/workspace/Lucene-Solr-Tests-7.x/solr/build/solr-core/test/J1/temp/solr.core.TestDynamicLoading_A6F39AE2C0D7A026-001/shard-1-001/cores/collection1_shard2_replica_n2/data/]
   [junit4]   2> 672385 INFO  (qtp48678091-3361) [n:127.0.0.1:36853_ c:collection1 s:shard2  x:collection1_shard2_replica_n2] o.a.s.u.RandomMergePolicy RandomMergePolicy wrapping class org.apache.lucene.index.TieredMergePolicy: [TieredMergePolicy: maxMergeAtOnce=46, maxMergeAtOnceExplicit=10, maxMergedSegmentMB=98.2646484375, floorSegmentMB=1.8544921875, forceMergeDeletesPctAllowed=10.709214999013286, segmentsPerTier=24.0, maxCFSSegmentSizeMB=8.796093022207999E12, noCFSRatio=0.0, deletesPctAllowed=22.324336285338156
   [junit4]   2> 672387 WARN  (qtp48678091-3361) [n:127.0.0.1:36853_ c:collection1 s:shard2  x:collection1_shard2_replica_n2] o.a.s.c.RequestHandlers INVALID paramSet a in requestHandler {type = requestHandler,name = /dump,class = DumpRequestHandler,attributes = {initParams=a, name=/dump, class=DumpRequestHandler},args = {defaults={a=A,b=B}}}
   [junit4]   2> 672416 INFO  (qtp286262693-3460) [n:127.0.0.1:36547_ c:collection1 s:shard1  x:collection1_shard1_replica_n1] o.a.s.u.UpdateHandler Using UpdateLog implementation: org.apache.solr.update.UpdateLog
   [junit4]   2> 672416 INFO  (qtp286262693-3460) [n:127.0.0.1:36547_ c:collection1 s:shard1  x:collection1_shard1_replica_n1] o.a.s.u.UpdateLog Initializing UpdateLog: dataDir= defaultSyncLevel=FLUSH numRecordsToKeep=100 maxNumLogsToKeep=10 numVersionBuckets=65536
   [junit4]   2> 672418 INFO  (qtp286262693-3460) [n:127.0.0.1:36547_ c:collection1 s:shard1  x:collection1_shard1_replica_n1] o.a.s.u.CommitTracker Hard AutoCommit: disabled
   [junit4]   2> 672419 INFO  (qtp286262693-3460) [n:127.0.0.1:36547_ c:collection1 s:shard1  x:collection1_shard1_replica_n1] o.a.s.u.CommitTracker Soft AutoCommit: disabled
   [junit4]   2> 672420 INFO  (qtp286262693-3460) [n:127.0.0.1:36547_ c:collection1 s:shard1  x:collection1_shard1_replica_n1] o.a.s.u.RandomMergePolicy RandomMergePolicy wrapping class org.apache.lucene.index.TieredMergePolicy: [TieredMergePolicy: maxMergeAtOnce=18, maxMergeAtOnceExplicit=45, maxMergedSegmentMB=93.8154296875, floorSegmentMB=1.8330078125, forceMergeDeletesPctAllowed=27.785245084607737, segmentsPerTier=49.0, maxCFSSegmentSizeMB=8.796093022207999E12, noCFSRatio=0.12407939940405194, deletesPctAllowed=29.903567428749096
   [junit4]   2> 672420 INFO  (qtp286262693-3460) [n:127.0.0.1:36547_ c:collection1 s:shard1  x:collection1_shard1_replica_n1] o.a.s.s.SolrIndexSearcher Opening [Searcher@3fb4f751[collection1_shard1_replica_n1] main]
   [junit4]   2> 672421 INFO  (qtp286262693-3460) [n:127.0.0.1:36547_ c:collection1 s:shard1  x:collection1_shard1_replica_n1] o.a.s.r.ManagedResourceStorage Configured ZooKeeperStorageIO with znodeBase: /configs/conf1
   [junit4]   2> 672422 INFO  (qtp286262693-3460) [n:127.0.0.1:36547_ c:collection1 s:shard1  x:collection1_shard1_replica_n1] o.a.s.r.ManagedResourceStorage Loaded null at path _rest_managed.json using ZooKeeperStorageIO:path=/configs/conf1
   [junit4]   2> 672422 INFO  (qtp286262693-3460) [n:127.0.0.1:36547_ c:collection1 s:shard1  x:collection1_shard1_replica_n1] o.a.s.h.ReplicationHandler Commits will be reserved for 10000ms.
   [junit4]   2> 672422 INFO  (qtp286262693-3460) [n:127.0.0.1:36547_ c:collection1 s:shard1  x:collection1_shard1_replica_n1] o.a.s.u.UpdateLog Could not find max version in index or recent updates, using new clock 1621727858387845120
   [junit4]   2> 672427 INFO  (qtp286262693-3460) [n:127.0.0.1:36547_ c:collection1 s:shard1  x:collection1_shard1_replica_n1] o.a.s.c.ZkShardTerms Successful update of terms at /collections/collection1/terms/shard1 to Terms{values={core_node3=0}, version=0}
   [junit4]   2> 672427 INFO  (qtp286262693-3460) [n:127.0.0.1:36547_ c:collection1 s:shard1  x:collection1_shard1_replica_n1] o.a.s.c.ShardLeaderElectionContextBase make sure parent is created /collections/collection1/leaders/shard1
   [junit4]   2> 672427 INFO  (searcherExecutor-1262-thread-1-processing-n:127.0.0.1:36547_ x:collection1_shard1_replica_n1 c:collection1 s:shard1) [n:127.0.0.1:36547_ c:collection1 s:shard1  x:collection1_shard1_replica_n1] o.a.s.c.SolrCore [collection1_shard1_replica_n1] Registered new searcher Searcher@3fb4f751[collection1_shard1_replica_n1] main{ExitableDirectoryReader(UninvertingDirectoryReader())}
   [junit4]   2> 672428 INFO  (qtp48678091-3361) [n:127.0.0.1:36853_ c:collection1 s:shard2  x:collection1_shard2_replica_n2] o.a.s.u.UpdateHandler Using UpdateLog implementation: org.apache.solr.update.UpdateLog
   [junit4]   2> 672428 INFO  (qtp48678091-3361) [n:127.0.0.1:36853_ c:collection1 s:shard2  x:collection1_shard2_replica_n2] o.a.s.u.UpdateLog Initializing UpdateLog: dataDir= defaultSyncLevel=FLUSH numRecordsToKeep=100 maxNumLogsToKeep=10 numVersionBuckets=65536
   [junit4]   2> 672430 INFO  (qtp48678091-3361) [n:127.0.0.1:36853_ c:collection1 s:shard2  x:collection1_shard2_replica_n2] o.a.s.u.CommitTracker Hard AutoCommit: disabled
   [junit4]   2> 672430 INFO  (qtp48678091-3361) [n:127.0.0.1:36853_ c:collection1 s:shard2  x:collection1_shard2_replica_n2] o.a.s.u.CommitTracker Soft AutoCommit: disabled
   [junit4]   2> 672431 INFO  (qtp48678091-3361) [n:127.0.0.1:36853_ c:collection1 s:shard2  x:collection1_shard2_replica_n2] o.a.s.u.RandomMergePolicy RandomMergePolicy wrapping class org.apache.lucene.index.TieredMergePolicy: [TieredMergePolicy: maxMergeAtOnce=18, maxMergeAtOnceExplicit=45, maxMergedSegmentMB=93.8154296875, floorSegmentMB=1.8330078125, forceMergeDeletesPctAllowed=27.785245084607737, segmentsPerTier=49.0, maxCFSSegmentSizeMB=8.796093022207999E12, noCFSRatio=0.12407939940405194, deletesPctAllowed=29.903567428749096
   [junit4]   2> 672432 INFO  (qtp48678091-3361) [n:127.0.0.1:36853_ c:collection1 s:shard2  x:collection1_shard2_replica_n2] o.a.s.s.SolrIndexSearcher Opening [Searcher@1b04e670[collection1_shard2_replica_n2] main]
   [junit4]   2> 672433 INFO  (qtp48678091-3361) [n:127.0.0.1:36853_ c:collection1 s:shard2  x:collection1_shard2_replica_n2] o.a.s.r.ManagedResourceStorage Configured ZooKeeperStorageIO with znodeBase: /configs/conf1
   [junit4]   2> 672433 INFO  (qtp48678091-3361) [n:127.0.0.1:36853_ c:collection1 s:shard2  x:collection1_shard2_replica_n2] o.a.s.r.ManagedResourceStorage Loaded null at path _rest_managed.json using ZooKeeperStorageIO:path=/configs/conf1
   [junit4]   2> 672434 INFO  (qtp48678091-3361) [n:127.0.0.1:36853_ c:collection1 s:shard2  x:collection1_shard2_replica_n2] o.a.s.h.ReplicationHandler Commits will be reserved for 10000ms.
   [junit4]   2> 672434 INFO  (qtp48678091-3361) [n:127.0.0.1:36853_ c:collection1 s:shard2  x:collection1_shard2_replica_n2] o.a.s.u.UpdateLog Could not find max version in index or recent updates, using new clock 162172785840

[...truncated too long message...]



-ivy-fail-disallowed-ivy-version:

ivy-fail:

ivy-fail:

ivy-configure:
[ivy:configure] :: loading settings :: file = /home/jenkins/jenkins-slave/workspace/Lucene-Solr-Tests-7.x/lucene/top-level-ivy-settings.xml

resolve:

ivy-availability-check:
[loadresource] Do not set property disallowed.ivy.jars.list as its length is 0.

-ivy-fail-disallowed-ivy-version:

ivy-fail:

ivy-configure:
[ivy:configure] :: loading settings :: file = /home/jenkins/jenkins-slave/workspace/Lucene-Solr-Tests-7.x/lucene/top-level-ivy-settings.xml

resolve:

ivy-availability-check:
[loadresource] Do not set property disallowed.ivy.jars.list as its length is 0.

-ivy-fail-disallowed-ivy-version:

ivy-fail:

ivy-fail:

ivy-configure:
[ivy:configure] :: loading settings :: file = /home/jenkins/jenkins-slave/workspace/Lucene-Solr-Tests-7.x/lucene/top-level-ivy-settings.xml

resolve:

ivy-availability-check:
[loadresource] Do not set property disallowed.ivy.jars.list as its length is 0.

-ivy-fail-disallowed-ivy-version:

ivy-fail:

ivy-configure:
[ivy:configure] :: loading settings :: file = /home/jenkins/jenkins-slave/workspace/Lucene-Solr-Tests-7.x/lucene/top-level-ivy-settings.xml

resolve:

ivy-availability-check:
[loadresource] Do not set property disallowed.ivy.jars.list as its length is 0.

-ivy-fail-disallowed-ivy-version:

ivy-fail:

ivy-fail:

ivy-configure:
[ivy:configure] :: loading settings :: file = /home/jenkins/jenkins-slave/workspace/Lucene-Solr-Tests-7.x/lucene/top-level-ivy-settings.xml

resolve:

ivy-availability-check:
[loadresource] Do not set property disallowed.ivy.jars.list as its length is 0.

-ivy-fail-disallowed-ivy-version:

ivy-fail:

ivy-fail:

ivy-configure:
[ivy:configure] :: loading settings :: file = /home/jenkins/jenkins-slave/workspace/Lucene-Solr-Tests-7.x/lucene/top-level-ivy-settings.xml

resolve:

ivy-availability-check:
[loadresource] Do not set property disallowed.ivy.jars.list as its length is 0.

-ivy-fail-disallowed-ivy-version:

ivy-fail:

ivy-fail:

ivy-configure:
[ivy:configure] :: loading settings :: file = /home/jenkins/jenkins-slave/workspace/Lucene-Solr-Tests-7.x/lucene/top-level-ivy-settings.xml

resolve:

ivy-availability-check:
[loadresource] Do not set property disallowed.ivy.jars.list as its length is 0.

-ivy-fail-disallowed-ivy-version:

ivy-fail:

ivy-fail:

ivy-configure:
[ivy:configure] :: loading settings :: file = /home/jenkins/jenkins-slave/workspace/Lucene-Solr-Tests-7.x/lucene/top-level-ivy-settings.xml

resolve:

ivy-availability-check:
[loadresource] Do not set property disallowed.ivy.jars.list as its length is 0.

-ivy-fail-disallowed-ivy-version:

ivy-fail:

ivy-fail:

ivy-configure:
[ivy:configure] :: loading settings :: file = /home/jenkins/jenkins-slave/workspace/Lucene-Solr-Tests-7.x/lucene/top-level-ivy-settings.xml

resolve:

ivy-availability-check:
[loadresource] Do not set property disallowed.ivy.jars.list as its length is 0.

-ivy-fail-disallowed-ivy-version:

ivy-fail:

ivy-fail:

ivy-configure:
[ivy:configure] :: loading settings :: file = /home/jenkins/jenkins-slave/workspace/Lucene-Solr-Tests-7.x/lucene/top-level-ivy-settings.xml

resolve:

ivy-availability-check:
[loadresource] Do not set property disallowed.ivy.jars.list as its length is 0.

-ivy-fail-disallowed-ivy-version:

ivy-fail:

ivy-fail:

ivy-configure:
[ivy:configure] :: loading settings :: file = /home/jenkins/jenkins-slave/workspace/Lucene-Solr-Tests-7.x/lucene/top-level-ivy-settings.xml

resolve:

ivy-availability-check:
[loadresource] Do not set property disallowed.ivy.jars.list as its length is 0.

-ivy-fail-disallowed-ivy-version:

ivy-fail:

ivy-fail:

ivy-configure:
[ivy:configure] :: loading settings :: file = /home/jenkins/jenkins-slave/workspace/Lucene-Solr-Tests-7.x/lucene/top-level-ivy-settings.xml

resolve:

ivy-availability-check:
[loadresource] Do not set property disallowed.ivy.jars.list as its length is 0.

-ivy-fail-disallowed-ivy-version:

ivy-fail:

ivy-fail:

ivy-configure:
[ivy:configure] :: loading settings :: file = /home/jenkins/jenkins-slave/workspace/Lucene-Solr-Tests-7.x/lucene/top-level-ivy-settings.xml

resolve:

ivy-availability-check:
[loadresource] Do not set property disallowed.ivy.jars.list as its length is 0.

-ivy-fail-disallowed-ivy-version:

ivy-fail:

ivy-fail:

ivy-configure:
[ivy:configure] :: loading settings :: file = /home/jenkins/jenkins-slave/workspace/Lucene-Solr-Tests-7.x/lucene/top-level-ivy-settings.xml

resolve:

jar-checksums:
    [mkdir] Created dir: /home/jenkins/jenkins-slave/workspace/Lucene-Solr-Tests-7.x/solr/null837313720
     [copy] Copying 242 files to /home/jenkins/jenkins-slave/workspace/Lucene-Solr-Tests-7.x/solr/null837313720
   [delete] Deleting directory /home/jenkins/jenkins-slave/workspace/Lucene-Solr-Tests-7.x/solr/null837313720

check-working-copy:
[ivy:cachepath] :: resolving dependencies :: org.eclipse.jgit#org.eclipse.jgit-caller;working
[ivy:cachepath] 	confs: [default]
[ivy:cachepath] 	found org.eclipse.jgit#org.eclipse.jgit;4.6.0.201612231935-r in public
[ivy:cachepath] 	found com.jcraft#jsch;0.1.53 in public
[ivy:cachepath] 	found com.googlecode.javaewah#JavaEWAH;1.1.6 in public
[ivy:cachepath] 	found org.apache.httpcomponents#httpclient;4.3.6 in public
[ivy:cachepath] 	found org.apache.httpcomponents#httpcore;4.3.3 in public
[ivy:cachepath] 	found commons-logging#commons-logging;1.1.3 in public
[ivy:cachepath] 	found commons-codec#commons-codec;1.6 in public
[ivy:cachepath] 	found org.slf4j#slf4j-api;1.7.2 in public
[ivy:cachepath] :: resolution report :: resolve 31ms :: artifacts dl 3ms
	---------------------------------------------------------------------
	|                  |            modules            ||   artifacts   |
	|       conf       | number| search|dwnlded|evicted|| number|dwnlded|
	---------------------------------------------------------------------
	|      default     |   8   |   0   |   0   |   0   ||   8   |   0   |
	---------------------------------------------------------------------
[wc-checker] Initializing working copy...
[wc-checker] SLF4J: Failed to load class "org.slf4j.impl.StaticLoggerBinder".
[wc-checker] SLF4J: Defaulting to no-operation (NOP) logger implementation
[wc-checker] SLF4J: See http://www.slf4j.org/codes.html#StaticLoggerBinder for further details.
[wc-checker] Checking working copy status...

-jenkins-base:

BUILD SUCCESSFUL
Total time: 199 minutes 14 seconds
Archiving artifacts
java.lang.InterruptedException: no matches found within 10000
	at hudson.FilePath$ValidateAntFileMask.hasMatch(FilePath.java:2847)
	at hudson.FilePath$ValidateAntFileMask.invoke(FilePath.java:2726)
	at hudson.FilePath$ValidateAntFileMask.invoke(FilePath.java:2707)
	at hudson.FilePath$FileCallableWrapper.call(FilePath.java:3086)
Also:   hudson.remoting.Channel$CallSiteStackTrace: Remote call to lucene2
		at hudson.remoting.Channel.attachCallSiteStackTrace(Channel.java:1741)
		at hudson.remoting.UserRequest$ExceptionResponse.retrieve(UserRequest.java:357)
		at hudson.remoting.Channel.call(Channel.java:955)
		at hudson.FilePath.act(FilePath.java:1072)
		at hudson.FilePath.act(FilePath.java:1061)
		at hudson.FilePath.validateAntFileMask(FilePath.java:2705)
		at hudson.tasks.ArtifactArchiver.perform(ArtifactArchiver.java:243)
		at hudson.tasks.BuildStepCompatibilityLayer.perform(BuildStepCompatibilityLayer.java:81)
		at hudson.tasks.BuildStepMonitor$1.perform(BuildStepMonitor.java:20)
		at hudson.model.AbstractBuild$AbstractBuildExecution.perform(AbstractBuild.java:744)
		at hudson.model.AbstractBuild$AbstractBuildExecution.performAllBuildSteps(AbstractBuild.java:690)
		at hudson.model.Build$BuildExecution.post2(Build.java:186)
		at hudson.model.AbstractBuild$AbstractBuildExecution.post(AbstractBuild.java:635)
		at hudson.model.Run.execute(Run.java:1835)
		at hudson.model.FreeStyleBuild.run(FreeStyleBuild.java:43)
		at hudson.model.ResourceController.execute(ResourceController.java:97)
		at hudson.model.Executor.run(Executor.java:429)
Caused: hudson.FilePath$TunneledInterruptedException
	at hudson.FilePath$FileCallableWrapper.call(FilePath.java:3088)
	at hudson.remoting.UserRequest.perform(UserRequest.java:212)
	at hudson.remoting.UserRequest.perform(UserRequest.java:54)
	at hudson.remoting.Request$2.run(Request.java:369)
	at hudson.remoting.InterceptingExecutorService$1.call(InterceptingExecutorService.java:72)
	at java.util.concurrent.FutureTask.run(FutureTask.java:266)
	at java.util.concurrent.ThreadPoolExecutor.runWorker(ThreadPoolExecutor.java:1142)
	at java.util.concurrent.ThreadPoolExecutor$Worker.run(ThreadPoolExecutor.java:617)
	at java.lang.Thread.run(Thread.java:748)
Caused: java.lang.InterruptedException: java.lang.InterruptedException: no matches found within 10000
	at hudson.FilePath.act(FilePath.java:1074)
	at hudson.FilePath.act(FilePath.java:1061)
	at hudson.FilePath.validateAntFileMask(FilePath.java:2705)
	at hudson.tasks.ArtifactArchiver.perform(ArtifactArchiver.java:243)
	at hudson.tasks.BuildStepCompatibilityLayer.perform(BuildStepCompatibilityLayer.java:81)
	at hudson.tasks.BuildStepMonitor$1.perform(BuildStepMonitor.java:20)
	at hudson.model.AbstractBuild$AbstractBuildExecution.perform(AbstractBuild.java:744)
	at hudson.model.AbstractBuild$AbstractBuildExecution.performAllBuildSteps(AbstractBuild.java:690)
	at hudson.model.Build$BuildExecution.post2(Build.java:186)
	at hudson.model.AbstractBuild$AbstractBuildExecution.post(AbstractBuild.java:635)
	at hudson.model.Run.execute(Run.java:1835)
	at hudson.model.FreeStyleBuild.run(FreeStyleBuild.java:43)
	at hudson.model.ResourceController.execute(ResourceController.java:97)
	at hudson.model.Executor.run(Executor.java:429)
No artifacts found that match the file pattern "**/*.events,heapdumps/**,**/hs_err_pid*". Configuration error?
Recording test results
Build step 'Publish JUnit test result report' changed build result to UNSTABLE
Email was triggered for: Unstable (Test Failures)
Sending email for trigger: Unstable (Test Failures)