You are viewing a plain text version of this content. The canonical link for it is here.
Posted to dev@sling.apache.org by Apache Jenkins Server <je...@builds.apache.org> on 2015/04/27 19:32:13 UTC
Jenkins build is still unstable: sling-trunk-1.7 #1762
See <https://builds.apache.org/job/sling-trunk-1.7/changes>
Jenkins build is back to stable : sling-trunk-1.7 #1770
Posted by Apache Jenkins Server <je...@builds.apache.org>.
See <https://builds.apache.org/job/sling-trunk-1.7/1770/changes>
Jenkins build is still unstable: sling-trunk-1.7 #1769
Posted by Apache Jenkins Server <je...@builds.apache.org>.
See <https://builds.apache.org/job/sling-trunk-1.7/changes>
Jenkins build is unstable: sling-trunk-1.7 #1768
Posted by Apache Jenkins Server <je...@builds.apache.org>.
See <https://builds.apache.org/job/sling-trunk-1.7/1768/changes>
Build failed in Jenkins: sling-trunk-1.7 #1767
Posted by Apache Jenkins Server <je...@builds.apache.org>.
See <https://builds.apache.org/job/sling-trunk-1.7/1767/changes>
Changes:
[cziegeler] Add missing licence headers
[cziegeler] Add missing licence headers
[cziegeler] Remove unused label
[cziegeler] Add rat excludes
[cziegeler] Add missing licence header
[cziegeler] Add rat excludes
[cziegeler] Add excludes for dojo
[cziegeler] Correct licence header
------------------------------------------
[...truncated 46276 lines...]
[INFO] Apache Sling Repository API Bundle ................ SUCCESS [4.880s]
[INFO] Apache Sling Testing JCR Mock ..................... SUCCESS [6.234s]
[INFO] Apache Sling JCR Base Bundle ...................... SUCCESS [8.553s]
[INFO] Apache Sling JCR ClassLoader ...................... SUCCESS [8.768s]
[INFO] Apache Sling Initial Content Loader ............... SUCCESS [6.577s]
[INFO] Apache Sling Jackrabbit Embedded Repository ....... SUCCESS [17.948s]
[INFO] Apache Sling Jackrabbit UserManager Support ....... SUCCESS [8.238s]
[INFO] Apache Sling Jackrabbit JSR-283 Access Control Manager Support SUCCESS [5.363s]
[INFO] Apache Sling Wrapper Bundle for the JCR API ....... SUCCESS [3.630s]
[INFO] Apache Sling JCR Resource Resolver ................ SUCCESS [42.967s]
[INFO] Apache Sling Testing Sling Mock Jackrabbit-based Resource Resolver SUCCESS [19.555s]
[INFO] Apache Sling Versioning Integration Tests ......... SUCCESS [18.247s]
[INFO] Apache Sling JCR Repository Registration .......... SUCCESS [11.030s]
[INFO] Apache Sling Simple WebDAV Access to repositories . SUCCESS [10.927s]
[INFO] Apache Sling DavEx Access to repositories ......... SUCCESS [7.280s]
[INFO] Apache Sling JCR WebConsole Bundle ................ SUCCESS [6.873s]
[INFO] Apache Sling Oak Repository Server ................ SUCCESS [8.266s]
[INFO] Apache Sling SlingRepository Integration Tests .... SUCCESS [1:10.341s]
[INFO] Apache Sling Servlet Resolver ..................... SUCCESS [8.536s]
[INFO] Apache Sling Default GET Servlets ................. SUCCESS [7.279s]
[INFO] Apache Sling Default POST Servlets ................ SUCCESS [6.906s]
[INFO] Apache Sling Compat Servlets ...................... SUCCESS [5.232s]
[INFO] Apache Sling Scripting Implementation API ......... SUCCESS [10.267s]
[INFO] Apache Sling Scripting Core implementation ........ SUCCESS [14.892s]
[INFO] Apache Sling Scripting JavaScript Support ......... SUCCESS [17.764s]
[INFO] Apache Sling Scripting JSP Support ................ SUCCESS [10.522s]
[INFO] Apache Sling JSP Tag Library ...................... SUCCESS [9.201s]
[INFO] Apache Sling JSP Standard Tag Library ............. SUCCESS [7.129s]
[INFO] Apache Sling Adapter Manager Implementation ....... SUCCESS [5.137s]
[INFO] Apache Sling Bundle Resource Provider ............. SUCCESS [4.206s]
[INFO] Apache Sling Distributed Event Admin .............. SUCCESS [6.273s]
[INFO] Apache Sling Discovery API ........................ SUCCESS [4.017s]
[INFO] Apache Sling Resource-Based Discovery Service ..... SUCCESS [4:48.111s]
[INFO] Apache Sling Discovery Support Bundle ............. SUCCESS [5.120s]
[INFO] Apache Sling Discovery Standalone Implementation .. SUCCESS [5.715s]
[INFO] Apache Sling Event Support ........................ SUCCESS [12:36.581s]
[INFO] Apache Sling Feature Flags ........................ SUCCESS [11.360s]
[INFO] Apache Sling Filesystem Resource Provider ......... SUCCESS [8.572s]
[INFO] Apache Sling javax.activation bundle .............. SUCCESS [17.608s]
[INFO] Apache Sling Service User Mapper .................. SUCCESS [7.018s]
[INFO] Apache Sling Settings ............................. SUCCESS [7.188s]
[INFO] Apache Sling Web Console Branding ................. SUCCESS [31.847s]
[INFO] Apache Sling Web Console Security Provider ........ SUCCESS [11.795s]
[INFO] Apache Sling Explorer ............................. SUCCESS [10.532s]
[INFO] Apache Sling Health Check Core .................... SUCCESS [16.168s]
[INFO] Apache Sling Health Check Annotations ............. SUCCESS [8.398s]
[INFO] Apache Sling Health Check Samples ................. SUCCESS [12.621s]
[INFO] Apache Sling Health Check Support Components ...... SUCCESS [16.688s]
[INFO] Apache Sling Health Check Webconsole Plugin ....... SUCCESS [11.511s]
[INFO] Apache Sling Health Check JUnit Bridge ............ SUCCESS [11.566s]
[INFO] Apache Sling Health Check Integration Tests ....... SUCCESS [34.928s]
[INFO] Apache Sling Health Check Reactor POM ............. SUCCESS [4.322s]
[INFO] Apache Sling Resource Access Security ............. SUCCESS [17.932s]
[INFO] Apache Sling Resource Access Security Integration Tests SUCCESS [32.579s]
[INFO] Apache Sling Validation Framework API ............. SUCCESS [9.190s]
[INFO] Apache Sling Validation Framework Core Implementation SUCCESS [28.618s]
[INFO] Apache Sling Validation Framework Testing Services SUCCESS [4.671s]
[INFO] Apache Sling Validation Framework Integration Tests SUCCESS [24.827s]
[INFO] Apache Sling Validation Framework Examples ........ SUCCESS [4.551s]
[INFO] Apache Sling Validation Framework Builder ......... SUCCESS [8.439s]
[INFO] Apache Sling Models API ........................... SUCCESS [6.323s]
[INFO] Apache Sling Models Implementation ................ SUCCESS [13.108s]
[INFO] Apache Sling Models Integration Tests ............. SUCCESS [1:01.611s]
[INFO] Apache Sling Test Tools ........................... FAILURE [2:32.289s]
[INFO] Apache Sling JUnit Core ........................... SKIPPED
[INFO] Apache Sling JUnit Scriptable Tests Provider ...... SKIPPED
[INFO] Apache Sling JUnit Health Checks .................. SKIPPED
[INFO] Apache Sling JUnit Remote Tests Runners ........... SKIPPED
[INFO] Apache Sling JUnit Performance .................... SKIPPED
[INFO] Apache Sling Testing Resource Resolver Mock ....... SKIPPED
[INFO] Apache Sling Testing OSGi Mock .................... SKIPPED
[INFO] Apache Sling Testing Sling Mock ................... SKIPPED
[INFO] Apache Sling Pax Exam Utilities ................... SKIPPED
[INFO] Apache Sling Sample Server-Side Tests ............. SKIPPED
[INFO] Apache Sling Failing Server-Side Tests ............ SKIPPED
[INFO] Apache Sling Launchpad Base ....................... SKIPPED
[INFO] Apache Sling Launchpad Application Builder ........ SKIPPED
[INFO] Apache Sling Sample Integration Tests ............. SKIPPED
[INFO] Apache Sling Testing Modules Reactor .............. SKIPPED
[INFO] Apache Sling Installer ............................ SKIPPED
[INFO] Apache Sling Installer WebConsole Plugin .......... SKIPPED
[INFO] Apache Sling File Installer ....................... SKIPPED
[INFO] Apache Sling JCR Installer ........................ SKIPPED
[INFO] Apache Sling Installer Configuration Admin Support SKIPPED
[INFO] Apache Sling Deployment Package Installer ......... SKIPPED
[INFO] Apache Sling Subsystems Installer ................. SKIPPED
[INFO] Apache Sling Installer Integration Tests .......... SKIPPED
[INFO] Apache Sling Launchpad API ........................ SKIPPED
[INFO] Apache Sling Launchpad Installer .................. SKIPPED
[INFO] Apache Sling Launchpad Content .................... SKIPPED
[INFO] Apache Sling Launchpad Testing Services ........... SKIPPED
[INFO] Apache Sling Launchpad Testing Services WAR ....... SKIPPED
[INFO] Apache Sling Launchpad Testing Fragment Bundle .... SKIPPED
[INFO] Apache Sling Launchpad Test Bundles ............... SKIPPED
[INFO] Apache Sling Integration Tests .................... SKIPPED
[INFO] Apache Sling Launchpad Testing .................... SKIPPED
[INFO] Apache Sling (Builder) ............................ SKIPPED
[INFO] ------------------------------------------------------------------------
[INFO] BUILD FAILURE
[INFO] ------------------------------------------------------------------------
[INFO] Total time: 40:37.382s
[INFO] Finished at: Tue Apr 28 07:32:19 UTC 2015
[INFO] Final Memory: 153M/354M
[INFO] ------------------------------------------------------------------------
[JENKINS] Archiving disabled
[JENKINS] Archiving disabled
[JENKINS] Archiving disabled
[JENKINS] Archiving disabled
[JENKINS] Archiving disabled
[JENKINS] Archiving disabled
[JENKINS] Archiving disabled
[JENKINS] Archiving disabled
[JENKINS] Archiving disabled
[JENKINS] Archiving disabled
[JENKINS] Archiving disabled
[JENKINS] Archiving disabled
[JENKINS] Archiving disabled
[JENKINS] Archiving disabled
[JENKINS] Archiving disabled
[JENKINS] Archiving disabled
[JENKINS] Archiving disabled
[JENKINS] Archiving disabled
[JENKINS] Archiving disabled
[JENKINS] Archiving disabled
[JENKINS] Archiving disabled
[JENKINS] Archiving disabled
[JENKINS] Archiving disabled
[JENKINS] Archiving disabled
[JENKINS] Archiving disabled
[JENKINS] Archiving disabled
[JENKINS] Archiving disabled
[JENKINS] Archiving disabled
[JENKINS] Archiving disabled
[JENKINS] Archiving disabled
[JENKINS] Archiving disabled
[JENKINS] Archiving disabled
[JENKINS] Archiving disabled
[JENKINS] Archiving disabled
[JENKINS] Archiving disabled
[JENKINS] Archiving disabled
[JENKINS] Archiving disabled
[JENKINS] Archiving disabled
[JENKINS] Archiving disabled
[JENKINS] Archiving disabled
[JENKINS] Archiving disabled
[JENKINS] Archiving disabled
[JENKINS] Archiving disabled
[JENKINS] Archiving disabled
[JENKINS] Archiving disabled
[JENKINS] Archiving disabled
[JENKINS] Archiving disabled
[JENKINS] Archiving disabled
[JENKINS] Archiving disabled
[JENKINS] Archiving disabled
[JENKINS] Archiving disabled
[JENKINS] Archiving disabled
[JENKINS] Archiving disabled
[JENKINS] Archiving disabled
[JENKINS] Archiving disabled
[JENKINS] Archiving disabled
[JENKINS] Archiving disabled
[JENKINS] Archiving disabled
[JENKINS] Archiving disabled
[JENKINS] Archiving disabled
[JENKINS] Archiving disabled
[JENKINS] Archiving disabled
[JENKINS] Archiving disabled
[JENKINS] Archiving disabled
[JENKINS] Archiving disabled
[JENKINS] Archiving disabled
[JENKINS] Archiving disabled
[JENKINS] Archiving disabled
[JENKINS] Archiving disabled
[JENKINS] Archiving disabled
[JENKINS] Archiving disabled
[JENKINS] Archiving disabled
[JENKINS] Archiving disabled
[JENKINS] Archiving disabled
[JENKINS] Archiving disabled
[JENKINS] Archiving disabled
[JENKINS] Archiving disabled
[JENKINS] Archiving disabled
[JENKINS] Archiving disabled
[JENKINS] Archiving disabled
[JENKINS] Archiving disabled
[JENKINS] Archiving disabled
[JENKINS] Archiving disabled
[JENKINS] Archiving disabled
[JENKINS] Archiving disabled
[JENKINS] Archiving disabled
[JENKINS] Archiving disabled
[JENKINS] Archiving disabled
[JENKINS] Archiving disabled
[JENKINS] Archiving disabled
[JENKINS] Archiving disabled
[JENKINS] Archiving disabled
[JENKINS] Archiving disabled
[JENKINS] Archiving disabled
[JENKINS] Archiving disabled
[JENKINS] Archiving disabled
[JENKINS] Archiving disabled
[JENKINS] Archiving disabled
[JENKINS] Archiving disabled
[JENKINS] Archiving disabled
[JENKINS] Archiving disabled
[JENKINS] Archiving disabled
[JENKINS] Archiving disabled
[JENKINS] Archiving disabled
[JENKINS] Archiving disabled
[JENKINS] Archiving disabled
[JENKINS] Archiving disabled
[JENKINS] Archiving disabled
[JENKINS] Archiving disabled
[JENKINS] Archiving disabled
[JENKINS] Archiving disabled
[JENKINS] Archiving disabled
[JENKINS] Archiving disabled
[JENKINS] Archiving disabled
[JENKINS] Archiving disabled
[JENKINS] Archiving disabled
[JENKINS] Archiving disabled
[JENKINS] Archiving disabled
[JENKINS] Archiving disabled
[JENKINS] Archiving disabled
[JENKINS] Archiving disabled
[JENKINS] Archiving disabled
[JENKINS] Archiving disabled
[JENKINS] Archiving disabled
[JENKINS] Archiving disabled
[JENKINS] Archiving disabled
[JENKINS] Archiving disabled
[JENKINS] Archiving disabled
[JENKINS] Archiving disabled
[JENKINS] Archiving disabled
[JENKINS] Archiving disabled
[JENKINS] Archiving disabled
[JENKINS] Archiving disabled
Waiting for Jenkins to finish collecting data
[ERROR] Failed to execute goal org.apache.maven.plugins:maven-deploy-plugin:2.8.1:deploy (default-deploy) on project org.apache.sling.testing.tools: Failed to deploy metadata: Could not transfer metadata org.apache.sling:org.apache.sling.testing.tools/maven-metadata.xml from/to apache.snapshots.https (https://repository.apache.org/content/repositories/snapshots): Failed to transfer file: https://repository.apache.org/content/repositories/snapshots/org/apache/sling/org.apache.sling.testing.tools/maven-metadata.xml. Return code is: 502, ReasonPhrase: Proxy Error. -> [Help 1]
[ERROR]
[ERROR] To see the full stack trace of the errors, re-run Maven with the -e switch.
[ERROR] Re-run Maven using the -X switch to enable full debug logging.
[ERROR]
[ERROR] For more information about the errors and possible solutions, please read the following articles:
[ERROR] [Help 1] http://cwiki.apache.org/confluence/display/MAVEN/MojoExecutionException
[ERROR]
[ERROR] After correcting the problems, you can resume the build with the command
[ERROR] mvn <goals> -rf :org.apache.sling.testing.tools
channel stopped
Jenkins build is unstable: sling-trunk-1.7 #1766
Posted by Apache Jenkins Server <je...@builds.apache.org>.
See <https://builds.apache.org/job/sling-trunk-1.7/1766/changes>
Build failed in Jenkins: sling-trunk-1.7 #1765
Posted by Apache Jenkins Server <je...@builds.apache.org>.
See <https://builds.apache.org/job/sling-trunk-1.7/1765/changes>
Changes:
[sboehme] enabling "SLING-4555 Resource Editor: fixed e2e tests, node name handling in the add node dialog and added an initial version of the add node e2e test" again
[cziegeler] SLING-4663 : Enable strict mode of scr plugin
------------------------------------------
[...truncated 19295 lines...]
[INFO] Apache Sling JCR Base Bundle ...................... SUCCESS [7.575s]
[INFO] Apache Sling JCR ClassLoader ...................... SUCCESS [5.268s]
[INFO] Apache Sling Initial Content Loader ............... SUCCESS [7.423s]
[INFO] Apache Sling Jackrabbit Embedded Repository ....... SUCCESS [17.053s]
[INFO] Apache Sling Jackrabbit UserManager Support ....... SUCCESS [5.770s]
[INFO] Apache Sling Jackrabbit JSR-283 Access Control Manager Support SUCCESS [5.418s]
[INFO] Apache Sling Wrapper Bundle for the JCR API ....... SUCCESS [7.507s]
[INFO] Apache Sling JCR Resource Resolver ................ SUCCESS [3:25.538s]
[INFO] Apache Sling Testing Sling Mock Jackrabbit-based Resource Resolver SUCCESS [1:05.895s]
[INFO] Apache Sling Versioning Integration Tests ......... SUCCESS [1:05.005s]
[INFO] Apache Sling JCR Repository Registration .......... SUCCESS [4.937s]
[INFO] Apache Sling Simple WebDAV Access to repositories . SUCCESS [7.177s]
[INFO] Apache Sling DavEx Access to repositories ......... SUCCESS [7.136s]
[INFO] Apache Sling JCR WebConsole Bundle ................ SUCCESS [3.994s]
[INFO] Apache Sling Oak Repository Server ................ SUCCESS [5.532s]
[INFO] Apache Sling SlingRepository Integration Tests .... SUCCESS [1:39.954s]
[INFO] Apache Sling Servlet Resolver ..................... SUCCESS [4.902s]
[INFO] Apache Sling Default GET Servlets ................. SUCCESS [6.297s]
[INFO] Apache Sling Default POST Servlets ................ SUCCESS [6.607s]
[INFO] Apache Sling Compat Servlets ...................... SUCCESS [3.960s]
[INFO] Apache Sling Scripting Implementation API ......... SUCCESS [3.279s]
[INFO] Apache Sling Scripting Core implementation ........ SUCCESS [14.323s]
[INFO] Apache Sling Scripting JavaScript Support ......... SUCCESS [51.763s]
[INFO] Apache Sling Scripting JSP Support ................ SUCCESS [8.846s]
[INFO] Apache Sling JSP Tag Library ...................... SUCCESS [8.543s]
[INFO] Apache Sling JSP Standard Tag Library ............. SUCCESS [3.044s]
[INFO] Apache Sling Adapter Manager Implementation ....... SUCCESS [5.104s]
[INFO] Apache Sling Bundle Resource Provider ............. SUCCESS [4.400s]
[INFO] Apache Sling Distributed Event Admin .............. SUCCESS [5.405s]
[INFO] Apache Sling Discovery API ........................ SUCCESS [3.425s]
[INFO] Apache Sling Resource-Based Discovery Service ..... FAILURE [1:16:36.758s]
[INFO] Apache Sling Discovery Support Bundle ............. SKIPPED
[INFO] Apache Sling Discovery Standalone Implementation .. SKIPPED
[INFO] Apache Sling Event Support ........................ SKIPPED
[INFO] Apache Sling Feature Flags ........................ SKIPPED
[INFO] Apache Sling Filesystem Resource Provider ......... SKIPPED
[INFO] Apache Sling javax.activation bundle .............. SKIPPED
[INFO] Apache Sling Service User Mapper .................. SKIPPED
[INFO] Apache Sling Settings ............................. SKIPPED
[INFO] Apache Sling Web Console Branding ................. SKIPPED
[INFO] Apache Sling Web Console Security Provider ........ SKIPPED
[INFO] Apache Sling Explorer ............................. SKIPPED
[INFO] Apache Sling Health Check Core .................... SKIPPED
[INFO] Apache Sling Health Check Annotations ............. SKIPPED
[INFO] Apache Sling Health Check Samples ................. SKIPPED
[INFO] Apache Sling Health Check Support Components ...... SKIPPED
[INFO] Apache Sling Health Check Webconsole Plugin ....... SKIPPED
[INFO] Apache Sling Health Check JUnit Bridge ............ SKIPPED
[INFO] Apache Sling Health Check Integration Tests ....... SKIPPED
[INFO] Apache Sling Health Check Reactor POM ............. SKIPPED
[INFO] Apache Sling Resource Access Security ............. SKIPPED
[INFO] Apache Sling Resource Access Security Integration Tests SKIPPED
[INFO] Apache Sling Validation Framework API ............. SKIPPED
[INFO] Apache Sling Validation Framework Core Implementation SKIPPED
[INFO] Apache Sling Validation Framework Testing Services SKIPPED
[INFO] Apache Sling Validation Framework Integration Tests SKIPPED
[INFO] Apache Sling Validation Framework Examples ........ SKIPPED
[INFO] Apache Sling Validation Framework Builder ......... SKIPPED
[INFO] Apache Sling Models API ........................... SKIPPED
[INFO] Apache Sling Models Implementation ................ SKIPPED
[INFO] Apache Sling Models Integration Tests ............. SKIPPED
[INFO] Apache Sling Test Tools ........................... SKIPPED
[INFO] Apache Sling JUnit Core ........................... SKIPPED
[INFO] Apache Sling JUnit Scriptable Tests Provider ...... SKIPPED
[INFO] Apache Sling JUnit Health Checks .................. SKIPPED
[INFO] Apache Sling JUnit Remote Tests Runners ........... SKIPPED
[INFO] Apache Sling JUnit Performance .................... SKIPPED
[INFO] Apache Sling Testing Resource Resolver Mock ....... SKIPPED
[INFO] Apache Sling Testing OSGi Mock .................... SKIPPED
[INFO] Apache Sling Testing Sling Mock ................... SKIPPED
[INFO] Apache Sling Pax Exam Utilities ................... SKIPPED
[INFO] Apache Sling Sample Server-Side Tests ............. SKIPPED
[INFO] Apache Sling Failing Server-Side Tests ............ SKIPPED
[INFO] Apache Sling Launchpad Base ....................... SKIPPED
[INFO] Apache Sling Launchpad Application Builder ........ SKIPPED
[INFO] Apache Sling Sample Integration Tests ............. SKIPPED
[INFO] Apache Sling Testing Modules Reactor .............. SKIPPED
[INFO] Apache Sling Installer ............................ SKIPPED
[INFO] Apache Sling Installer WebConsole Plugin .......... SKIPPED
[INFO] Apache Sling File Installer ....................... SKIPPED
[INFO] Apache Sling JCR Installer ........................ SKIPPED
[INFO] Apache Sling Installer Configuration Admin Support SKIPPED
[INFO] Apache Sling Deployment Package Installer ......... SKIPPED
[INFO] Apache Sling Subsystems Installer ................. SKIPPED
[INFO] Apache Sling Installer Integration Tests .......... SKIPPED
[INFO] Apache Sling Launchpad API ........................ SKIPPED
[INFO] Apache Sling Launchpad Installer .................. SKIPPED
[INFO] Apache Sling Launchpad Content .................... SKIPPED
[INFO] Apache Sling Launchpad Testing Services ........... SKIPPED
[INFO] Apache Sling Launchpad Testing Services WAR ....... SKIPPED
[INFO] Apache Sling Launchpad Testing Fragment Bundle .... SKIPPED
[INFO] Apache Sling Launchpad Test Bundles ............... SKIPPED
[INFO] Apache Sling Integration Tests .................... SKIPPED
[INFO] Apache Sling Launchpad Testing .................... SKIPPED
[INFO] Apache Sling (Builder) ............................ SKIPPED
[INFO] ------------------------------------------------------------------------
[INFO] BUILD FAILURE
[INFO] ------------------------------------------------------------------------
[INFO] Total time: 1:36:03.504s
[INFO] Finished at: Tue Apr 28 00:03:30 UTC 2015
[INFO] Final Memory: 129M/330M
[INFO] ------------------------------------------------------------------------
[JENKINS] Archiving disabled
[JENKINS] Archiving disabled
[JENKINS] Archiving disabled
[JENKINS] Archiving disabled
[JENKINS] Archiving disabled
[JENKINS] Archiving disabled
[JENKINS] Archiving disabled
[JENKINS] Archiving disabled
[JENKINS] Archiving disabled
[JENKINS] Archiving disabled
[JENKINS] Archiving disabled
[JENKINS] Archiving disabled
[JENKINS] Archiving disabled
[JENKINS] Archiving disabled
[JENKINS] Archiving disabled
[JENKINS] Archiving disabled
[JENKINS] Archiving disabled
[JENKINS] Archiving disabled
[JENKINS] Archiving disabled
[JENKINS] Archiving disabled
[JENKINS] Archiving disabled
[JENKINS] Archiving disabled
[JENKINS] Archiving disabled
[JENKINS] Archiving disabled
[JENKINS] Archiving disabled
[JENKINS] Archiving disabled
[JENKINS] Archiving disabled
[JENKINS] Archiving disabled
[JENKINS] Archiving disabled
[JENKINS] Archiving disabled
[JENKINS] Archiving disabled
[JENKINS] Archiving disabled
[JENKINS] Archiving disabled
[JENKINS] Archiving disabled
[JENKINS] Archiving disabled
[JENKINS] Archiving disabled
[JENKINS] Archiving disabled
[JENKINS] Archiving disabled
[JENKINS] Archiving disabled
[JENKINS] Archiving disabled
[JENKINS] Archiving disabled
[JENKINS] Archiving disabled
[JENKINS] Archiving disabled
[JENKINS] Archiving disabled
[JENKINS] Archiving disabled
[JENKINS] Archiving disabled
[JENKINS] Archiving disabled
[JENKINS] Archiving disabled
[JENKINS] Archiving disabled
[JENKINS] Archiving disabled
[JENKINS] Archiving disabled
[JENKINS] Archiving disabled
[JENKINS] Archiving disabled
[JENKINS] Archiving disabled
[JENKINS] Archiving disabled
[JENKINS] Archiving disabled
[JENKINS] Archiving disabled
[JENKINS] Archiving disabled
[JENKINS] Archiving disabled
[JENKINS] Archiving disabled
[JENKINS] Archiving disabled
[JENKINS] Archiving disabled
[JENKINS] Archiving disabled
[JENKINS] Archiving disabled
[JENKINS] Archiving disabled
[JENKINS] Archiving disabled
[JENKINS] Archiving disabled
[JENKINS] Archiving disabled
[JENKINS] Archiving disabled
[JENKINS] Archiving disabled
[JENKINS] Archiving disabled
[JENKINS] Archiving disabled
[JENKINS] Archiving disabled
[JENKINS] Archiving disabled
[JENKINS] Archiving disabled
[JENKINS] Archiving disabled
[JENKINS] Archiving disabled
[JENKINS] Archiving disabled
[JENKINS] Archiving disabled
[JENKINS] Archiving disabled
[JENKINS] Archiving disabled
[JENKINS] Archiving disabled
[JENKINS] Archiving disabled
[JENKINS] Archiving disabled
[JENKINS] Archiving disabled
[JENKINS] Archiving disabled
[JENKINS] Archiving disabled
[JENKINS] Archiving disabled
[JENKINS] Archiving disabled
[JENKINS] Archiving disabled
[JENKINS] Archiving disabled
[JENKINS] Archiving disabled
[JENKINS] Archiving disabled
[JENKINS] Archiving disabled
[JENKINS] Archiving disabled
[JENKINS] Archiving disabled
[JENKINS] Archiving disabled
[JENKINS] Archiving disabled
[JENKINS] Archiving disabled
[JENKINS] Archiving disabled
[JENKINS] Archiving disabled
[JENKINS] Archiving disabled
[JENKINS] Archiving disabled
[JENKINS] Archiving disabled
[JENKINS] Archiving disabled
[JENKINS] Archiving disabled
[JENKINS] Archiving disabled
[JENKINS] Archiving disabled
[JENKINS] Archiving disabled
[JENKINS] Archiving disabled
[JENKINS] Archiving disabled
[JENKINS] Archiving disabled
[JENKINS] Archiving disabled
[JENKINS] Archiving disabled
[JENKINS] Archiving disabled
[JENKINS] Archiving disabled
[JENKINS] Archiving disabled
[JENKINS] Archiving disabled
[JENKINS] Archiving disabled
[JENKINS] Archiving disabled
[JENKINS] Archiving disabled
[JENKINS] Archiving disabled
[JENKINS] Archiving disabled
[JENKINS] Archiving disabled
[JENKINS] Archiving disabled
[JENKINS] Archiving disabled
[JENKINS] Archiving disabled
[JENKINS] Archiving disabled
[JENKINS] Archiving disabled
[JENKINS] Archiving disabled
[JENKINS] Archiving disabled
[JENKINS] Archiving disabled
[JENKINS] Archiving disabled
Waiting for Jenkins to finish collecting data
[ERROR] Failed to execute goal org.apache.maven.plugins:maven-surefire-plugin:2.17:test (default-test) on project org.apache.sling.discovery.impl: Execution default-test of goal org.apache.maven.plugins:maven-surefire-plugin:2.17:test failed: The forked VM terminated without properly saying goodbye. VM crash or System.exit called?
[ERROR] Command was /bin/sh -c cd <https://builds.apache.org/job/sling-trunk-1.7/ws/trunk/bundles/extensions/discovery/impl> && /x1/jenkins/tools/java/jdk1.7.0_25-32/jre/bin/java -Xmx2048m -jar <https://builds.apache.org/job/sling-trunk-1.7/ws/trunk/bundles/extensions/discovery/impl/target/surefire/surefirebooter4970296226863492269.jar> <https://builds.apache.org/job/sling-trunk-1.7/ws/trunk/bundles/extensions/discovery/impl/target/surefire/surefire3536938717348536393tmp> <https://builds.apache.org/job/sling-trunk-1.7/ws/trunk/bundles/extensions/discovery/impl/target/surefire/surefire_274558780806084111596tmp>
[ERROR] -> [Help 1]
[ERROR]
[ERROR] To see the full stack trace of the errors, re-run Maven with the -e switch.
[ERROR] Re-run Maven using the -X switch to enable full debug logging.
[ERROR]
[ERROR] For more information about the errors and possible solutions, please read the following articles:
[ERROR] [Help 1] http://cwiki.apache.org/confluence/display/MAVEN/PluginExecutionException
[ERROR]
[ERROR] After correcting the problems, you can resume the build with the command
[ERROR] mvn <goals> -rf :org.apache.sling.discovery.impl
channel stopped
Jenkins build is unstable: sling-trunk-1.7 #1764
Posted by Apache Jenkins Server <je...@builds.apache.org>.
See <https://builds.apache.org/job/sling-trunk-1.7/1764/changes>
Build failed in Jenkins: sling-trunk-1.7 #1763
Posted by Apache Jenkins Server <je...@builds.apache.org>.
See <https://builds.apache.org/job/sling-trunk-1.7/1763/changes>
Changes:
[cziegeler] Revert SLING-4664
------------------------------------------
[...truncated 19837 lines...]
[INFO] Apache Sling JCR Base Bundle ...................... SUCCESS [6.089s]
[INFO] Apache Sling JCR ClassLoader ...................... SUCCESS [5.785s]
[INFO] Apache Sling Initial Content Loader ............... SUCCESS [6.168s]
[INFO] Apache Sling Jackrabbit Embedded Repository ....... SUCCESS [15.605s]
[INFO] Apache Sling Jackrabbit UserManager Support ....... SUCCESS [8.372s]
[INFO] Apache Sling Jackrabbit JSR-283 Access Control Manager Support SUCCESS [4.952s]
[INFO] Apache Sling Wrapper Bundle for the JCR API ....... SUCCESS [4.008s]
[INFO] Apache Sling JCR Resource Resolver ................ SUCCESS [3:16.727s]
[INFO] Apache Sling Testing Sling Mock Jackrabbit-based Resource Resolver SUCCESS [1:00.418s]
[INFO] Apache Sling Versioning Integration Tests ......... SUCCESS [52.968s]
[INFO] Apache Sling JCR Repository Registration .......... SUCCESS [5.966s]
[INFO] Apache Sling Simple WebDAV Access to repositories . SUCCESS [8.262s]
[INFO] Apache Sling DavEx Access to repositories ......... SUCCESS [7.278s]
[INFO] Apache Sling JCR WebConsole Bundle ................ SUCCESS [4.316s]
[INFO] Apache Sling Oak Repository Server ................ SUCCESS [5.987s]
[INFO] Apache Sling SlingRepository Integration Tests .... SUCCESS [1:55.785s]
[INFO] Apache Sling Servlet Resolver ..................... SUCCESS [8.183s]
[INFO] Apache Sling Default GET Servlets ................. SUCCESS [7.443s]
[INFO] Apache Sling Default POST Servlets ................ SUCCESS [8.534s]
[INFO] Apache Sling Compat Servlets ...................... SUCCESS [6.283s]
[INFO] Apache Sling Scripting Implementation API ......... SUCCESS [3.802s]
[INFO] Apache Sling Scripting Core implementation ........ SUCCESS [15.836s]
[INFO] Apache Sling Scripting JavaScript Support ......... SUCCESS [1:02.735s]
[INFO] Apache Sling Scripting JSP Support ................ SUCCESS [9.829s]
[INFO] Apache Sling JSP Tag Library ...................... SUCCESS [8.742s]
[INFO] Apache Sling JSP Standard Tag Library ............. SUCCESS [3.561s]
[INFO] Apache Sling Adapter Manager Implementation ....... SUCCESS [6.495s]
[INFO] Apache Sling Bundle Resource Provider ............. SUCCESS [4.413s]
[INFO] Apache Sling Distributed Event Admin .............. SUCCESS [5.369s]
[INFO] Apache Sling Discovery API ........................ SUCCESS [4.625s]
[INFO] Apache Sling Resource-Based Discovery Service ..... FAILURE [1:27:26.683s]
[INFO] Apache Sling Discovery Support Bundle ............. SKIPPED
[INFO] Apache Sling Discovery Standalone Implementation .. SKIPPED
[INFO] Apache Sling Event Support ........................ SKIPPED
[INFO] Apache Sling Feature Flags ........................ SKIPPED
[INFO] Apache Sling Filesystem Resource Provider ......... SKIPPED
[INFO] Apache Sling javax.activation bundle .............. SKIPPED
[INFO] Apache Sling Service User Mapper .................. SKIPPED
[INFO] Apache Sling Settings ............................. SKIPPED
[INFO] Apache Sling Web Console Branding ................. SKIPPED
[INFO] Apache Sling Web Console Security Provider ........ SKIPPED
[INFO] Apache Sling Explorer ............................. SKIPPED
[INFO] Apache Sling Health Check Core .................... SKIPPED
[INFO] Apache Sling Health Check Annotations ............. SKIPPED
[INFO] Apache Sling Health Check Samples ................. SKIPPED
[INFO] Apache Sling Health Check Support Components ...... SKIPPED
[INFO] Apache Sling Health Check Webconsole Plugin ....... SKIPPED
[INFO] Apache Sling Health Check JUnit Bridge ............ SKIPPED
[INFO] Apache Sling Health Check Integration Tests ....... SKIPPED
[INFO] Apache Sling Health Check Reactor POM ............. SKIPPED
[INFO] Apache Sling Resource Access Security ............. SKIPPED
[INFO] Apache Sling Resource Access Security Integration Tests SKIPPED
[INFO] Apache Sling Validation Framework API ............. SKIPPED
[INFO] Apache Sling Validation Framework Core Implementation SKIPPED
[INFO] Apache Sling Validation Framework Testing Services SKIPPED
[INFO] Apache Sling Validation Framework Integration Tests SKIPPED
[INFO] Apache Sling Validation Framework Examples ........ SKIPPED
[INFO] Apache Sling Validation Framework Builder ......... SKIPPED
[INFO] Apache Sling Models API ........................... SKIPPED
[INFO] Apache Sling Models Implementation ................ SKIPPED
[INFO] Apache Sling Models Integration Tests ............. SKIPPED
[INFO] Apache Sling Test Tools ........................... SKIPPED
[INFO] Apache Sling JUnit Core ........................... SKIPPED
[INFO] Apache Sling JUnit Scriptable Tests Provider ...... SKIPPED
[INFO] Apache Sling JUnit Health Checks .................. SKIPPED
[INFO] Apache Sling JUnit Remote Tests Runners ........... SKIPPED
[INFO] Apache Sling JUnit Performance .................... SKIPPED
[INFO] Apache Sling Testing Resource Resolver Mock ....... SKIPPED
[INFO] Apache Sling Testing OSGi Mock .................... SKIPPED
[INFO] Apache Sling Testing Sling Mock ................... SKIPPED
[INFO] Apache Sling Pax Exam Utilities ................... SKIPPED
[INFO] Apache Sling Sample Server-Side Tests ............. SKIPPED
[INFO] Apache Sling Failing Server-Side Tests ............ SKIPPED
[INFO] Apache Sling Launchpad Base ....................... SKIPPED
[INFO] Apache Sling Launchpad Application Builder ........ SKIPPED
[INFO] Apache Sling Sample Integration Tests ............. SKIPPED
[INFO] Apache Sling Testing Modules Reactor .............. SKIPPED
[INFO] Apache Sling Installer ............................ SKIPPED
[INFO] Apache Sling Installer WebConsole Plugin .......... SKIPPED
[INFO] Apache Sling File Installer ....................... SKIPPED
[INFO] Apache Sling JCR Installer ........................ SKIPPED
[INFO] Apache Sling Installer Configuration Admin Support SKIPPED
[INFO] Apache Sling Deployment Package Installer ......... SKIPPED
[INFO] Apache Sling Subsystems Installer ................. SKIPPED
[INFO] Apache Sling Installer Integration Tests .......... SKIPPED
[INFO] Apache Sling Launchpad API ........................ SKIPPED
[INFO] Apache Sling Launchpad Installer .................. SKIPPED
[INFO] Apache Sling Launchpad Content .................... SKIPPED
[INFO] Apache Sling Launchpad Testing Services ........... SKIPPED
[INFO] Apache Sling Launchpad Testing Services WAR ....... SKIPPED
[INFO] Apache Sling Launchpad Testing Fragment Bundle .... SKIPPED
[INFO] Apache Sling Launchpad Test Bundles ............... SKIPPED
[INFO] Apache Sling Integration Tests .................... SKIPPED
[INFO] Apache Sling Launchpad Testing .................... SKIPPED
[INFO] Apache Sling (Builder) ............................ SKIPPED
[INFO] ------------------------------------------------------------------------
[INFO] BUILD FAILURE
[INFO] ------------------------------------------------------------------------
[INFO] Total time: 1:44:50.949s
[INFO] Finished at: Mon Apr 27 19:37:25 UTC 2015
[INFO] Final Memory: 127M/331M
[INFO] ------------------------------------------------------------------------
[JENKINS] Archiving disabled
[JENKINS] Archiving disabled
[JENKINS] Archiving disabled
[JENKINS] Archiving disabled
[JENKINS] Archiving disabled
[JENKINS] Archiving disabled
[JENKINS] Archiving disabled
[JENKINS] Archiving disabled
[JENKINS] Archiving disabled
[JENKINS] Archiving disabled
[JENKINS] Archiving disabled
[JENKINS] Archiving disabled
[JENKINS] Archiving disabled
[JENKINS] Archiving disabled
[JENKINS] Archiving disabled
[JENKINS] Archiving disabled
[JENKINS] Archiving disabled
[JENKINS] Archiving disabled
[JENKINS] Archiving disabled
[JENKINS] Archiving disabled
[JENKINS] Archiving disabled
[JENKINS] Archiving disabled
[JENKINS] Archiving disabled
[JENKINS] Archiving disabled
[JENKINS] Archiving disabled
[JENKINS] Archiving disabled
[JENKINS] Archiving disabled
[JENKINS] Archiving disabled
[JENKINS] Archiving disabled
[JENKINS] Archiving disabled
[JENKINS] Archiving disabled
[JENKINS] Archiving disabled
[JENKINS] Archiving disabled
[JENKINS] Archiving disabled
[JENKINS] Archiving disabled
[JENKINS] Archiving disabled
[JENKINS] Archiving disabled
[JENKINS] Archiving disabled
[JENKINS] Archiving disabled
[JENKINS] Archiving disabled
[JENKINS] Archiving disabled
[JENKINS] Archiving disabled
[JENKINS] Archiving disabled
[JENKINS] Archiving disabled
[JENKINS] Archiving disabled
[JENKINS] Archiving disabled
[JENKINS] Archiving disabled
[JENKINS] Archiving disabled
[JENKINS] Archiving disabled
[JENKINS] Archiving disabled
[JENKINS] Archiving disabled
[JENKINS] Archiving disabled
[JENKINS] Archiving disabled
[JENKINS] Archiving disabled
[JENKINS] Archiving disabled
[JENKINS] Archiving disabled
[JENKINS] Archiving disabled
[JENKINS] Archiving disabled
[JENKINS] Archiving disabled
[JENKINS] Archiving disabled
[JENKINS] Archiving disabled
[JENKINS] Archiving disabled
[JENKINS] Archiving disabled
[JENKINS] Archiving disabled
[JENKINS] Archiving disabled
[JENKINS] Archiving disabled
[JENKINS] Archiving disabled
[JENKINS] Archiving disabled
[JENKINS] Archiving disabled
[JENKINS] Archiving disabled
[JENKINS] Archiving disabled
[JENKINS] Archiving disabled
[JENKINS] Archiving disabled
[JENKINS] Archiving disabled
[JENKINS] Archiving disabled
[JENKINS] Archiving disabled
[JENKINS] Archiving disabled
[JENKINS] Archiving disabled
[JENKINS] Archiving disabled
[JENKINS] Archiving disabled
[JENKINS] Archiving disabled
[JENKINS] Archiving disabled
[JENKINS] Archiving disabled
[JENKINS] Archiving disabled
[JENKINS] Archiving disabled
[JENKINS] Archiving disabled
[JENKINS] Archiving disabled
[JENKINS] Archiving disabled
[JENKINS] Archiving disabled
[JENKINS] Archiving disabled
[JENKINS] Archiving disabled
[JENKINS] Archiving disabled
[JENKINS] Archiving disabled
[JENKINS] Archiving disabled
[JENKINS] Archiving disabled
[JENKINS] Archiving disabled
[JENKINS] Archiving disabled
[JENKINS] Archiving disabled
[JENKINS] Archiving disabled
[JENKINS] Archiving disabled
[JENKINS] Archiving disabled
[JENKINS] Archiving disabled
[JENKINS] Archiving disabled
[JENKINS] Archiving disabled
[JENKINS] Archiving disabled
[JENKINS] Archiving disabled
[JENKINS] Archiving disabled
[JENKINS] Archiving disabled
[JENKINS] Archiving disabled
[JENKINS] Archiving disabled
[JENKINS] Archiving disabled
[JENKINS] Archiving disabled
[JENKINS] Archiving disabled
[JENKINS] Archiving disabled
[JENKINS] Archiving disabled
[JENKINS] Archiving disabled
[JENKINS] Archiving disabled
[JENKINS] Archiving disabled
[JENKINS] Archiving disabled
[JENKINS] Archiving disabled
[JENKINS] Archiving disabled
[JENKINS] Archiving disabled
[JENKINS] Archiving disabled
[JENKINS] Archiving disabled
[JENKINS] Archiving disabled
[JENKINS] Archiving disabled
[JENKINS] Archiving disabled
[JENKINS] Archiving disabled
[JENKINS] Archiving disabled
[JENKINS] Archiving disabled
[JENKINS] Archiving disabled
[JENKINS] Archiving disabled
[JENKINS] Archiving disabled
Waiting for Jenkins to finish collecting data
[ERROR] Failed to execute goal org.apache.maven.plugins:maven-surefire-plugin:2.17:test (default-test) on project org.apache.sling.discovery.impl: Execution default-test of goal org.apache.maven.plugins:maven-surefire-plugin:2.17:test failed: The forked VM terminated without properly saying goodbye. VM crash or System.exit called?
[ERROR] Command was /bin/sh -c cd <https://builds.apache.org/job/sling-trunk-1.7/ws/trunk/bundles/extensions/discovery/impl> && /x1/jenkins/tools/java/jdk1.7.0_25-32/jre/bin/java -Xmx2048m -jar <https://builds.apache.org/job/sling-trunk-1.7/ws/trunk/bundles/extensions/discovery/impl/target/surefire/surefirebooter5418267281210705807.jar> <https://builds.apache.org/job/sling-trunk-1.7/ws/trunk/bundles/extensions/discovery/impl/target/surefire/surefire5094789254463405536tmp> <https://builds.apache.org/job/sling-trunk-1.7/ws/trunk/bundles/extensions/discovery/impl/target/surefire/surefire_273574987292857670366tmp>
[ERROR] -> [Help 1]
[ERROR]
[ERROR] To see the full stack trace of the errors, re-run Maven with the -e switch.
[ERROR] Re-run Maven using the -X switch to enable full debug logging.
[ERROR]
[ERROR] For more information about the errors and possible solutions, please read the following articles:
[ERROR] [Help 1] http://cwiki.apache.org/confluence/display/MAVEN/PluginExecutionException
[ERROR]
[ERROR] After correcting the problems, you can resume the build with the command
[ERROR] mvn <goals> -rf :org.apache.sling.discovery.impl
channel stopped