You are viewing a plain text version of this content. The canonical link for it is here.
Posted to builds@beam.apache.org by Apache Jenkins Server <je...@builds.apache.org> on 2020/03/06 00:24:50 UTC
Build failed in Jenkins: beam_PostCommit_Python_MongoDBIO_IT #2322
See <https://builds.apache.org/job/beam_PostCommit_Python_MongoDBIO_IT/2322/display/redirect>
Changes:
------------------------------------------
[...truncated 15.64 KB...]
> Task :sdks:python:test-suites:direct:py35:mongodbioIT FAILED
Using default tag: latest
latest: Pulling from library/mongo
Digest: sha256:357486dea8e465612d99ccb4ca6e0a202e9048d1b365538cec9fb00afde415b6
Status: Image is up to date for mongo:latest
5bc3fe811db5046a73823a8a767232989b8b7d4b943c298734076552f05326e7
Obtaining file://<https://builds.apache.org/job/beam_PostCommit_Python_MongoDBIO_IT/ws/src/sdks/python>
ERROR: Command errored out with exit status 1:
command: <https://builds.apache.org/job/beam_PostCommit_Python_MongoDBIO_IT/ws/src/build/gradleenv/1398941889/bin/python3.5> -c 'import sys, setuptools, tokenize; sys.argv[0] = '"'"'<https://builds.apache.org/job/beam_PostCommit_Python_MongoDBIO_IT/ws/src/sdks/python/setup.py'"'"';> __file__='"'"'<https://builds.apache.org/job/beam_PostCommit_Python_MongoDBIO_IT/ws/src/sdks/python/setup.py'"'"';f=getattr(tokenize,> '"'"'open'"'"', open)(__file__);code=f.read().replace('"'"'\r\n'"'"', '"'"'\n'"'"');f.close();exec(compile(code, __file__, '"'"'exec'"'"'))' egg_info
cwd: <https://builds.apache.org/job/beam_PostCommit_Python_MongoDBIO_IT/ws/src/sdks/python/>
Complete output (6 lines):
running egg_info
<https://builds.apache.org/job/beam_PostCommit_Python_MongoDBIO_IT/ws/src/build/gradleenv/1398941889/lib/python3.5/site-packages/setuptools/dist.py>:476: UserWarning: Normalizing '2.21.0.dev' to '2.21.0.dev0'
normalized_version,
INFO:gen_protos:Skipping proto regeneration: all files up to date
creating apache_beam.egg-info
error: could not create 'apache_beam.egg-info': No space left on device
----------------------------------------
ERROR: Command errored out with exit status 1: python setup.py egg_info Check the logs for full command output.
> Task :sdks:python:test-suites:direct:py2:mongodbioIT
ERROR: Command errored out with exit status 1:
command: <https://builds.apache.org/job/beam_PostCommit_Python_MongoDBIO_IT/ws/src/build/gradleenv/45127155/bin/python2.7> -c 'import sys, setuptools, tokenize; sys.argv[0] = '"'"'<https://builds.apache.org/job/beam_PostCommit_Python_MongoDBIO_IT/ws/src/sdks/python/setup.py'"'"';> __file__='"'"'<https://builds.apache.org/job/beam_PostCommit_Python_MongoDBIO_IT/ws/src/sdks/python/setup.py'"'"';f=getattr(tokenize,> '"'"'open'"'"', open)(__file__);code=f.read().replace('"'"'\r\n'"'"', '"'"'\n'"'"');f.close();exec(compile(code, __file__, '"'"'exec'"'"'))' egg_info
cwd: <https://builds.apache.org/job/beam_PostCommit_Python_MongoDBIO_IT/ws/src/sdks/python/>
Complete output (128 lines):
<https://builds.apache.org/job/beam_PostCommit_Python_MongoDBIO_IT/ws/src/sdks/python/setup.py>:253: UserWarning: You are using Apache Beam with Python 2. New releases of Apache Beam will soon support Python 3 only.
'You are using Apache Beam with Python 2. '
<https://builds.apache.org/job/beam_PostCommit_Python_MongoDBIO_IT/ws/src/build/gradleenv/45127155/local/lib/python2.7/site-packages/setuptools/dist.py>:476: UserWarning: Normalizing '2.21.0.dev' to '2.21.0.dev0'
normalized_version,
running egg_info
INFO:gen_protos:Regenerating Python proto definitions (no output files).
INFO:gen_protos:Found protoc_gen_mypy at <https://builds.apache.org/job/beam_PostCommit_Python_MongoDBIO_IT/ws/src/build/gradleenv/45127155/bin/protoc-gen-mypy>
beam_fn_api.proto: warning: Import google/protobuf/descriptor.proto but not used.
beam_fn_api.proto: warning: Import google/protobuf/wrappers.proto but not used.
beam_interactive_api.proto: warning: Import google/protobuf/timestamp.proto but not used.
Writing mypy to endpoints_pb2.pyi
Writing mypy to external_transforms_pb2.pyi
Writing mypy to beam_provision_api_pb2.pyi
Writing mypy to beam_runner_api_pb2.pyi
Writing mypy to standard_window_fns_pb2.pyi
Writing mypy to beam_artifact_api_pb2.pyi
Writing mypy to beam_fn_api_pb2.pyi
Writing mypy to metrics_pb2.pyi
Writing mypy to schema_pb2.pyi
Writing mypy to beam_job_api_pb2.pyi
Writing mypy to beam_interactive_api_pb2.pyi
Writing mypy to beam_expansion_api_pb2.pyi
root: Generating grammar tables from /usr/lib/python2.7/lib2to3/PatternGrammar.txt
root: Generating grammar tables from /usr/lib/python2.7/lib2to3/PatternGrammar.txt
root: Generating grammar tables from /usr/lib/python2.7/lib2to3/PatternGrammar.txt
root: Generating grammar tables from /usr/lib/python2.7/lib2to3/PatternGrammar.txt
root: Generating grammar tables from /usr/lib/python2.7/lib2to3/PatternGrammar.txt
root: Generating grammar tables from /usr/lib/python2.7/lib2to3/PatternGrammar.txt
root: Generating grammar tables from /usr/lib/python2.7/lib2to3/PatternGrammar.txt
root: Generating grammar tables from /usr/lib/python2.7/lib2to3/PatternGrammar.txt
root: Generating grammar tables from /usr/lib/python2.7/lib2to3/PatternGrammar.txt
root: Generating grammar tables from /usr/lib/python2.7/lib2to3/PatternGrammar.txt
root: Generating grammar tables from /usr/lib/python2.7/lib2to3/PatternGrammar.txt
root: Generating grammar tables from /usr/lib/python2.7/lib2to3/PatternGrammar.txt
RefactoringTool: Skipping optional fixer: idioms
root: Generating grammar tables from /usr/lib/python2.7/lib2to3/PatternGrammar.txt
root: Generating grammar tables from /usr/lib/python2.7/lib2to3/PatternGrammar.txt
root: Generating grammar tables from /usr/lib/python2.7/lib2to3/PatternGrammar.txt
root: Generating grammar tables from /usr/lib/python2.7/lib2to3/PatternGrammar.txt
root: Generating grammar tables from /usr/lib/python2.7/lib2to3/PatternGrammar.txt
root: Generating grammar tables from /usr/lib/python2.7/lib2to3/PatternGrammar.txt
root: Generating grammar tables from /usr/lib/python2.7/lib2to3/PatternGrammar.txt
root: Generating grammar tables from /usr/lib/python2.7/lib2to3/PatternGrammar.txt
root: Generating grammar tables from /usr/lib/python2.7/lib2to3/PatternGrammar.txt
root: Generating grammar tables from /usr/lib/python2.7/lib2to3/PatternGrammar.txt
root: Generating grammar tables from /usr/lib/python2.7/lib2to3/PatternGrammar.txt
root: Generating grammar tables from /usr/lib/python2.7/lib2to3/PatternGrammar.txt
root: Generating grammar tables from /usr/lib/python2.7/lib2to3/PatternGrammar.txt
root: Generating grammar tables from /usr/lib/python2.7/lib2to3/PatternGrammar.txt
root: Generating grammar tables from /usr/lib/python2.7/lib2to3/PatternGrammar.txt
root: Generating grammar tables from /usr/lib/python2.7/lib2to3/PatternGrammar.txt
root: Generating grammar tables from /usr/lib/python2.7/lib2to3/PatternGrammar.txt
root: Generating grammar tables from /usr/lib/python2.7/lib2to3/PatternGrammar.txt
root: Generating grammar tables from /usr/lib/python2.7/lib2to3/PatternGrammar.txt
root: Generating grammar tables from /usr/lib/python2.7/lib2to3/PatternGrammar.txt
root: Generating grammar tables from /usr/lib/python2.7/lib2to3/PatternGrammar.txt
root: Generating grammar tables from /usr/lib/python2.7/lib2to3/PatternGrammar.txt
root: Generating grammar tables from /usr/lib/python2.7/lib2to3/PatternGrammar.txt
RefactoringTool: Skipping optional fixer: ws_comma
root: Generating grammar tables from /usr/lib/python2.7/lib2to3/PatternGrammar.txt
root: Generating grammar tables from /usr/lib/python2.7/lib2to3/PatternGrammar.txt
root: Generating grammar tables from /usr/lib/python2.7/lib2to3/PatternGrammar.txt
root: Generating grammar tables from /usr/lib/python2.7/lib2to3/PatternGrammar.txt
root: Generating grammar tables from /usr/lib/python2.7/lib2to3/PatternGrammar.txt
root: Generating grammar tables from /usr/lib/python2.7/lib2to3/PatternGrammar.txt
root: Generating grammar tables from /usr/lib/python2.7/lib2to3/PatternGrammar.txt
root: Generating grammar tables from /usr/lib/python2.7/lib2to3/PatternGrammar.txt
root: Generating grammar tables from /usr/lib/python2.7/lib2to3/PatternGrammar.txt
root: Generating grammar tables from /usr/lib/python2.7/lib2to3/PatternGrammar.txt
root: Generating grammar tables from /usr/lib/python2.7/lib2to3/PatternGrammar.txt
root: Generating grammar tables from /usr/lib/python2.7/lib2to3/PatternGrammar.txt
root: Generating grammar tables from /usr/lib/python2.7/lib2to3/PatternGrammar.txt
root: Generating grammar tables from /usr/lib/python2.7/lib2to3/PatternGrammar.txt
root: Generating grammar tables from /usr/lib/python2.7/lib2to3/PatternGrammar.txt
root: Generating grammar tables from /usr/lib/python2.7/lib2to3/PatternGrammar.txt
root: Generating grammar tables from /usr/lib/python2.7/lib2to3/PatternGrammar.txt
root: Generating grammar tables from /usr/lib/python2.7/lib2to3/PatternGrammar.txt
root: Generating grammar tables from /usr/lib/python2.7/lib2to3/PatternGrammar.txt
root: Generating grammar tables from /usr/lib/python2.7/lib2to3/PatternGrammar.txt
root: Generating grammar tables from /usr/lib/python2.7/lib2to3/PatternGrammar.txt
RefactoringTool: Refactored <https://builds.apache.org/job/beam_PostCommit_Python_MongoDBIO_IT/ws/src/sdks/python/apache_beam/portability/api/beam_artifact_api_pb2.py>
RefactoringTool: Refactored <https://builds.apache.org/job/beam_PostCommit_Python_MongoDBIO_IT/ws/src/sdks/python/apache_beam/portability/api/beam_artifact_api_pb2_grpc.py>
RefactoringTool: Refactored <https://builds.apache.org/job/beam_PostCommit_Python_MongoDBIO_IT/ws/src/sdks/python/apache_beam/portability/api/beam_expansion_api_pb2.py>
RefactoringTool: Refactored <https://builds.apache.org/job/beam_PostCommit_Python_MongoDBIO_IT/ws/src/sdks/python/apache_beam/portability/api/beam_expansion_api_pb2_grpc.py>
RefactoringTool: Refactored <https://builds.apache.org/job/beam_PostCommit_Python_MongoDBIO_IT/ws/src/sdks/python/apache_beam/portability/api/beam_fn_api_pb2.py>
Traceback (most recent call last):
File "<https://builds.apache.org/job/beam_PostCommit_Python_MongoDBIO_IT/ws/src/build/gradleenv/45127155/bin/futurize",> line 8, in <module>
sys.exit(main())
File "<https://builds.apache.org/job/beam_PostCommit_Python_MongoDBIO_IT/ws/src/build/gradleenv/45127155/local/lib/python2.7/site-packages/libfuturize/main.py",> line 293, in main
options.processes)
File "/usr/lib/python2.7/lib2to3/refactor.py", line 706, in refactor
items, write, doctests_only)
File "/usr/lib/python2.7/lib2to3/refactor.py", line 299, in refactor
self.refactor_dir(dir_or_file, write, doctests_only)
File "/usr/lib/python2.7/lib2to3/refactor.py", line 319, in refactor_dir
self.refactor_file(fullname, write, doctests_only)
File "/usr/lib/python2.7/lib2to3/refactor.py", line 747, in refactor_file
*args, **kwargs)
File "/usr/lib/python2.7/lib2to3/refactor.py", line 358, in refactor_file
write=write, encoding=encoding)
File "/usr/lib/python2.7/lib2to3/refactor.py", line 524, in processed_file
self.write_file(new_text, filename, old_text, encoding)
File "/usr/lib/python2.7/lib2to3/main.py", line 101, in write_file
write(new_text, filename, old_text, encoding)
File "/usr/lib/python2.7/lib2to3/refactor.py", line 541, in write_file
f.write(_to_system_newlines(new_text))
File "<https://builds.apache.org/job/beam_PostCommit_Python_MongoDBIO_IT/ws/src/build/gradleenv/45127155/lib/python2.7/codecs.py",> line 706, in write
return self.writer.write(data)
File "<https://builds.apache.org/job/beam_PostCommit_Python_MongoDBIO_IT/ws/src/build/gradleenv/45127155/lib/python2.7/codecs.py",> line 370, in write
self.stream.write(data)
IOError: [Errno 28] No space left on device
Traceback (most recent call last):
File "<string>", line 1, in <module>
File "<https://builds.apache.org/job/beam_PostCommit_Python_MongoDBIO_IT/ws/src/sdks/python/setup.py",> line 317, in <module>
'mypy': generate_protos_first(mypy),
File "<https://builds.apache.org/job/beam_PostCommit_Python_MongoDBIO_IT/ws/src/build/gradleenv/45127155/local/lib/python2.7/site-packages/setuptools/__init__.py",> line 145, in setup
return distutils.core.setup(**attrs)
File "/usr/lib/python2.7/distutils/core.py", line 151, in setup
dist.run_commands()
File "/usr/lib/python2.7/distutils/dist.py", line 953, in run_commands
self.run_command(cmd)
File "/usr/lib/python2.7/distutils/dist.py", line 972, in run_command
cmd_obj.run()
File "<https://builds.apache.org/job/beam_PostCommit_Python_MongoDBIO_IT/ws/src/sdks/python/setup.py",> line 241, in run
gen_protos.generate_proto_files()
File "gen_protos.py", line 343, in generate_proto_files
'Error applying futurize to generated protobuf python files.')
RuntimeError: Error applying futurize to generated protobuf python files.
----------------------------------------
ERROR: Command errored out with exit status 1: python setup.py egg_info Check the logs for full command output.
> Task :sdks:python:test-suites:direct:py2:mongodbioIT FAILED
FAILURE: Build completed with 2 failures.
1: Task failed with an exception.
-----------
* Where:
Build file '<https://builds.apache.org/job/beam_PostCommit_Python_MongoDBIO_IT/ws/src/sdks/python/test-suites/direct/py35/build.gradle'> line: 78
* What went wrong:
Execution failed for task ':sdks:python:test-suites:direct:py35:mongodbioIT'.
> Process 'command 'sh'' finished with non-zero exit value 1
* Try:
Run with --stacktrace option to get the stack trace. Run with --info or --debug option to get more log output. Run with --scan to get full insights.
==============================================================================
2: Task failed with an exception.
-----------
* Where:
Build file '<https://builds.apache.org/job/beam_PostCommit_Python_MongoDBIO_IT/ws/src/sdks/python/test-suites/direct/py2/build.gradle'> line: 108
* What went wrong:
Execution failed for task ':sdks:python:test-suites:direct:py2:mongodbioIT'.
> Process 'command 'sh'' finished with non-zero exit value 1
* Try:
Run with --stacktrace option to get the stack trace. Run with --info or --debug option to get more log output. Run with --scan to get full insights.
==============================================================================
* Get more help at https://help.gradle.org
Deprecated Gradle features were used in this build, making it incompatible with Gradle 6.0.
Use '--warning-mode all' to show the individual deprecation warnings.
See https://docs.gradle.org/5.2.1/userguide/command_line_interface.html#sec:command_line_warnings
BUILD FAILED in 1m 24s
4 actionable tasks: 4 executed
A build scan cannot be produced as an error occurred spooling the build data.
Please report this problem via https://gradle.com/scans/help/plugin and include the following via copy/paste:
----------
Gradle version: 5.2.1
Plugin version: 2.3
java.lang.IllegalStateException: java.io.IOException: No space left on device
at com.gradle.scan.a.e.b.flush(SourceFile:233)
at com.gradle.scan.a.e.b.close(SourceFile:244)
at com.gradle.scan.a.e.c.close(SourceFile:66)
at com.gradle.scan.plugin.internal.n.a(SourceFile:78)
at com.gradle.scan.plugin.internal.e.c.c.b(SourceFile:125)
at com.gradle.scan.plugin.internal.e.c.c.a(SourceFile:117)
at com.gradle.scan.plugin.internal.o.a$a.a(SourceFile:30)
at com.gradle.scan.plugin.internal.o.a$a.a(SourceFile:19)
at com.gradle.scan.plugin.internal.o.a.c(SourceFile:60)
Caused by: java.io.IOException: No space left on device
at com.gradle.scan.a.e.b.flush(SourceFile:231)
... 8 more
----------
FAILURE: Build failed with an exception.
* What went wrong:
Failed to notify root build lifecycle listener.
> Could not update /home/jenkins/.gradle/caches/5.2.1/file-changes/last-build.bin
> Could not update <https://builds.apache.org/job/beam_PostCommit_Python_MongoDBIO_IT/ws/src/.gradle/5.2.1/fileChanges/last-build.bin>
* Try:
Run with --stacktrace option to get the stack trace. Run with --info or --debug option to get more log output. Run with --scan to get full insights.
* Get more help at https://help.gradle.org
Deprecated Gradle features were used in this build, making it incompatible with Gradle 6.0.
Use '--warning-mode all' to show the individual deprecation warnings.
See https://docs.gradle.org/5.2.1/userguide/command_line_interface.html#sec:command_line_warnings
BUILD FAILED in 1m 24s
FAILURE: Build failed with an exception.
* What went wrong:
Could not receive a message from the daemon.
* Try:
Run with --stacktrace option to get the stack trace. Run with --info or --debug option to get more log output. Run with --scan to get full insights.
* Get more help at https://help.gradle.org
Build step 'Invoke Gradle script' changed build result to FAILURE
Build step 'Invoke Gradle script' marked build as failure
---------------------------------------------------------------------
To unsubscribe, e-mail: builds-unsubscribe@beam.apache.org
For additional commands, e-mail: builds-help@beam.apache.org
Jenkins build is back to normal :
beam_PostCommit_Python_MongoDBIO_IT #2323
Posted by Apache Jenkins Server <je...@builds.apache.org>.
See <https://builds.apache.org/job/beam_PostCommit_Python_MongoDBIO_IT/2323/display/redirect?page=changes>
---------------------------------------------------------------------
To unsubscribe, e-mail: builds-unsubscribe@beam.apache.org
For additional commands, e-mail: builds-help@beam.apache.org