You are viewing a plain text version of this content. The canonical link for it is here.
Posted to builds@beam.apache.org by Apache Jenkins Server <je...@builds.apache.org> on 2020/02/12 20:00:06 UTC

Build failed in Jenkins: beam_PostCommit_Python2 #1693

See <https://builds.apache.org/job/beam_PostCommit_Python2/1693/display/redirect>

Changes:


------------------------------------------
[...truncated 3.66 MB...]
    }, 
    "serviceKmsKeyName": "projects/apache-beam-testing/locations/global/keyRings/beam-it/cryptoKeys/test", 
    "tempStoragePrefix": "storage.googleapis.com/temp-storage-for-end-to-end-tests/temp-it/beamapp-jenkins-0212194247-806034.1581536567.806268", 
    "userAgent": {
      "name": "Apache Beam Python 2.7 SDK", 
      "version": "2.20.0.dev"
    }, 
    "version": {
      "job_type": "PYTHON_BATCH", 
      "major": "7"
    }, 
    "workerPools": [
      {
        "autoscalingSettings": {}, 
        "kind": "harness", 
        "numWorkers": 1, 
        "packages": [
          {
            "location": "storage.googleapis.com/temp-storage-for-end-to-end-tests/staging-it/beamapp-jenkins-0212194247-806034.1581536567.806268/requirements.txt", 
            "name": "requirements.txt"
          }, 
          {
            "location": "storage.googleapis.com/temp-storage-for-end-to-end-tests/staging-it/beamapp-jenkins-0212194247-806034.1581536567.806268/setuptools-42.0.2.zip", 
            "name": "setuptools-42.0.2.zip"
          }, 
          {
            "location": "storage.googleapis.com/temp-storage-for-end-to-end-tests/staging-it/beamapp-jenkins-0212194247-806034.1581536567.806268/PyHamcrest-1.10.0.tar.gz", 
            "name": "PyHamcrest-1.10.0.tar.gz"
          }, 
          {
            "location": "storage.googleapis.com/temp-storage-for-end-to-end-tests/staging-it/beamapp-jenkins-0212194247-806034.1581536567.806268/PyHamcrest-1.9.0.tar.gz", 
            "name": "PyHamcrest-1.9.0.tar.gz"
          }, 
          {
            "location": "storage.googleapis.com/temp-storage-for-end-to-end-tests/staging-it/beamapp-jenkins-0212194247-806034.1581536567.806268/six-1.14.0.tar.gz", 
            "name": "six-1.14.0.tar.gz"
          }, 
          {
            "location": "storage.googleapis.com/temp-storage-for-end-to-end-tests/staging-it/beamapp-jenkins-0212194247-806034.1581536567.806268/mock-3.0.5.tar.gz", 
            "name": "mock-3.0.5.tar.gz"
          }, 
          {
            "location": "storage.googleapis.com/temp-storage-for-end-to-end-tests/staging-it/beamapp-jenkins-0212194247-806034.1581536567.806268/setuptools-45.0.0.zip", 
            "name": "setuptools-45.0.0.zip"
          }, 
          {
            "location": "storage.googleapis.com/temp-storage-for-end-to-end-tests/staging-it/beamapp-jenkins-0212194247-806034.1581536567.806268/six-1.13.0.tar.gz", 
            "name": "six-1.13.0.tar.gz"
          }, 
          {
            "location": "storage.googleapis.com/temp-storage-for-end-to-end-tests/staging-it/beamapp-jenkins-0212194247-806034.1581536567.806268/mock-2.0.0.tar.gz", 
            "name": "mock-2.0.0.tar.gz"
          }, 
          {
            "location": "storage.googleapis.com/temp-storage-for-end-to-end-tests/staging-it/beamapp-jenkins-0212194247-806034.1581536567.806268/setuptools-44.0.0.zip", 
            "name": "setuptools-44.0.0.zip"
          }, 
          {
            "location": "storage.googleapis.com/temp-storage-for-end-to-end-tests/staging-it/beamapp-jenkins-0212194247-806034.1581536567.806268/pbr-5.4.4.tar.gz", 
            "name": "pbr-5.4.4.tar.gz"
          }, 
          {
            "location": "storage.googleapis.com/temp-storage-for-end-to-end-tests/staging-it/beamapp-jenkins-0212194247-806034.1581536567.806268/funcsigs-1.0.2.tar.gz", 
            "name": "funcsigs-1.0.2.tar.gz"
          }, 
          {
            "location": "storage.googleapis.com/temp-storage-for-end-to-end-tests/staging-it/beamapp-jenkins-0212194247-806034.1581536567.806268/PyHamcrest-1.10.1.tar.gz", 
            "name": "PyHamcrest-1.10.1.tar.gz"
          }, 
          {
            "location": "storage.googleapis.com/temp-storage-for-end-to-end-tests/staging-it/beamapp-jenkins-0212194247-806034.1581536567.806268/dataflow_python_sdk.tar", 
            "name": "dataflow_python_sdk.tar"
          }, 
          {
            "location": "storage.googleapis.com/temp-storage-for-end-to-end-tests/staging-it/beamapp-jenkins-0212194247-806034.1581536567.806268/dataflow-worker.jar", 
            "name": "dataflow-worker.jar"
          }
        ], 
        "taskrunnerSettings": {
          "parallelWorkerSettings": {
            "baseUrl": "https://dataflow.googleapis.com", 
            "servicePath": "https://dataflow.googleapis.com"
          }
        }, 
        "workerHarnessContainerImage": "gcr.io/cloud-dataflow/v1beta3/python:beam-master-20200131"
      }
    ]
  }, 
  "name": "beamapp-jenkins-0212194247-806034", 
  "steps": [
    {
      "kind": "ParallelRead", 
      "name": "s1", 
      "properties": {
        "bigquery_export_format": "FORMAT_AVRO", 
        "bigquery_flatten_results": true, 
        "bigquery_kms_key": "projects/apache-beam-testing/locations/global/keyRings/beam-it/cryptoKeys/test", 
        "bigquery_query": "SELECT * FROM (SELECT \"apple\" as fruit) UNION ALL (SELECT \"orange\" as fruit)", 
        "bigquery_use_legacy_sql": false, 
        "display_data": [
          {
            "key": "source", 
            "label": "Read Source", 
            "namespace": "apache_beam.io.iobase.Read", 
            "shortValue": "BigQuerySource", 
            "type": "STRING", 
            "value": "apache_beam.io.gcp.bigquery.BigQuerySource"
          }, 
          {
            "key": "query", 
            "label": "Query", 
            "namespace": "apache_beam.io.gcp.bigquery.BigQuerySource", 
            "type": "STRING", 
            "value": "SELECT * FROM (SELECT \"apple\" as fruit) UNION ALL (SELECT \"orange\" as fruit)"
          }, 
          {
            "key": "validation", 
            "label": "Validation Enabled", 
            "namespace": "apache_beam.io.gcp.bigquery.BigQuerySource", 
            "type": "BOOLEAN", 
            "value": false
          }
        ], 
        "format": "bigquery", 
        "output_info": [
          {
            "encoding": {
              "@type": "kind:windowed_value", 
              "component_encodings": [
                {
                  "@type": "FastPrimitivesCoder$eNprYEpOLEhMzkiNT0pNzNVLzk9JLSqGUlxuicUlAUWZuZklmWWpxc4gQa5CBs3GQsbaQqZQ/vi0xJycpMTk7Hiw+kJmPEYFZCZn56RCjWABGsFaW8iWVJykBwDlGS3/", 
                  "component_encodings": [
                    {
                      "@type": "FastPrimitivesCoder$eNprYEpOLEhMzkiNT0pNzNVLzk9JLSqGUlxuicUlAUWZuZklmWWpxc4gQa5CBs3GQsbaQqZQ/vi0xJycpMTk7Hiw+kJmPEYFZCZn56RCjWABGsFaW8iWVJykBwDlGS3/", 
                      "component_encodings": [], 
                      "pipeline_proto_coder_id": "ref_Coder_FastPrimitivesCoder_1"
                    }, 
                    {
                      "@type": "FastPrimitivesCoder$eNprYEpOLEhMzkiNT0pNzNVLzk9JLSqGUlxuicUlAUWZuZklmWWpxc4gQa5CBs3GQsbaQqZQ/vi0xJycpMTk7Hiw+kJmPEYFZCZn56RCjWABGsFaW8iWVJykBwDlGS3/", 
                      "component_encodings": [], 
                      "pipeline_proto_coder_id": "ref_Coder_FastPrimitivesCoder_1"
                    }
                  ], 
                  "is_pair_like": true, 
                  "pipeline_proto_coder_id": "ref_Coder_FastPrimitivesCoder_1"
                }, 
                {
                  "@type": "kind:global_window"
                }
              ], 
              "is_wrapper": true
            }, 
            "output_name": "out", 
            "user_name": "read.out"
          }
        ], 
        "user_name": "read"
      }
    }, 
    {
      "kind": "ParallelWrite", 
      "name": "s2", 
      "properties": {
        "bigquery_kms_key": "projects/apache-beam-testing/locations/global/keyRings/beam-it/cryptoKeys/test", 
        "create_disposition": "CREATE_IF_NEEDED", 
        "dataset": "python_query_to_table_15815365665764", 
        "display_data": [], 
        "encoding": {
          "@type": "kind:windowed_value", 
          "component_encodings": [
            {
              "@type": "RowAsDictJsonCoder$eNprYEpOLEhMzkiNT0pNzNXLzNdLTy7QS8pMLyxNLaqML8nPzynmCsovdyx2yUwu8SrOz3POT0kt4ipk0GwsZKwtZErSAwBKpRfo", 
              "component_encodings": [], 
              "pipeline_proto_coder_id": "ref_Coder_RowAsDictJsonCoder_3"
            }, 
            {
              "@type": "kind:global_window"
            }
          ], 
          "is_wrapper": true
        }, 
        "format": "bigquery", 
        "parallel_input": {
          "@type": "OutputReference", 
          "output_name": "out", 
          "step_name": "s1"
        }, 
        "schema": "{\"fields\": [{\"type\": \"STRING\", \"name\": \"fruit\", \"mode\": \"NULLABLE\"}]}", 
        "table": "output_table", 
        "user_name": "write/NativeWrite", 
        "write_disposition": "WRITE_EMPTY"
      }
    }
  ], 
  "type": "JOB_TYPE_BATCH"
}
apache_beam.runners.dataflow.internal.apiclient: INFO: Create job: <Job
 createTime: u'2020-02-12T19:43:02.745962Z'
 currentStateTime: u'1970-01-01T00:00:00Z'
 id: u'2020-02-12_11_43_01-17780604175606549693'
 location: u'us-central1'
 name: u'beamapp-jenkins-0212194247-806034'
 projectId: u'apache-beam-testing'
 stageStates: []
 startTime: u'2020-02-12T19:43:02.745962Z'
 steps: []
 tempFiles: []
 type: TypeValueValuesEnum(JOB_TYPE_BATCH, 1)>
apache_beam.runners.dataflow.internal.apiclient: INFO: Created job with id: [2020-02-12_11_43_01-17780604175606549693]
apache_beam.runners.dataflow.internal.apiclient: INFO: To access the Dataflow monitoring console, please navigate to https://console.cloud.google.com/dataflow/jobsDetail/locations/us-central1/jobs/2020-02-12_11_43_01-17780604175606549693?project=apache-beam-testing
--------------------- >> end captured logging << ---------------------

----------------------------------------------------------------------
XML: nosetests-postCommitIT-df.xml
----------------------------------------------------------------------
XML: <https://builds.apache.org/job/beam_PostCommit_Python2/ws/src/sdks/python/nosetests.xml>
----------------------------------------------------------------------
Ran 52 tests in 3356.181s

FAILED (SKIP=7, failures=2)

> Task :sdks:python:test-suites:dataflow:py2:postCommitIT FAILED

FAILURE: Build failed with an exception.

* Where:
Build file '<https://builds.apache.org/job/beam_PostCommit_Python2/ws/src/sdks/python/test-suites/dataflow/py2/build.gradle'> line: 85

* What went wrong:
Execution failed for task ':sdks:python:test-suites:dataflow:py2:postCommitIT'.
> Process 'command 'sh'' finished with non-zero exit value 1

* Try:
Run with --stacktrace option to get the stack trace. Run with --info or --debug option to get more log output. Run with --scan to get full insights.

* Get more help at https://help.gradle.org

Deprecated Gradle features were used in this build, making it incompatible with Gradle 6.0.
Use '--warning-mode all' to show the individual deprecation warnings.
See https://docs.gradle.org/5.2.1/userguide/command_line_interface.html#sec:command_line_warnings

BUILD FAILED in 57m 28s
124 actionable tasks: 98 executed, 23 from cache, 3 up-to-date

Publishing build scan...
https://gradle.com/s/uud5lxzcqml4c

Build step 'Invoke Gradle script' changed build result to FAILURE
Build step 'Invoke Gradle script' marked build as failure

---------------------------------------------------------------------
To unsubscribe, e-mail: builds-unsubscribe@beam.apache.org
For additional commands, e-mail: builds-help@beam.apache.org


Jenkins build is back to normal : beam_PostCommit_Python2 #1695

Posted by Apache Jenkins Server <je...@builds.apache.org>.
See <https://builds.apache.org/job/beam_PostCommit_Python2/1695/display/redirect>


---------------------------------------------------------------------
To unsubscribe, e-mail: builds-unsubscribe@beam.apache.org
For additional commands, e-mail: builds-help@beam.apache.org


Build failed in Jenkins: beam_PostCommit_Python2 #1694

Posted by Apache Jenkins Server <je...@builds.apache.org>.
See <https://builds.apache.org/job/beam_PostCommit_Python2/1694/display/redirect?page=changes>

Changes:

[github] [AVRO-2737] Exclude a buggy avro version from requirements spec.


------------------------------------------
[...truncated 3.61 MB...]
[flink-runner-job-invoker] INFO org.apache.beam.runners.flink.FlinkPipelineRunner - __metricscontainers : MetricQueryResults(Counters(42read/Read/_SDFBoundedSourceWrapper/Impulse.None/SplitAndSize0/beam:env:external:v1:0:beam:metric:element_count:v1 {PCOLLECTION=ref_PCollection_PCollection_1/SplitAndSize0}: 1, 19group/GroupByWindow.None/beam:env:external:v1:0:beam:metric:pardo_execution_time:finish_bundle_msecs:v1 {PTRANSFORM=fn/read/ref_PCollection_PCollection_7:0}: 0, 40write/Write/WriteImpl/DoOnce/Map(decode).None/beam:env:external:v1:2:beam:metric:element_count:v1 {PCOLLECTION=ref_PCollection_PCollection_12}: 1, 19group/GroupByWindow.None/beam:env:external:v1:0:beam:metric:pardo_execution_time:process_bundle_msecs:v1 {PTRANSFORM=fn/read/ref_PCollection_PCollection_7:0}: 0, 42read/Read/_SDFBoundedSourceWrapper/Impulse.None/beam:env:external:v1:0:beam:metric:element_count:v1 {PCOLLECTION=ref_PCollection_PCollection_1}: 1, 42read/Read/_SDFBoundedSourceWrapper/Impulse.None/SplitAndSize0/beam:env:external:v1:0:beam:metric:pardo_execution_time:process_bundle_msecs:v1 {PTRANSFORM=ref_AppliedPTransform_read/Read/_SDFBoundedSourceWrapper/ParDo(SDFBoundedSourceDoFn)_6/ProcessSizedElementsAndRestrictions0}: 0, 42read/Read/_SDFBoundedSourceWrapper/Impulse.None/beam:env:external:v1:0:beam:metric:pardo_execution_time:finish_bundle_msecs:v1 {PTRANSFORM=ref_AppliedPTransform_read/Read/_SDFBoundedSourceWrapper/ParDo(SDFBoundedSourceDoFn)_6/PairWithRestriction0}: 0, 42read/Read/_SDFBoundedSourceWrapper/Impulse.None/SplitAndSize0/beam:env:external:v1:0:beam:metric:pardo_execution_time:process_bundle_msecs:v1 {PTRANSFORM=fn/read/ref_PCollection_PCollection_1/SplitAndSize0:0}: 0, 6format.None/beam:env:external:v1:0:beam:metric:pardo_execution_time:process_bundle_msecs:v1 {PTRANSFORM=ref_AppliedPTransform_write/Write/WriteImpl/WindowInto(WindowIntoFn)_26}: 0, 19group/GroupByWindow.None/beam:env:external:v1:0:beam:metric:pardo_execution_time:start_bundle_msecs:v1 {PTRANSFORM=fn/read/ref_PCollection_PCollection_7:0}: 0, 42read/Read/_SDFBoundedSourceWrapper/Impulse.None/beam:env:external:v1:0:beam:metric:pardo_execution_time:process_bundle_msecs:v1 {PTRANSFORM=ref_AppliedPTransform_read/Read/_SDFBoundedSourceWrapper/ParDo(SDFBoundedSourceDoFn)_6/SplitAndSize0}: 0, 19group/GroupByWindow.None/beam:env:external:v1:0:beam:metric:pardo_execution_time:finish_bundle_msecs:v1 {PTRANSFORM=ref_AppliedPTransform_format_14}: 0, 19group/GroupByWindow.None/beam:env:external:v1:0:beam:metric:element_count:v1 {PCOLLECTION=ref_PCollection_PCollection_7}: 44, 36write/Write/WriteImpl/DoOnce/Impulse.None/beam:env:external:v1:0:beam:metric:pardo_execution_time:finish_bundle_msecs:v1 {PTRANSFORM=fn/read/ref_PCollection_PCollection_10:0}: 0, 40write/Write/WriteImpl/DoOnce/Map(decode).None/beam:env:external:v1:2:beam:metric:pardo_execution_time:start_bundle_msecs:v1 {PTRANSFORM=fn/read/ref_PCollection_PCollection_12:0}: 0, 40write/Write/WriteImpl/DoOnce/Map(decode).None/beam:env:external:v1:1:beam:metric:ptransform_execution_time:total_msecs:v1 {PTRANSFORM=ref_AppliedPTransform_write/Write/WriteImpl/InitializeWrite_23}: 0, 36write/Write/WriteImpl/DoOnce/Impulse.None/beam:env:external:v1:0:beam:metric:pardo_execution_time:start_bundle_msecs:v1 {PTRANSFORM=fn/read/ref_PCollection_PCollection_10:0}: 0, 6format.None/beam:env:external:v1:0:beam:metric:ptransform_execution_time:total_msecs:v1 {PTRANSFORM=ref_AppliedPTransform_write/Write/WriteImpl/WindowInto(WindowIntoFn)_26}: 0, 42read/Read/_SDFBoundedSourceWrapper/Impulse.None/SplitAndSize0/beam:env:external:v1:0:beam:metric:pardo_execution_time:finish_bundle_msecs:v1 {PTRANSFORM=ref_AppliedPTransform_read/Read/_SDFBoundedSourceWrapper/ParDo(SDFBoundedSourceDoFn)_6/ProcessSizedElementsAndRestrictions0}: 0, 46write/Write/WriteImpl/GroupByKey/GroupByWindow.None/beam:env:external:v1:0:beam:metric:ptransform_execution_time:total_msecs:v1 {PTRANSFORM=ref_AppliedPTransform_write/Write/WriteImpl/Extract_31}: 0, 42read/Read/_SDFBoundedSourceWrapper/Impulse.None/SplitAndSize0/beam:env:external:v1:0:beam:metric:pardo_execution_time:finish_bundle_msecs:v1 {PTRANSFORM=fn/read/ref_PCollection_PCollection_1/SplitAndSize0:0}: 0, 40write/Write/WriteImpl/DoOnce/Map(decode).None/beam:env:external:v1:1:beam:metric:pardo_execution_time:process_bundle_msecs:v1 {PTRANSFORM=ref_AppliedPTransform_write/Write/WriteImpl/InitializeWrite_23}: 0, 42read/Read/_SDFBoundedSourceWrapper/Impulse.None/SplitAndSize0/beam:env:external:v1:0:beam:metric:ptransform_execution_time:total_msecs:v1 {PTRANSFORM=fn/read/ref_PCollection_PCollection_1/SplitAndSize0:0}: 0, 40write/Write/WriteImpl/DoOnce/Map(decode).None/beam:env:external:v1:2:beam:metric:pardo_execution_time:finish_bundle_msecs:v1 {PTRANSFORM=fn/read/ref_PCollection_PCollection_12:0}: 0, 36write/Write/WriteImpl/DoOnce/Impulse.None/beam:env:external:v1:0:beam:metric:ptransform_execution_time:total_msecs:v1 {PTRANSFORM=ref_AppliedPTransform_write/Write/WriteImpl/DoOnce/Map(decode)_22}: 0, 42read/Read/_SDFBoundedSourceWrapper/Impulse.None/SplitAndSize0/beam:env:external:v1:0:beam:metric:ptransform_execution_time:total_msecs:v1 {PTRANSFORM=ref_AppliedPTransform_read/Read/_SDFBoundedSourceWrapper/ParDo(SDFBoundedSourceDoFn)_6/ProcessSizedElementsAndRestrictions0}: 0, 46write/Write/WriteImpl/GroupByKey/GroupByWindow.None/beam:env:external:v1:0:beam:metric:pardo_execution_time:start_bundle_msecs:v1 {PTRANSFORM=fn/write/ref_PCollection_PCollection_20:0}: 0, 46write/Write/WriteImpl/GroupByKey/GroupByWindow.None/beam:env:external:v1:0:beam:metric:pardo_execution_time:finish_bundle_msecs:v1 {PTRANSFORM=fn/write/ref_PCollection_PCollection_20:0}: 0, 42read/Read/_SDFBoundedSourceWrapper/Impulse.None/beam:env:external:v1:0:beam:metric:ptransform_execution_time:total_msecs:v1 {PTRANSFORM=fn/read/ref_PCollection_PCollection_1:0}: 0, 6format.None/beam:env:external:v1:0:beam:metric:pardo_execution_time:finish_bundle_msecs:v1 {PTRANSFORM=ref_AppliedPTransform_write/Write/WriteImpl/WindowInto(WindowIntoFn)_26}: 0, 19group/GroupByWindow.None/beam:env:external:v1:0:beam:metric:element_count:v1 {PCOLLECTION=ref_PCollection_PCollection_8}: 44, 19group/GroupByWindow.None/beam:env:external:v1:0:beam:metric:element_count:v1 {PCOLLECTION=ref_PCollection_PCollection_9}: 44, 46write/Write/WriteImpl/GroupByKey/GroupByWindow.None/beam:env:external:v1:0:beam:metric:pardo_execution_time:process_bundle_msecs:v1 {PTRANSFORM=fn/write/ref_PCollection_PCollection_20:0}: 0, 42read/Read/_SDFBoundedSourceWrapper/Impulse.None/beam:env:external:v1:0:beam:metric:pardo_execution_time:start_bundle_msecs:v1 {PTRANSFORM=ref_AppliedPTransform_read/Read/_SDFBoundedSourceWrapper/ParDo(SDFBoundedSourceDoFn)_6/PairWithRestriction0}: 0, 36write/Write/WriteImpl/DoOnce/Impulse.None/beam:env:external:v1:0:beam:metric:pardo_execution_time:process_bundle_msecs:v1 {PTRANSFORM=fn/read/ref_PCollection_PCollection_10:0}: 0, 42read/Read/_SDFBoundedSourceWrapper/Impulse.None/beam:env:external:v1:0:beam:metric:pardo_execution_time:process_bundle_msecs:v1 {PTRANSFORM=ref_AppliedPTransform_read/Read/_SDFBoundedSourceWrapper/ParDo(SDFBoundedSourceDoFn)_6/PairWithRestriction0}: 0, 40write/Write/WriteImpl/DoOnce/Map(decode).None/beam:env:external:v1:0:beam:metric:ptransform_execution_time:total_msecs:v1 {PTRANSFORM=fn/write/ref_PCollection_PCollection_21:0}: 0, 40write/Write/WriteImpl/DoOnce/Map(decode).None/beam:env:external:v1:2:beam:metric:pardo_execution_time:start_bundle_msecs:v1 {PTRANSFORM=ref_AppliedPTransform_write/Write/WriteImpl/FinalizeWrite_33}: 0, 40write/Write/WriteImpl/DoOnce/Map(decode).None/beam:env:external:v1:2:beam:metric:pardo_execution_time:process_bundle_msecs:v1 {PTRANSFORM=fn/read/ref_PCollection_PCollection_12:0}: 0, 6format.None/beam:env:external:v1:0:beam:metric:pardo_execution_time:start_bundle_msecs:v1 {PTRANSFORM=ref_AppliedPTransform_write/Write/WriteImpl/WindowInto(WindowIntoFn)_26}: 0, 46write/Write/WriteImpl/GroupByKey/GroupByWindow.None/beam:env:external:v1:0:beam:metric:pardo_execution_time:start_bundle_msecs:v1 {PTRANSFORM=ref_AppliedPTransform_write/Write/WriteImpl/Extract_31}: 0, 42read/Read/_SDFBoundedSourceWrapper/Impulse.None/SplitAndSize0/beam:env:external:v1:0:beam:metric:pardo_execution_time:start_bundle_msecs:v1 {PTRANSFORM=ref_AppliedPTransform_split_7}: 0, 6format.None/beam:env:external:v1:0:beam:metric:pardo_execution_time:process_bundle_msecs:v1 {PTRANSFORM=ref_AppliedPTransform_write/Write/WriteImpl/Pair_25}: 0, 40write/Write/WriteImpl/DoOnce/Map(decode).None/beam:env:external:v1:1:beam:metric:pardo_execution_time:finish_bundle_msecs:v1 {PTRANSFORM=ref_AppliedPTransform_write/Write/WriteImpl/InitializeWrite_23}: 0, 46write/Write/WriteImpl/GroupByKey/GroupByWindow.None/beam:env:external:v1:0:beam:metric:pardo_execution_time:finish_bundle_msecs:v1 {PTRANSFORM=ref_AppliedPTransform_write/Write/WriteImpl/Extract_31}: 0, 6format.None/beam:env:external:v1:0:beam:metric:pardo_execution_time:finish_bundle_msecs:v1 {PTRANSFORM=ref_AppliedPTransform_write/Write/WriteImpl/Pair_25}: 0, 40write/Write/WriteImpl/DoOnce/Map(decode).None/beam:env:external:v1:2:beam:metric:pardo_execution_time:process_bundle_msecs:v1 {PTRANSFORM=ref_AppliedPTransform_write/Write/WriteImpl/FinalizeWrite_33}: 0, 40write/Write/WriteImpl/DoOnce/Map(decode).None/beam:env:external:v1:2:beam:metric:ptransform_execution_time:total_msecs:v1 {PTRANSFORM=fn/read/ref_PCollection_PCollection_12:0}: 0, 36write/Write/WriteImpl/DoOnce/Impulse.None/beam:env:external:v1:0:beam:metric:ptransform_execution_time:total_msecs:v1 {PTRANSFORM=fn/read/ref_PCollection_PCollection_10:0}: 0, 42read/Read/_SDFBoundedSourceWrapper/Impulse.None/beam:env:external:v1:0:beam:metric:pardo_execution_time:process_bundle_msecs:v1 {PTRANSFORM=fn/write/ref_PCollection_PCollection_1/SplitAndSize0:0}: 0, 6format.None/beam:env:external:v1:0:beam:metric:pardo_execution_time:start_bundle_msecs:v1 {PTRANSFORM=fn/write/ref_PCollection_PCollection_16:0}: 0, 6format.None/beam:env:external:v1:0:beam:metric:pardo_execution_time:start_bundle_msecs:v1 {PTRANSFORM=fn/read/ref_PCollection_PCollection_9:0}: 0, 40write/Write/WriteImpl/DoOnce/Map(decode).None/beam:env:external:v1:1:beam:metric:pardo_execution_time:process_bundle_msecs:v1 {PTRANSFORM=fn/write/ref_PCollection_PCollection_13:0}: 0, 42read/Read/_SDFBoundedSourceWrapper/Impulse.None/beam:env:external:v1:0:beam:metric:ptransform_execution_time:total_msecs:v1 {PTRANSFORM=fn/write/ref_PCollection_PCollection_1/SplitAndSize0:0}: 0, 6format.None/beam:env:external:v1:0:beam:metric:pardo_execution_time:finish_bundle_msecs:v1 {PTRANSFORM=fn/read/ref_PCollection_PCollection_9:0}: 0, 40write/Write/WriteImpl/DoOnce/Map(decode).None/beam:env:external:v1:2:beam:metric:pardo_execution_time:finish_bundle_msecs:v1 {PTRANSFORM=ref_AppliedPTransform_write/Write/WriteImpl/FinalizeWrite_33}: 0, 6format.None/beam:env:external:v1:0:beam:metric:pardo_execution_time:finish_bundle_msecs:v1 {PTRANSFORM=fn/write/ref_PCollection_PCollection_16:0}: 0, 6format.None/beam:env:external:v1:0:beam:metric:pardo_execution_time:process_bundle_msecs:v1 {PTRANSFORM=fn/read/ref_PCollection_PCollection_9:0}: 0, 42read/Read/_SDFBoundedSourceWrapper/Impulse.None/SplitAndSize0/beam:env:external:v1:0:beam:metric:pardo_execution_time:process_bundle_msecs:v1 {PTRANSFORM=ref_AppliedPTransform_split_7}: 0, 6format.None/beam:env:external:v1:0:beam:metric:pardo_execution_time:start_bundle_msecs:v1 {PTRANSFORM=ref_AppliedPTransform_write/Write/WriteImpl/Pair_25}: 0, 42read/Read/_SDFBoundedSourceWrapper/Impulse.None/SplitAndSize0/beam:env:external:v1:0:beam:metric:pardo_execution_time:finish_bundle_msecs:v1 {PTRANSFORM=ref_AppliedPTransform_split_7}: 0, 42read/Read/_SDFBoundedSourceWrapper/Impulse.None/beam:env:external:v1:0:beam:metric:pardo_execution_time:start_bundle_msecs:v1 {PTRANSFORM=ref_AppliedPTransform_read/Read/_SDFBoundedSourceWrapper/ParDo(SDFBoundedSourceDoFn)_6/SplitAndSize0}: 0, 40write/Write/WriteImpl/DoOnce/Map(decode).None/beam:env:external:v1:2:beam:metric:element_count:v1 {PCOLLECTION=ref_PCollection_PCollection_22}: 2, 42read/Read/_SDFBoundedSourceWrapper/Impulse.None/SplitAndSize0/beam:env:external:v1:0:beam:metric:pardo_execution_time:start_bundle_msecs:v1 {PTRANSFORM=ref_AppliedPTransform_pair_with_one_8}: 0, 19group/GroupByWindow.None/beam:env:external:v1:0:beam:metric:pardo_execution_time:start_bundle_msecs:v1 {PTRANSFORM=ref_AppliedPTransform_format_14}: 0, 36write/Write/WriteImpl/DoOnce/Impulse.None/beam:env:external:v1:0:beam:metric:pardo_execution_time:finish_bundle_msecs:v1 {PTRANSFORM=fn/write/ref_PCollection_PCollection_12:0}: 0, 19group/GroupByWindow.None/beam:env:external:v1:0:beam:metric:pardo_execution_time:start_bundle_msecs:v1 {PTRANSFORM=ref_AppliedPTransform_count_13}: 0, 19group/GroupByWindow.None/beam:env:external:v1:0:beam:metric:pardo_execution_time:process_bundle_msecs:v1 {PTRANSFORM=ref_AppliedPTransform_count_13}: 0, 40write/Write/WriteImpl/DoOnce/Map(decode).None/beam:env:external:v1:0:beam:metric:pardo_execution_time:process_bundle_msecs:v1 {PTRANSFORM=fn/write/ref_PCollection_PCollection_21:0}: 0, 42read/Read/_SDFBoundedSourceWrapper/Impulse.None/SplitAndSize0/beam:env:external:v1:0:beam:metric:pardo_execution_time:start_bundle_msecs:v1 {PTRANSFORM=fn/read/ref_PCollection_PCollection_1/SplitAndSize0:0}: 0, 42read/Read/_SDFBoundedSourceWrapper/Impulse.None/beam:env:external:v1:0:beam:metric:pardo_execution_time:finish_bundle_msecs:v1 {PTRANSFORM=ref_AppliedPTransform_read/Read/_SDFBoundedSourceWrapper/ParDo(SDFBoundedSourceDoFn)_6/SplitAndSize0}: 0, 19group/GroupByWindow.None/beam:env:external:v1:0:beam:metric:pardo_execution_time:finish_bundle_msecs:v1 {PTRANSFORM=ref_AppliedPTransform_count_13}: 0, 36write/Write/WriteImpl/DoOnce/Impulse.None/beam:env:external:v1:0:beam:metric:pardo_execution_time:start_bundle_msecs:v1 {PTRANSFORM=fn/write/ref_PCollection_PCollection_12:0}: 0, 6format.None/beam:env:external:v1:0:beam:metric:ptransform_execution_time:total_msecs:v1 {PTRANSFORM=ref_AppliedPTransform_write/Write/WriteImpl/WriteBundles_24}: 0, 42read/Read/_SDFBoundedSourceWrapper/Impulse.None/SplitAndSize0/beam:env:external:v1:0:beam:metric:pardo_execution_time:finish_bundle_msecs:v1 {PTRANSFORM=ref_AppliedPTransform_pair_with_one_8}: 0, 40write/Write/WriteImpl/DoOnce/Map(decode).None/beam:env:external:v1:0:beam:metric:ptransform_execution_time:total_msecs:v1 {PTRANSFORM=ref_AppliedPTransform_write/Write/WriteImpl/PreFinalize_32}: 0, 46write/Write/WriteImpl/GroupByKey/GroupByWindow.None/beam:env:external:v1:0:beam:metric:pardo_execution_time:process_bundle_msecs:v1 {PTRANSFORM=ref_AppliedPTransform_write/Write/WriteImpl/Extract_31}: 0, 42read/Read/_SDFBoundedSourceWrapper/Impulse.None/beam:env:external:v1:0:beam:metric:pardo_execution_time:finish_bundle_msecs:v1 {PTRANSFORM=fn/read/ref_PCollection_PCollection_1:0}: 0, 42read/Read/_SDFBoundedSourceWrapper/Impulse.None/SplitAndSize0/beam:env:external:v1:0:beam:metric:user {NAMESPACE=__main__.WordExtractingDoFn, PTRANSFORM=ref_AppliedPTransform_split_7, NAME=words}: 96, 40write/Write/WriteImpl/DoOnce/Map(decode).None/beam:env:external:v1:0:beam:metric:element_count:v1 {PCOLLECTION=ref_PCollection_PCollection_21}: 0, 36write/Write/WriteImpl/DoOnce/Impulse.None/beam:env:external:v1:0:beam:metric:element_count:v1 {PCOLLECTION=ref_PCollection_PCollection_10}: 1, 6format.None/beam:env:external:v1:0:beam:metric:ptransform_execution_time:total_msecs:v1 {PTRANSFORM=fn/write/ref_PCollection_PCollection_16:0}: 0, 36write/Write/WriteImpl/DoOnce/Impulse.None/beam:env:external:v1:0:beam:metric:element_count:v1 {PCOLLECTION=ref_PCollection_PCollection_11}: 1, 40write/Write/WriteImpl/DoOnce/Map(decode).None/beam:env:external:v1:1:beam:metric:pardo_execution_time:process_bundle_msecs:v1 {PTRANSFORM=fn/read/ref_PCollection_PCollection_12:0}: 0, 46write/Write/WriteImpl/GroupByKey/GroupByWindow.None/beam:env:external:v1:0:beam:metric:element_count:v1 {PCOLLECTION=ref_PCollection_PCollection_20}: 2, 19group/GroupByWindow.None/beam:env:external:v1:0:beam:metric:ptransform_execution_time:total_msecs:v1 {PTRANSFORM=ref_AppliedPTransform_count_13}: 0, 36write/Write/WriteImpl/DoOnce/Impulse.None/beam:env:external:v1:0:beam:metric:element_count:v1 {PCOLLECTION=ref_PCollection_PCollection_12}: 1, 40write/Write/WriteImpl/DoOnce/Map(decode).None/beam:env:external:v1:0:beam:metric:pardo_execution_time:process_bundle_msecs:v1 {PTRANSFORM=ref_AppliedPTransform_write/Write/WriteImpl/PreFinalize_32}: 0, 40write/Write/WriteImpl/DoOnce/Map(decode).None/beam:env:external:v1:1:beam:metric:pardo_execution_time:finish_bundle_msecs:v1 {PTRANSFORM=fn/write/ref_PCollection_PCollection_13:0}: 0, 6format.None/beam:env:external:v1:0:beam:metric:element_count:v1 {PCOLLECTION=ref_PCollection_PCollection_16}: 2, 6format.None/beam:env:external:v1:0:beam:metric:element_count:v1 {PCOLLECTION=ref_PCollection_PCollection_15}: 2, 19group/GroupByWindow.None/beam:env:external:v1:0:beam:metric:pardo_execution_time:start_bundle_msecs:v1 {PTRANSFORM=fn/write/ref_PCollection_PCollection_9:0}: 0, 42read/Read/_SDFBoundedSourceWrapper/Impulse.None/beam:env:external:v1:0:beam:metric:pardo_execution_time:start_bundle_msecs:v1 {PTRANSFORM=fn/read/ref_PCollection_PCollection_1:0}: 0, 40write/Write/WriteImpl/DoOnce/Map(decode).None/beam:env:external:v1:1:beam:metric:pardo_execution_time:finish_bundle_msecs:v1 {PTRANSFORM=fn/read/ref_PCollection_PCollection_12:0}: 0, 40write/Write/WriteImpl/DoOnce/Map(decode).None/beam:env:external:v1:1:beam:metric:element_count:v1 {PCOLLECTION=ref_PCollection_PCollection_13}: 1, 42read/Read/_SDFBoundedSourceWrapper/Impulse.None/beam:env:external:v1:0:beam:metric:element_count:v1 {PCOLLECTION=ref_PCollection_PCollection_1/PairWithRestriction0}: 1, 42read/Read/_SDFBoundedSourceWrapper/Impulse.None/beam:env:external:v1:0:beam:metric:pardo_execution_time:process_bundle_msecs:v1 {PTRANSFORM=fn/read/ref_PCollection_PCollection_1:0}: 0, 42read/Read/_SDFBoundedSourceWrapper/Impulse.None/SplitAndSize0/beam:env:external:v1:0:beam:metric:pardo_execution_time:process_bundle_msecs:v1 {PTRANSFORM=fn/write/ref_PCollection_PCollection_4:0}: 0, 42read/Read/_SDFBoundedSourceWrapper/Impulse.None/SplitAndSize0/beam:env:external:v1:0:beam:metric:pardo_execution_time:finish_bundle_msecs:v1 {PTRANSFORM=fn/write/ref_PCollection_PCollection_4:0}: 0, 40write/Write/WriteImpl/DoOnce/Map(decode).None/beam:env:external:v1:1:beam:metric:pardo_execution_time:start_bundle_msecs:v1 {PTRANSFORM=fn/write/ref_PCollection_PCollection_13:0}: 0, 46write/Write/WriteImpl/GroupByKey/GroupByWindow.None/beam:env:external:v1:0:beam:metric:pardo_execution_time:process_bundle_msecs:v1 {PTRANSFORM=fn/read/ref_PCollection_PCollection_19:0}: 0, 6format.None/beam:env:external:v1:0:beam:metric:element_count:v1 {PCOLLECTION=ref_PCollection_PCollection_14}: 2, 40write/Write/WriteImpl/DoOnce/Map(decode).None/beam:env:external:v1:1:beam:metric:pardo_execution_time:start_bundle_msecs:v1 {PTRANSFORM=fn/read/ref_PCollection_PCollection_12:0}: 0, 19group/GroupByWindow.None/beam:env:external:v1:0:beam:metric:pardo_execution_time:process_bundle_msecs:v1 {PTRANSFORM=fn/write/ref_PCollection_PCollection_9:0}: 0, 19group/GroupByWindow.None/beam:env:external:v1:0:beam:metric:pardo_execution_time:finish_bundle_msecs:v1 {PTRANSFORM=fn/write/ref_PCollection_PCollection_9:0}: 0, 42read/Read/_SDFBoundedSourceWrapper/Impulse.None/SplitAndSize0/beam:env:external:v1:0:beam:metric:pardo_execution_time:start_bundle_msecs:v1 {PTRANSFORM=fn/write/ref_PCollection_PCollection_4:0}: 0, 42read/Read/_SDFBoundedSourceWrapper/Impulse.None/beam:env:external:v1:0:beam:metric:pardo_execution_time:start_bundle_msecs:v1 {PTRANSFORM=fn/write/ref_PCollection_PCollection_1/SplitAndSize0:0}: 0, 6format.None/beam:env:external:v1:0:beam:metric:pardo_execution_time:process_bundle_msecs:v1 {PTRANSFORM=fn/write/ref_PCollection_PCollection_16:0}: 0, 36write/Write/WriteImpl/DoOnce/Impulse.None/beam:env:external:v1:0:beam:metric:pardo_execution_time:process_bundle_msecs:v1 {PTRANSFORM=fn/write/ref_PCollection_PCollection_12:0}: 0, 42read/Read/_SDFBoundedSourceWrapper/Impulse.None/SplitAndSize0/beam:env:external:v1:0:beam:metric:ptransform_execution_time:total_msecs:v1 {PTRANSFORM=ref_AppliedPTransform_pair_with_one_8}: 0, 42read/Read/_SDFBoundedSourceWrapper/Impulse.None/beam:env:external:v1:0:beam:metric:element_count:v1 {PTRANSFORM=ref_AppliedPTransform_read/Read/_SDFBoundedSourceWrapper/ParDo(SDFBoundedSourceDoFn)_6/PairWithRestriction0, TAG=None}: 1, 40write/Write/WriteImpl/DoOnce/Map(decode).None/beam:env:external:v1:0:beam:metric:ptransform_execution_time:total_msecs:v1 {PTRANSFORM=fn/read/ref_PCollection_PCollection_12:0}: 0, 19group/GroupByWindow.None/beam:env:external:v1:0:beam:metric:ptransform_execution_time:total_msecs:v1 {PTRANSFORM=fn/read/ref_PCollection_PCollection_7:0}: 0, 42read/Read/_SDFBoundedSourceWrapper/Impulse.None/beam:env:external:v1:0:beam:metric:element_count:v1 {PTRANSFORM=ref_AppliedPTransform_read/Read/_SDFBoundedSourceWrapper/ParDo(SDFBoundedSourceDoFn)_6/SplitAndSize0, TAG=None}: 1, 42read/Read/_SDFBoundedSourceWrapper/Impulse.None/beam:env:external:v1:0:beam:metric:pardo_execution_time:finish_bundle_msecs:v1 {PTRANSFORM=fn/write/ref_PCollection_PCollection_1/SplitAndSize0:0}: 0, 40write/Write/WriteImpl/DoOnce/Map(decode).None/beam:env:external:v1:1:beam:metric:pardo_execution_time:start_bundle_msecs:v1 {PTRANSFORM=ref_AppliedPTransform_write/Write/WriteImpl/InitializeWrite_23}: 0, 36write/Write/WriteImpl/DoOnce/Impulse.None/beam:env:external:v1:0:beam:metric:ptransform_execution_time:total_msecs:v1 {PTRANSFORM=ref_AppliedPTransform_write/Write/WriteImpl/DoOnce/FlatMap(<lambda at core.py:2646>)_20}: 0, 46write/Write/WriteImpl/GroupByKey/GroupByWindow.None/beam:env:external:v1:0:beam:metric:pardo_execution_time:start_bundle_msecs:v1 {PTRANSFORM=fn/read/ref_PCollection_PCollection_19:0}: 0, 46write/Write/WriteImpl/GroupByKey/GroupByWindow.None/beam:env:external:v1:0:beam:metric:pardo_execution_time:finish_bundle_msecs:v1 {PTRANSFORM=fn/read/ref_PCollection_PCollection_19:0}: 0, 42read/Read/_SDFBoundedSourceWrapper/Impulse.None/SplitAndSize0/beam:env:external:v1:0:beam:metric:pardo_execution_time:process_bundle_msecs:v1 {PTRANSFORM=ref_AppliedPTransform_pair_with_one_8}: 0, 40write/Write/WriteImpl/DoOnce/Map(decode).None/beam:env:external:v1:1:beam:metric:element_count:v1 {PCOLLECTION=ref_PCollection_PCollection_12}: 1, 40write/Write/WriteImpl/DoOnce/Map(decode).None/beam:env:external:v1:0:beam:metric:pardo_execution_time:start_bundle_msecs:v1 {PTRANSFORM=ref_AppliedPTransform_write/Write/WriteImpl/PreFinalize_32}: 0, 40write/Write/WriteImpl/DoOnce/Map(decode).None/beam:env:external:v1:0:beam:metric:pardo_execution_time:finish_bundle_msecs:v1 {PTRANSFORM=ref_AppliedPTransform_write/Write/WriteImpl/PreFinalize_32}: 0, 36write/Write/WriteImpl/DoOnce/Impulse.None/beam:env:external:v1:0:beam:metric:ptransform_execution_time:total_msecs:v1 {PTRANSFORM=fn/write/ref_PCollection_PCollection_12:0}: 0, 40write/Write/WriteImpl/DoOnce/Map(decode).None/beam:env:external:v1:0:beam:metric:pardo_execution_time:finish_bundle_msecs:v1 {PTRANSFORM=fn/read/ref_PCollection_PCollection_12:0}: 0, 42read/Read/_SDFBoundedSourceWrapper/Impulse.None/SplitAndSize0/beam:env:external:v1:0:beam:metric:user {NAMESPACE=__main__.WordExtractingDoFn, PTRANSFORM=ref_AppliedPTransform_split_7, NAME=empty_lines}: 2, 40write/Write/WriteImpl/DoOnce/Map(decode).None/beam:env:external:v1:1:beam:metric:ptransform_execution_time:total_msecs:v1 {PTRANSFORM=fn/write/ref_PCollection_PCollection_13:0}: 0, 46write/Write/WriteImpl/GroupByKey/GroupByWindow.None/beam:env:external:v1:0:beam:metric:element_count:v1 {PCOLLECTION=ref_PCollection_PCollection_19}: 1, 36write/Write/WriteImpl/DoOnce/Impulse.None/beam:env:external:v1:0:beam:metric:pardo_execution_time:process_bundle_msecs:v1 {PTRANSFORM=ref_AppliedPTransform_write/Write/WriteImpl/DoOnce/FlatMap(<lambda at core.py:2646>)_20}: 0, 19group/GroupByWindow.None/beam:env:external:v1:0:beam:metric:ptransform_execution_time:total_msecs:v1 {PTRANSFORM=ref_AppliedPTransform_format_14}: 0, 6format.None/beam:env:external:v1:0:beam:metric:pardo_execution_time:process_bundle_msecs:v1 {PTRANSFORM=ref_AppliedPTransform_write/Write/WriteImpl/WriteBundles_24}: 0, 36write/Write/WriteImpl/DoOnce/Impulse.None/beam:env:external:v1:0:beam:metric:pardo_execution_time:finish_bundle_msecs:v1 {PTRANSFORM=ref_AppliedPTransform_write/Write/WriteImpl/DoOnce/Map(decode)_22}: 0, 42read/Read/_SDFBoundedSourceWrapper/Impulse.None/SplitAndSize0/beam:env:external:v1:0:beam:metric:ptransform_execution_time:total_msecs:v1 {PTRANSFORM=ref_AppliedPTransform_split_7}: 0, 6format.None/beam:env:external:v1:0:beam:metric:pardo_execution_time:finish_bundle_msecs:v1 {PTRANSFORM=ref_AppliedPTransform_write/Write/WriteImpl/WriteBundles_24}: 0, 40write/Write/WriteImpl/DoOnce/Map(decode).None/beam:env:external:v1:0:beam:metric:pardo_execution_time:process_bundle_msecs:v1 {PTRANSFORM=fn/read/ref_PCollection_PCollection_12:0}: 0, 36write/Write/WriteImpl/DoOnce/Impulse.None/beam:env:external:v1:0:beam:metric:pardo_execution_time:finish_bundle_msecs:v1 {PTRANSFORM=ref_AppliedPTransform_write/Write/WriteImpl/DoOnce/FlatMap(<lambda at core.py:2646>)_20}: 0, 19group/GroupByWindow.None/beam:env:external:v1:0:beam:metric:ptransform_execution_time:total_msecs:v1 {PTRANSFORM=fn/write/ref_PCollection_PCollection_9:0}: 0, 36write/Write/WriteImpl/DoOnce/Impulse.None/beam:env:external:v1:0:beam:metric:pardo_execution_time:process_bundle_msecs:v1 {PTRANSFORM=ref_AppliedPTransform_write/Write/WriteImpl/DoOnce/Map(decode)_22}: 0, 42read/Read/_SDFBoundedSourceWrapper/Impulse.None/SplitAndSize0/beam:env:external:v1:0:beam:metric:ptransform_execution_time:total_msecs:v1 {PTRANSFORM=fn/write/ref_PCollection_PCollection_4:0}: 0, 40write/Write/WriteImpl/DoOnce/Map(decode).None/beam:env:external:v1:0:beam:metric:element_count:v1 {PCOLLECTION=ref_PCollection_PCollection_12}: 1, 19group/GroupByWindow.None/beam:env:external:v1:0:beam:metric:pardo_execution_time:process_bundle_msecs:v1 {PTRANSFORM=ref_AppliedPTransform_format_14}: 0, 42read/Read/_SDFBoundedSourceWrapper/Impulse.None/SplitAndSize0/beam:env:external:v1:0:beam:metric:pardo_execution_time:start_bundle_msecs:v1 {PTRANSFORM=ref_AppliedPTransform_read/Read/_SDFBoundedSourceWrapper/ParDo(SDFBoundedSourceDoFn)_6/ProcessSizedElementsAndRestrictions0}: 0, 42read/Read/_SDFBoundedSourceWrapper/Impulse.None/SplitAndSize0/beam:env:external:v1:0:beam:metric:user {NAMESPACE=__main__.WordExtractingDoFn, PTRANSFORM=ref_AppliedPTransform_split_7, NAME=word_lengths}: 298, 42read/Read/_SDFBoundedSourceWrapper/Impulse.None/SplitAndSize0/beam:env:external:v1:0:beam:metric:element_count:v1 {PCOLLECTION=ref_PCollection_PCollection_2}: 27, 40write/Write/WriteImpl/DoOnce/Map(decode).None/beam:env:external:v1:0:beam:metric:pardo_execution_time:start_bundle_msecs:v1 {PTRANSFORM=fn/write/ref_PCollection_PCollection_21:0}: 0, 42read/Read/_SDFBoundedSourceWrapper/Impulse.None/beam:env:external:v1:0:beam:metric:ptransform_execution_time:total_msecs:v1 {PTRANSFORM=ref_AppliedPTransform_read/Read/_SDFBoundedSourceWrapper/ParDo(SDFBoundedSourceDoFn)_6/SplitAndSize0}: 0, 6format.None/beam:env:external:v1:0:beam:metric:pardo_execution_time:start_bundle_msecs:v1 {PTRANSFORM=ref_AppliedPTransform_write/Write/WriteImpl/WriteBundles_24}: 0, 42read/Read/_SDFBoundedSourceWrapper/Impulse.None/SplitAndSize0/beam:env:external:v1:0:beam:metric:element_count:v1 {PCOLLECTION=ref_PCollection_PCollection_4}: 96, 40write/Write/WriteImpl/DoOnce/Map(decode).None/beam:env:external:v1:0:beam:metric:pardo_execution_time:finish_bundle_msecs:v1 {PTRANSFORM=fn/write/ref_PCollection_PCollection_21:0}: 0, 42read/Read/_SDFBoundedSourceWrapper/Impulse.None/beam:env:external:v1:0:beam:metric:element_count:v1 {PCOLLECTION=ref_PCollection_PCollection_1/SplitAndSize0}: 1, 6format.None/beam:env:external:v1:0:beam:metric:ptransform_execution_time:total_msecs:v1 {PTRANSFORM=ref_AppliedPTransform_write/Write/WriteImpl/Pair_25}: 0, 42read/Read/_SDFBoundedSourceWrapper/Impulse.None/SplitAndSize0/beam:env:external:v1:0:beam:metric:element_count:v1 {PCOLLECTION=ref_PCollection_PCollection_3}: 96, 6format.None/beam:env:external:v1:0:beam:metric:ptransform_execution_time:total_msecs:v1 {PTRANSFORM=fn/read/ref_PCollection_PCollection_9:0}: 0, 42read/Read/_SDFBoundedSourceWrapper/Impulse.None/beam:env:external:v1:0:beam:metric:ptransform_execution_time:total_msecs:v1 {PTRANSFORM=ref_AppliedPTransform_read/Read/_SDFBoundedSourceWrapper/ParDo(SDFBoundedSourceDoFn)_6/PairWithRestriction0}: 0, 46write/Write/WriteImpl/GroupByKey/GroupByWindow.None/beam:env:external:v1:0:beam:metric:ptransform_execution_time:total_msecs:v1 {PTRANSFORM=fn/read/ref_PCollection_PCollection_19:0}: 0, 40write/Write/WriteImpl/DoOnce/Map(decode).None/beam:env:external:v1:0:beam:metric:pardo_execution_time:start_bundle_msecs:v1 {PTRANSFORM=fn/read/ref_PCollection_PCollection_12:0}: 0, 6format.None/beam:env:external:v1:0:beam:metric:element_count:v1 {PCOLLECTION=ref_PCollection_PCollection_9}: 44, 36write/Write/WriteImpl/DoOnce/Impulse.None/beam:env:external:v1:0:beam:metric:pardo_execution_time:start_bundle_msecs:v1 {PTRANSFORM=ref_AppliedPTransform_write/Write/WriteImpl/DoOnce/FlatMap(<lambda at core.py:2646>)_20}: 0, 36write/Write/WriteImpl/DoOnce/Impulse.None/beam:env:external:v1:0:beam:metric:pardo_execution_time:start_bundle_msecs:v1 {PTRANSFORM=ref_AppliedPTransform_write/Write/WriteImpl/DoOnce/Map(decode)_22}: 0, 40write/Write/WriteImpl/DoOnce/Map(decode).None/beam:env:external:v1:2:beam:metric:ptransform_execution_time:total_msecs:v1 {PTRANSFORM=ref_AppliedPTransform_write/Write/WriteImpl/FinalizeWrite_33}: 0, 46write/Write/WriteImpl/GroupByKey/GroupByWindow.None/beam:env:external:v1:0:beam:metric:ptransform_execution_time:total_msecs:v1 {PTRANSFORM=fn/write/ref_PCollection_PCollection_20:0}: 0, 40write/Write/WriteImpl/DoOnce/Map(decode).None/beam:env:external:v1:1:beam:metric:ptransform_execution_time:total_msecs:v1 {PTRANSFORM=fn/read/ref_PCollection_PCollection_12:0}: 0)Distributions(42read/Read/_SDFBoundedSourceWrapper/Impulse.None/beam:env:external:v1:0:beam:metric:sampled_byte_size:v1 {PCOLLECTION=ref_PCollection_PCollection_1}: DistributionResult{sum=13, count=1, min=13, max=13}, 6format.None/beam:env:external:v1:0:beam:metric:sampled_byte_size:v1 {PCOLLECTION=ref_PCollection_PCollection_9}: DistributionResult{sum=805, count=38, min=19, max=25}, 42read/Read/_SDFBoundedSourceWrapper/Impulse.None/beam:env:external:v1:0:beam:metric:sampled_byte_size:v1 {PCOLLECTION=ref_PCollection_PCollection_1/PairWithRestriction0}: DistributionResult{sum=1112, count=1, min=1112, max=1112}, 40write/Write/WriteImpl/DoOnce/Map(decode).None/beam:env:external:v1:1:beam:metric:sampled_byte_size:v1 {PCOLLECTION=ref_PCollection_PCollection_12}: DistributionResult{sum=15, count=1, min=15, max=15}, 46write/Write/WriteImpl/GroupByKey/GroupByWindow.None/beam:env:external:v1:0:beam:metric:sampled_byte_size:v1 {PCOLLECTION=ref_PCollection_PCollection_19}: DistributionResult{sum=271, count=1, min=271, max=271}, 42read/Read/_SDFBoundedSourceWrapper/Impulse.None/SplitAndSize0/beam:env:external:v1:0:beam:metric:sampled_byte_size:v1 {PCOLLECTION=ref_PCollection_PCollection_1/SplitAndSize0}: DistributionResult{sum=945, count=1, min=945, max=945}, 40write/Write/WriteImpl/DoOnce/Map(decode).None/beam:env:external:v1:1:beam:metric:sampled_byte_size:v1 {PCOLLECTION=ref_PCollection_PCollection_13}: DistributionResult{sum=81, count=1, min=81, max=81}, 42read/Read/_SDFBoundedSourceWrapper/Impulse.None/beam:env:external:v1:0:beam:metric:sampled_byte_size:v1 {PTRANSFORM=ref_AppliedPTransform_read/Read/_SDFBoundedSourceWrapper/ParDo(SDFBoundedSourceDoFn)_6/SplitAndSize0, TAG=None}: DistributionResult{sum=945, count=1, min=945, max=945}, 40write/Write/WriteImpl/DoOnce/Map(decode).None/beam:env:external:v1:2:beam:metric:sampled_byte_size:v1 {PCOLLECTION=ref_PCollection_PCollection_22}: DistributionResult{sum=106, count=2, min=53, max=53}, 19group/GroupByWindow.None/beam:env:external:v1:0:beam:metric:sampled_byte_size:v1 {PCOLLECTION=ref_PCollection_PCollection_9}: DistributionResult{sum=650, count=32, min=18, max=24}, 6format.None/beam:env:external:v1:0:beam:metric:sampled_byte_size:v1 {PCOLLECTION=ref_PCollection_PCollection_15}: DistributionResult{sum=278, count=2, min=139, max=139}, 40write/Write/WriteImpl/DoOnce/Map(decode).None/beam:env:external:v1:0:beam:metric:sampled_byte_size:v1 {PCOLLECTION=ref_PCollection_PCollection_12}: DistributionResult{sum=15, count=1, min=15, max=15}, 19group/GroupByWindow.None/beam:env:external:v1:0:beam:metric:sampled_byte_size:v1 {PCOLLECTION=ref_PCollection_PCollection_8}: DistributionResult{sum=669, count=35, min=17, max=23}, 6format.None/beam:env:external:v1:0:beam:metric:sampled_byte_size:v1 {PCOLLECTION=ref_PCollection_PCollection_16}: DistributionResult{sum=278, count=2, min=139, max=139}, 19group/GroupByWindow.None/beam:env:external:v1:0:beam:metric:sampled_byte_size:v1 {PCOLLECTION=ref_PCollection_PCollection_7}: DistributionResult{sum=782, count=33, min=20, max=29}, 6format.None/beam:env:external:v1:0:beam:metric:sampled_byte_size:v1 {PCOLLECTION=ref_PCollection_PCollection_14}: DistributionResult{sum=276, count=2, min=138, max=138}, 42read/Read/_SDFBoundedSourceWrapper/Impulse.None/SplitAndSize0/beam:env:external:v1:0:beam:metric:sampled_byte_size:v1 {PCOLLECTION=ref_PCollection_PCollection_3}: DistributionResult{sum=515, count=31, min=14, max=20}, 42read/Read/_SDFBoundedSourceWrapper/Impulse.None/SplitAndSize0/beam:env:external:v1:0:beam:metric:sampled_byte_size:v1 {PCOLLECTION=ref_PCollection_PCollection_2}: DistributionResult{sum=767, count=20, min=14, max=84}, 42read/Read/_SDFBoundedSourceWrapper/Impulse.None/beam:env:external:v1:0:beam:metric:sampled_byte_size:v1 {PTRANSFORM=ref_AppliedPTransform_read/Read/_SDFBoundedSourceWrapper/ParDo(SDFBoundedSourceDoFn)_6/PairWithRestriction0, TAG=None}: DistributionResult{sum=1112, count=1, min=1112, max=1112}, 42read/Read/_SDFBoundedSourceWrapper/Impulse.None/SplitAndSize0/beam:env:external:v1:0:beam:metric:sampled_byte_size:v1 {PCOLLECTION=ref_PCollection_PCollection_4}: DistributionResult{sum=676, count=37, min=16, max=22}, 36write/Write/WriteImpl/DoOnce/Impulse.None/beam:env:external:v1:0:beam:metric:sampled_byte_size:v1 {PCOLLECTION=ref_PCollection_PCollection_10}: DistributionResult{sum=13, count=1, min=13, max=13}, 36write/Write/WriteImpl/DoOnce/Impulse.None/beam:env:external:v1:0:beam:metric:sampled_byte_size:v1 {PCOLLECTION=ref_PCollection_PCollection_11}: DistributionResult{sum=14, count=1, min=14, max=14}, 36write/Write/WriteImpl/DoOnce/Impulse.None/beam:env:external:v1:0:beam:metric:sampled_byte_size:v1 {PCOLLECTION=ref_PCollection_PCollection_12}: DistributionResult{sum=14, count=1, min=14, max=14}, 46write/Write/WriteImpl/GroupByKey/GroupByWindow.None/beam:env:external:v1:0:beam:metric:sampled_byte_size:v1 {PCOLLECTION=ref_PCollection_PCollection_20}: DistributionResult{sum=276, count=2, min=138, max=138}, 42read/Read/_SDFBoundedSourceWrapper/Impulse.None/SplitAndSize0/beam:env:external:v1:0:beam:metric:user_distribution {NAMESPACE=__main__.WordExtractingDoFn, PTRANSFORM=ref_AppliedPTransform_split_7, NAME=word_len_dist}: DistributionResult{sum=298, count=96, min=1, max=10}, 40write/Write/WriteImpl/DoOnce/Map(decode).None/beam:env:external:v1:2:beam:metric:sampled_byte_size:v1 {PCOLLECTION=ref_PCollection_PCollection_12}: DistributionResult{sum=15, count=1, min=15, max=15}, 40write/Write/WriteImpl/DoOnce/Map(decode).None/beam:env:external:v1:0:beam:metric:sampled_byte_size:v1 {PCOLLECTION=ref_PCollection_PCollection_21}: DistributionResult{sum=0, count=0, min=9223372036854775807, max=-9223372036854775808}, 42read/Read/_SDFBoundedSourceWrapper/Impulse.None/beam:env:external:v1:0:beam:metric:sampled_byte_size:v1 {PCOLLECTION=ref_PCollection_PCollection_1/SplitAndSize0}: DistributionResult{sum=945, count=1, min=945, max=945}))
[flink-runner-job-invoker] INFO org.apache.beam.runners.fnexecution.artifact.AbstractArtifactRetrievalService - Manifest at /tmp/beam-temp6k5pXF/artifacts7SF3YM/job_10e4a3bc-ac8d-415d-a914-357478e34af1/MANIFEST has 1 artifact locations
[flink-runner-job-invoker] INFO org.apache.beam.runners.fnexecution.artifact.BeamFileSystemArtifactStagingService - Removed dir /tmp/beam-temp6k5pXF/artifacts7SF3YM/job_10e4a3bc-ac8d-415d-a914-357478e34af1/
INFO:apache_beam.runners.portability.portable_runner:Job state changed to DONE
[grpc-default-executor-0] INFO org.apache.beam.runners.fnexecution.jobsubmission.InMemoryJobService - Getting job metrics for BeamApp-jenkins-0212201326-41912a37_293a8cab-6ec7-4a71-8d89-dc1607e02b5b
[grpc-default-executor-0] INFO org.apache.beam.runners.fnexecution.jobsubmission.InMemoryJobService - Finished getting job metrics for BeamApp-jenkins-0212201326-41912a37_293a8cab-6ec7-4a71-8d89-dc1607e02b5b
INFO:root:number of empty lines: 2
INFO:root:average word length: 3

> Task :sdks:python:test-suites:portable:py2:portableWordCountSparkRunnerBatch
<https://builds.apache.org/job/beam_PostCommit_Python2/ws/src/sdks/python/apache_beam/__init__.py>:82: UserWarning: You are using Apache Beam with Python 2. New releases of Apache Beam will soon support Python 3 only.
  'You are using Apache Beam with Python 2. '
INFO:apache_beam.runners.portability.fn_api_runner_transforms:==================== <function lift_combiners at 0x7fe4b5becd70> ====================
WARNING:apache_beam.utils.subprocess_server:Starting service with ['java' '-jar' '<https://builds.apache.org/job/beam_PostCommit_Python2/ws/src/runners/spark/job-server/build/libs/beam-runners-spark-job-server-2.20.0-SNAPSHOT.jar'> '--spark-master-url' 'local[4]' '--artifacts-dir' '/tmp/beam-tempEVyHen/artifacts61ZSXv' '--job-port' '35483' '--artifact-port' '0' '--expansion-port' '0']
20/02/12 20:13:53 INFO org.apache.beam.runners.fnexecution.jobsubmission.JobServerDriver: ArtifactStagingService started on localhost:34679
20/02/12 20:13:53 INFO org.apache.beam.runners.fnexecution.jobsubmission.JobServerDriver: Java ExpansionService started on localhost:33619
20/02/12 20:13:53 INFO org.apache.beam.runners.fnexecution.jobsubmission.JobServerDriver: JobService started on localhost:35483
WARNING:apache_beam.options.pipeline_options:Discarding unparseable args: ['--parallelism=2', '--shutdown_sources_on_final_watermark']
20/02/12 20:13:55 INFO org.apache.beam.runners.spark.SparkJobInvoker: Invoking job BeamApp-jenkins-0212201355-144dbd6e_c937fef5-1a2f-42c6-a123-baedcd49d9de
20/02/12 20:13:55 INFO org.apache.beam.runners.fnexecution.jobsubmission.JobInvocation: Starting job invocation BeamApp-jenkins-0212201355-144dbd6e_c937fef5-1a2f-42c6-a123-baedcd49d9de
INFO:root:Waiting until the pipeline has finished because the environment "LOOPBACK" has started a component necessary for the execution.
INFO:apache_beam.runners.portability.portable_runner:Job state changed to STOPPED
INFO:apache_beam.runners.portability.portable_runner:Job state changed to STARTING
INFO:apache_beam.runners.portability.portable_runner:Job state changed to RUNNING
20/02/12 20:13:56 INFO org.apache.beam.runners.spark.SparkPipelineRunner: PipelineOptions.filesToStage was not specified. Defaulting to files from the classpath
20/02/12 20:13:56 INFO org.apache.beam.runners.spark.SparkPipelineRunner: Will stage 1 files. (Enable logging at DEBUG level to see which files will be staged.)
20/02/12 20:13:56 INFO org.apache.beam.runners.spark.translation.SparkContextFactory: Creating a brand new Spark Context.
20/02/12 20:13:56 WARN org.apache.hadoop.util.NativeCodeLoader: Unable to load native-hadoop library for your platform... using builtin-java classes where applicable
20/02/12 20:13:57 INFO org.apache.beam.runners.spark.SparkPipelineRunner: Running job BeamApp-jenkins-0212201355-144dbd6e_c937fef5-1a2f-42c6-a123-baedcd49d9de on Spark master local[4]
20/02/12 20:13:57 INFO org.apache.beam.runners.spark.aggregators.AggregatorsAccumulator: Instantiated aggregators accumulator: 
20/02/12 20:13:57 INFO org.apache.beam.runners.spark.metrics.MetricsAccumulator: Instantiated metrics accumulator: MetricQueryResults()
INFO:apache_beam.runners.worker.statecache:Creating state cache with size 0
INFO:apache_beam.runners.worker.sdk_worker:Creating insecure control channel for localhost:45457.
INFO:apache_beam.runners.worker.sdk_worker:Control channel established.
INFO:apache_beam.runners.worker.sdk_worker:Initializing SDKHarness with unbounded number of workers.
20/02/12 20:13:59 INFO org.apache.beam.runners.fnexecution.control.FnApiControlClientPoolService: Beam Fn Control client connected with id 1-1
INFO:apache_beam.runners.worker.sdk_worker:Creating insecure state channel for localhost:36853.
INFO:apache_beam.runners.worker.sdk_worker:State channel established.
INFO:apache_beam.runners.worker.data_plane:Creating client data channel for localhost:41749
20/02/12 20:14:00 INFO org.apache.beam.runners.fnexecution.data.GrpcDataService: Beam Fn Data client connected.
20/02/12 20:14:00 WARN org.apache.beam.runners.spark.translation.GroupNonMergingWindowsFunctions: Either coder LengthPrefixCoder(ByteArrayCoder) or GlobalWindow$Coder is not consistent with equals. That might cause issues on some runners.
WARNING:apache_beam.io.filebasedsink:Deleting 4 existing files in target path matching: -*-of-%(num_shards)05d
20/02/12 20:14:10 INFO org.apache.beam.runners.spark.SparkPipelineRunner: Job BeamApp-jenkins-0212201355-144dbd6e_c937fef5-1a2f-42c6-a123-baedcd49d9de: Pipeline translated successfully. Computing outputs
INFO:apache_beam.io.filebasedsink:Starting finalize_write threads with num_shards: 4 (skipped: 0), batches: 4, num_threads: 4
INFO:apache_beam.io.filebasedsink:Renamed 4 shards in 0.12 seconds.
20/02/12 20:14:18 INFO org.apache.beam.runners.spark.SparkPipelineRunner: Job BeamApp-jenkins-0212201355-144dbd6e_c937fef5-1a2f-42c6-a123-baedcd49d9de finished.
20/02/12 20:14:18 INFO org.apache.beam.runners.fnexecution.artifact.AbstractArtifactRetrievalService: Manifest at /tmp/beam-tempEVyHen/artifacts61ZSXv/job_8135215b-8300-4579-a59e-31652818b40a/MANIFEST has 1 artifact locations
20/02/12 20:14:18 INFO org.apache.beam.runners.fnexecution.artifact.BeamFileSystemArtifactStagingService: Removed dir /tmp/beam-tempEVyHen/artifacts61ZSXv/job_8135215b-8300-4579-a59e-31652818b40a/
INFO:apache_beam.runners.portability.portable_runner:Job state changed to DONE
20/02/12 20:14:18 INFO org.apache.beam.runners.fnexecution.jobsubmission.InMemoryJobService: Getting job metrics for BeamApp-jenkins-0212201355-144dbd6e_c937fef5-1a2f-42c6-a123-baedcd49d9de
20/02/12 20:14:18 INFO org.apache.beam.runners.fnexecution.jobsubmission.InMemoryJobService: Finished getting job metrics for BeamApp-jenkins-0212201355-144dbd6e_c937fef5-1a2f-42c6-a123-baedcd49d9de
INFO:root:number of empty lines: 2
INFO:root:average word length: 3
Exception in thread read_state:
Traceback (most recent call last):
  File "/usr/lib/python2.7/threading.py", line 801, in __bootstrap_inner
    self.run()
  File "/usr/lib/python2.7/threading.py", line 754, in run
    self.__target(*self.__args, **self.__kwargs)
  File "<https://builds.apache.org/job/beam_PostCommit_Python2/ws/src/sdks/python/apache_beam/runners/worker/sdk_worker.py",> line 675, in pull_responses
    for response in responses:
  File "<https://builds.apache.org/job/beam_PostCommit_Python2/ws/src/build/gradleenv/1866363813/local/lib/python2.7/site-packages/grpc/_channel.py",> line 413, in next
    return self._next()
  File "<https://builds.apache.org/job/beam_PostCommit_Python2/ws/src/build/gradleenv/1866363813/local/lib/python2.7/site-packages/grpc/_channel.py",> line 706, in _next
    raise self
_MultiThreadedRendezvous: <_MultiThreadedRendezvous of RPC that terminated with:
	status = StatusCode.UNAVAILABLE
	details = "Socket closed"
	debug_error_string = "{"created":"@1581538459.268831667","description":"Error received from peer ipv4:127.0.0.1:36853","file":"src/core/lib/surface/call.cc","file_line":1056,"grpc_message":"Socket closed","grpc_status":14}"
>

ERROR:apache_beam.runners.worker.data_plane:Failed to read inputs in the data plane.
Traceback (most recent call last):
  File "<https://builds.apache.org/job/beam_PostCommit_Python2/ws/src/sdks/python/apache_beam/runners/worker/data_plane.py",> line 419, in _read_inputs
    for elements in elements_iterator:
  File "<https://builds.apache.org/job/beam_PostCommit_Python2/ws/src/build/gradleenv/1866363813/local/lib/python2.7/site-packages/grpc/_channel.py",> line 413, in next
    return self._next()
  File "<https://builds.apache.org/job/beam_PostCommit_Python2/ws/src/build/gradleenv/1866363813/local/lib/python2.7/site-packages/grpc/_channel.py",> line 706, in _next
    raise self
_MultiThreadedRendezvous: <_MultiThreadedRendezvous of RPC that terminated with:
	status = StatusCode.UNAVAILABLE
	details = "Socket closed"
	debug_error_string = "{"created":"@1581538459.268793224","description":"Error received from peer ipv4:127.0.0.1:41749","file":"src/core/lib/surface/call.cc","file_line":1056,"grpc_message":"Socket closed","grpc_status":14}"
>
Exception in thread read_grpc_client_inputs:
Traceback (most recent call last):
  File "/usr/lib/python2.7/threading.py", line 801, in __bootstrap_inner
    self.run()
  File "/usr/lib/python2.7/threading.py", line 754, in run
    self.__target(*self.__args, **self.__kwargs)
  File "<https://builds.apache.org/job/beam_PostCommit_Python2/ws/src/sdks/python/apache_beam/runners/worker/data_plane.py",> line 434, in <lambda>
    target=lambda: self._read_inputs(elements_iterator),
  File "<https://builds.apache.org/job/beam_PostCommit_Python2/ws/src/sdks/python/apache_beam/runners/worker/data_plane.py",> line 419, in _read_inputs
    for elements in elements_iterator:
  File "<https://builds.apache.org/job/beam_PostCommit_Python2/ws/src/build/gradleenv/1866363813/local/lib/python2.7/site-packages/grpc/_channel.py",> line 413, in next
    return self._next()
  File "<https://builds.apache.org/job/beam_PostCommit_Python2/ws/src/build/gradleenv/1866363813/local/lib/python2.7/site-packages/grpc/_channel.py",> line 706, in _next
    raise self
_MultiThreadedRendezvous: <_MultiThreadedRendezvous of RPC that terminated with:
	status = StatusCode.UNAVAILABLE
	details = "Socket closed"
	debug_error_string = "{"created":"@1581538459.268793224","description":"Error received from peer ipv4:127.0.0.1:41749","file":"src/core/lib/surface/call.cc","file_line":1056,"grpc_message":"Socket closed","grpc_status":14}"
>

Exception in thread run_worker_1-1:
Traceback (most recent call last):
  File "/usr/lib/python2.7/threading.py", line 801, in __bootstrap_inner
    self.run()
  File "/usr/lib/python2.7/threading.py", line 754, in run
    self.__target(*self.__args, **self.__kwargs)
  File "<https://builds.apache.org/job/beam_PostCommit_Python2/ws/src/sdks/python/apache_beam/runners/worker/sdk_worker.py",> line 153, in run
    for work_request in control_stub.Control(get_responses()):
  File "<https://builds.apache.org/job/beam_PostCommit_Python2/ws/src/build/gradleenv/1866363813/local/lib/python2.7/site-packages/grpc/_channel.py",> line 413, in next
    return self._next()
  File "<https://builds.apache.org/job/beam_PostCommit_Python2/ws/src/build/gradleenv/1866363813/local/lib/python2.7/site-packages/grpc/_channel.py",> line 706, in _next
    raise self
_MultiThreadedRendezvous: <_MultiThreadedRendezvous of RPC that terminated with:
	status = StatusCode.UNAVAILABLE
	details = "Socket closed"
	debug_error_string = "{"created":"@1581538459.268846998","description":"Error received from peer ipv4:127.0.0.1:45457","file":"src/core/lib/surface/call.cc","file_line":1056,"grpc_message":"Socket closed","grpc_status":14}"
>


> Task :sdks:python:test-suites:portable:py2:postCommitPy2

> Task :sdks:python:test-suites:dataflow:py2:postCommitIT
test_leader_board_it (apache_beam.examples.complete.game.leader_board_it_test.LeaderBoardIT) ... ok
test_datastore_write_limit (apache_beam.io.gcp.datastore.v1new.datastore_write_it_test.DatastoreWriteIT) ... SKIP: GCP dependencies are not installed
<https://builds.apache.org/job/beam_PostCommit_Python2/ws/src/sdks/python/apache_beam/io/gcp/big_query_query_to_table_pipeline.py>:87: FutureWarning: _ReadFromBigQuery is experimental.
  kms_key=kms_key)
<https://builds.apache.org/job/beam_PostCommit_Python2/ws/src/sdks/python/apache_beam/runners/dataflow/dataflow_runner.py>:787: BeamDeprecationWarning: BigQuerySink is deprecated since 2.11.0. Use WriteToBigQuery instead.
  kms_key=transform.kms_key))
test_game_stats_it (apache_beam.examples.complete.game.game_stats_it_test.GameStatsIT) ... ok
<https://builds.apache.org/job/beam_PostCommit_Python2/ws/src/sdks/python/apache_beam/io/gcp/bigquery_file_loads.py>:793: BeamDeprecationWarning: options is deprecated since First stable release. References to <pipeline>.options will not be supported
  temp_location = p.options.view_as(GoogleCloudOptions).temp_location
test_streaming_wordcount_it (apache_beam.examples.streaming_wordcount_it_test.StreamingWordCountIT) ... ok
<https://builds.apache.org/job/beam_PostCommit_Python2/ws/src/sdks/python/apache_beam/io/gcp/bigquery_io_read_pipeline.py>:84: FutureWarning: _ReadFromBigQuery is experimental.
  (options.view_as(GoogleCloudOptions).project, known_args.input_table))
<https://builds.apache.org/job/beam_PostCommit_Python2/ws/src/sdks/python/apache_beam/io/gcp/bigquery.py>:1655: BeamDeprecationWarning: options is deprecated since First stable release. References to <pipeline>.options will not be supported
  temp_location = pcoll.pipeline.options.view_as(
test_wordcount_fnapi_it (apache_beam.examples.wordcount_it_test.WordCountIT) ... ok
<https://builds.apache.org/job/beam_PostCommit_Python2/ws/src/sdks/python/apache_beam/io/gcp/bigquery_read_it_test.py>:275: FutureWarning: _ReadFromBigQuery is experimental.
  query=self.query, use_standard_sql=True, project=self.project))
<https://builds.apache.org/job/beam_PostCommit_Python2/ws/src/sdks/python/apache_beam/io/gcp/bigquery.py>:1655: BeamDeprecationWarning: options is deprecated since First stable release. References to <pipeline>.options will not be supported
  temp_location = pcoll.pipeline.options.view_as(
test_wordcount_it (apache_beam.examples.wordcount_it_test.WordCountIT) ... ok
<https://builds.apache.org/job/beam_PostCommit_Python2/ws/src/sdks/python/apache_beam/io/gcp/bigquery_read_it_test.py>:162: FutureWarning: _ReadFromBigQuery is experimental.
  query=self.query, use_standard_sql=True, project=self.project))
<https://builds.apache.org/job/beam_PostCommit_Python2/ws/src/sdks/python/apache_beam/io/gcp/bigquery.py>:1655: BeamDeprecationWarning: options is deprecated since First stable release. References to <pipeline>.options will not be supported
  temp_location = pcoll.pipeline.options.view_as(
test_avro_it (apache_beam.examples.fastavro_it_test.FastavroIT) ... ok
<https://builds.apache.org/job/beam_PostCommit_Python2/ws/src/sdks/python/apache_beam/io/gcp/bigquery_test.py>:823: BeamDeprecationWarning: options is deprecated since First stable release. References to <pipeline>.options will not be supported
  streaming = self.test_pipeline.options.view_as(StandardOptions).streaming
<https://builds.apache.org/job/beam_PostCommit_Python2/ws/src/sdks/python/apache_beam/io/gcp/bigquery.py>:1466: BeamDeprecationWarning: options is deprecated since First stable release. References to <pipeline>.options will not be supported
  experiments = p.options.view_as(DebugOptions).experiments or []
test_user_score_it (apache_beam.examples.complete.game.user_score_it_test.UserScoreIT) ... ok
<https://builds.apache.org/job/beam_PostCommit_Python2/ws/src/sdks/python/apache_beam/io/gcp/bigquery.py>:1466: BeamDeprecationWarning: options is deprecated since First stable release. References to <pipeline>.options will not be supported
  experiments = p.options.view_as(DebugOptions).experiments or []
<https://builds.apache.org/job/beam_PostCommit_Python2/ws/src/sdks/python/apache_beam/io/gcp/bigquery_file_loads.py>:793: BeamDeprecationWarning: options is deprecated since First stable release. References to <pipeline>.options will not be supported
  temp_location = p.options.view_as(GoogleCloudOptions).temp_location
test_hourly_team_score_it (apache_beam.examples.complete.game.hourly_team_score_it_test.HourlyTeamScoreIT) ... ok
<https://builds.apache.org/job/beam_PostCommit_Python2/ws/src/sdks/python/apache_beam/io/gcp/bigquery.py>:1463: BeamDeprecationWarning: options is deprecated since First stable release. References to <pipeline>.options will not be supported
  self.table_reference.projectId = pcoll.pipeline.options.view_as(
test_multiple_destinations_transform (apache_beam.io.gcp.bigquery_test.BigQueryStreamingInsertTransformIntegrationTests) ... ok
<https://builds.apache.org/job/beam_PostCommit_Python2/ws/src/sdks/python/apache_beam/runners/dataflow/dataflow_runner.py>:787: BeamDeprecationWarning: BigQuerySink is deprecated since 2.11.0. Use WriteToBigQuery instead.
  kms_key=transform.kms_key))
<https://builds.apache.org/job/beam_PostCommit_Python2/ws/src/sdks/python/apache_beam/io/gcp/big_query_query_to_table_pipeline.py>:95: BeamDeprecationWarning: BigQuerySink is deprecated since 2.11.0. Use WriteToBigQuery instead.
  kms_key=kms_key))
test_value_provider_transform (apache_beam.io.gcp.bigquery_test.BigQueryStreamingInsertTransformIntegrationTests) ... ok
test_iobase_source (apache_beam.io.gcp.bigquery_read_it_test.ReadNewTypesTests) ... ok
test_native_source (apache_beam.io.gcp.bigquery_read_it_test.ReadNewTypesTests) ... ok
test_bigquery_read_1M_python (apache_beam.io.gcp.bigquery_io_read_it_test.BigqueryIOReadIT) ... ok
test_bigquery_read_custom_1M_python (apache_beam.io.gcp.bigquery_io_read_it_test.BigqueryIOReadIT) ... ok
test_copy (apache_beam.io.gcp.gcsio_integration_test.GcsIOIntegrationTest) ... ok
test_copy_batch (apache_beam.io.gcp.gcsio_integration_test.GcsIOIntegrationTest) ... ok
test_copy_batch_kms (apache_beam.io.gcp.gcsio_integration_test.GcsIOIntegrationTest) ... ok
test_copy_batch_rewrite_token (apache_beam.io.gcp.gcsio_integration_test.GcsIOIntegrationTest) ... ok
test_copy_kms (apache_beam.io.gcp.gcsio_integration_test.GcsIOIntegrationTest) ... ok
test_copy_rewrite_token (apache_beam.io.gcp.gcsio_integration_test.GcsIOIntegrationTest) ... ok
<https://builds.apache.org/job/beam_PostCommit_Python2/ws/src/sdks/python/apache_beam/io/fileio_test.py>:303: FutureWarning: MatchAll is experimental.
  | 'GetPath' >> beam.Map(lambda metadata: metadata.path))
test_iobase_source (apache_beam.io.gcp.bigquery_read_it_test.ReadTests) ... ok
test_native_source (apache_beam.io.gcp.bigquery_read_it_test.ReadTests) ... ok
<https://builds.apache.org/job/beam_PostCommit_Python2/ws/src/sdks/python/apache_beam/io/fileio_test.py>:316: FutureWarning: MatchAll is experimental.
  | 'Checksums' >> beam.Map(compute_hash))
<https://builds.apache.org/job/beam_PostCommit_Python2/ws/src/sdks/python/apache_beam/io/fileio_test.py>:316: FutureWarning: ReadMatches is experimental.
  | 'Checksums' >> beam.Map(compute_hash))
test_bqfl_streaming (apache_beam.io.gcp.bigquery_file_loads_test.BigQueryFileLoadsIT) ... SKIP: TestStream is not supported on TestDataflowRunner
test_multiple_destinations_transform (apache_beam.io.gcp.bigquery_file_loads_test.BigQueryFileLoadsIT) ... ok
test_one_job_fails_all_jobs_fail (apache_beam.io.gcp.bigquery_file_loads_test.BigQueryFileLoadsIT) ... ok
test_transform_on_gcs (apache_beam.io.fileio_test.MatchIntegrationTest) ... ok
test_parquetio_it (apache_beam.io.parquetio_it_test.TestParquetIT) ... ok
test_file_loads (apache_beam.io.gcp.bigquery_test.PubSubBigQueryIT) ... SKIP: https://issuetracker.google.com/issues/118375066
test_streaming_inserts (apache_beam.io.gcp.bigquery_test.PubSubBigQueryIT) ... ok
test_basic_execution (apache_beam.testing.test_stream_it_test.TestStreamIntegrationTests) ... SKIP: The "TestDataflowRunner", does not support the TestStream transform. Supported runners: ['DirectRunner', 'SwitchingDirectRunner']
Tests that the TestStream supports emitting to multiple PCollections. ... SKIP: The "TestDataflowRunner", does not support the TestStream transform. Supported runners: ['DirectRunner', 'SwitchingDirectRunner']
Tests that the TestStream can independently control output watermarks. ... SKIP: The "TestDataflowRunner", does not support the TestStream transform. Supported runners: ['DirectRunner', 'SwitchingDirectRunner']
test_streaming_data_only (apache_beam.io.gcp.pubsub_integration_test.PubSubIntegrationTest) ... ok
test_streaming_with_attributes (apache_beam.io.gcp.pubsub_integration_test.PubSubIntegrationTest) ... ok
test_job_python_from_python_it (apache_beam.transforms.external_test_it.ExternalTransformIT) ... ok
test_metrics_fnapi_it (apache_beam.runners.dataflow.dataflow_exercise_metrics_pipeline_test.ExerciseMetricsPipelineTest) ... ok
test_metrics_it (apache_beam.runners.dataflow.dataflow_exercise_metrics_pipeline_test.ExerciseMetricsPipelineTest) ... ok
Runs streaming Dataflow job and verifies that user metrics are reported ... ok
test_big_query_legacy_sql (apache_beam.io.gcp.big_query_query_to_table_it_test.BigQueryQueryToTableIT) ... ok
test_big_query_new_types (apache_beam.io.gcp.big_query_query_to_table_it_test.BigQueryQueryToTableIT) ... ok
test_big_query_new_types_native (apache_beam.io.gcp.big_query_query_to_table_it_test.BigQueryQueryToTableIT) ... ok
test_big_query_standard_sql (apache_beam.io.gcp.big_query_query_to_table_it_test.BigQueryQueryToTableIT) ... ok
test_big_query_standard_sql_kms_key_native (apache_beam.io.gcp.big_query_query_to_table_it_test.BigQueryQueryToTableIT) ... ok
test_big_query_write (apache_beam.io.gcp.bigquery_write_it_test.BigQueryWriteIntegrationTests) ... ok
test_big_query_write_new_types (apache_beam.io.gcp.bigquery_write_it_test.BigQueryWriteIntegrationTests) ... ok
test_big_query_write_schema_autodetect (apache_beam.io.gcp.bigquery_write_it_test.BigQueryWriteIntegrationTests) ... SKIP: DataflowRunner does not support schema autodetection
test_big_query_write_without_schema (apache_beam.io.gcp.bigquery_write_it_test.BigQueryWriteIntegrationTests) ... ok
test_datastore_write_limit (apache_beam.io.gcp.datastore_write_it_test.DatastoreWriteIT) ... ok

----------------------------------------------------------------------
XML: nosetests-postCommitIT-df.xml
----------------------------------------------------------------------
XML: <https://builds.apache.org/job/beam_PostCommit_Python2/ws/src/sdks/python/nosetests.xml>
----------------------------------------------------------------------
Ran 52 tests in 3352.940s

OK (SKIP=7)

FAILURE: Build failed with an exception.

* Where:
Build file '<https://builds.apache.org/job/beam_PostCommit_Python2/ws/src/sdks/python/test-suites/direct/py2/build.gradle'> line: 101

* What went wrong:
Execution failed for task ':sdks:python:test-suites:direct:py2:mongodbioIT'.
> Process 'command 'sh'' finished with non-zero exit value 125

* Try:
Run with --stacktrace option to get the stack trace. Run with --info or --debug option to get more log output. Run with --scan to get full insights.

* Get more help at https://help.gradle.org

Deprecated Gradle features were used in this build, making it incompatible with Gradle 6.0.
Use '--warning-mode all' to show the individual deprecation warnings.
See https://docs.gradle.org/5.2.1/userguide/command_line_interface.html#sec:command_line_warnings

BUILD FAILED in 57m 47s
124 actionable tasks: 98 executed, 23 from cache, 3 up-to-date

Publishing build scan...
https://gradle.com/s/2dsndk5avlhco

Build step 'Invoke Gradle script' changed build result to FAILURE
Build step 'Invoke Gradle script' marked build as failure

---------------------------------------------------------------------
To unsubscribe, e-mail: builds-unsubscribe@beam.apache.org
For additional commands, e-mail: builds-help@beam.apache.org