You are viewing a plain text version of this content. The canonical link for it is here.
Posted to dev@hive.apache.org by Apache Jenkins Server <je...@builds.apache.org> on 2012/11/16 17:11:32 UTC

Hive-trunk-h0.21 - Build # 1801 - Still Failing

Changes for Build #1764
[kevinwilfong] HIVE-3610. Add a command "Explain dependency ..." (Sambavi Muthukrishnan via kevinwilfong)


Changes for Build #1765

Changes for Build #1766
[hashutosh] HIVE-3441 : testcases escape1,escape2 fail on windows (Thejas Nair via Ashutosh Chauhan)

[kevinwilfong] HIVE-3499. add tests to use bucketing metadata for partitions. (njain via kevinwilfong)


Changes for Build #1767
[kevinwilfong] HIVE-3276. optimize union sub-queries. (njain via kevinwilfong)


Changes for Build #1768

Changes for Build #1769

Changes for Build #1770
[namit] HIVE-3570 Add/fix facility to collect operator specific statisticsin hive + add hash-in/hash-out
counter for GroupBy Optr (Satadru Pan via namit)

[namit] HIVE-3554 Hive List Bucketing - Query logic
(Gang Tim Liu via namit)

[cws] HIVE-3563. Drop database cascade fails when there are indexes on any tables (Prasad Mujumdar via cws)


Changes for Build #1771
[kevinwilfong] HIVE-3640. Reducer allocation is incorrect if enforce bucketing and mapred.reduce.tasks are both set. (Vighnesh Avadhani via kevinwilfong)


Changes for Build #1772

Changes for Build #1773

Changes for Build #1774

Changes for Build #1775
[namit] HIVE-3673 Sort merge join not used when join columns have different names
(Kevin Wilfong via namit)


Changes for Build #1776
[kevinwilfong] HIVE-3627. eclipse misses library: javolution-@javolution-version@.jar. (Gang Tim Liu via kevinwilfong)


Changes for Build #1777
[kevinwilfong] HIVE-3524. Storing certain Exception objects thrown in HiveMetaStore.java in MetaStoreEndFunctionContext. (Maheshwaran Srinivasan via kevinwilfong)

[cws] HIVE-1977. DESCRIBE TABLE syntax doesn't support specifying a database qualified table name (Zhenxiao Luo via cws)

[cws] HIVE-3674. Test case TestParse broken after recent checkin (Sambavi Muthukrishnan via cws)


Changes for Build #1778
[cws] HIVE-1362. Column level scalar valued statistics on Tables and Partitions (Shreepadma Venugopalan via cws)


Changes for Build #1779

Changes for Build #1780
[kevinwilfong] HIVE-3686. Fix compile errors introduced by the interaction of HIVE-1362 and HIVE-3524. (Shreepadma Venugopalan via kevinwilfong)


Changes for Build #1781
[namit] HIVE-3687 smb_mapjoin_13.q is nondeterministic
(Kevin Wilfong via namit)


Changes for Build #1782
[hashutosh] HIVE-2715: Upgrade Thrift dependency to 0.9.0 (Ashutosh Chauhan)


Changes for Build #1783
[kevinwilfong] HIVE-3654. block relative path access in hive. (njain via kevinwilfong)

[hashutosh] HIVE-3658 : Unable to generate the Hbase related unit tests using velocity templates on Windows (Kanna Karanam via Ashutosh Chauhan)

[hashutosh] HIVE-3661 : Remove the Windows specific = related swizzle path changes from Proxy FileSystems (Kanna Karanam via Ashutosh Chauhan)

[hashutosh] HIVE-3480 : <Resource leak>: Fix the file handle leaks in Symbolic & Symlink related input formats. (Kanna Karanam via Ashutosh Chauhan)


Changes for Build #1784
[kevinwilfong] HIVE-3675. NaN does not work correctly for round(n). (njain via kevinwilfong)

[cws] HIVE-3651. bucketmapjoin?.q tests fail with hadoop 0.23 (Prasad Mujumdar via cws)


Changes for Build #1785
[namit] HIVE-3613 Implement grouping_id function
(Ian Gorbachev via namit)

[namit] HIVE-3692 Update parallel test documentation
(Ivan Gorbachev via namit)

[namit] HIVE-3649 Hive List Bucketing - enhance DDL to specify list bucketing table
(Gang Tim Liu via namit)


Changes for Build #1786
[namit] HIVE-3696 Revert HIVE-3483 which causes performance regression
(Gang Tim Liu via namit)


Changes for Build #1787
[kevinwilfong] HIVE-3621. Make prompt in Hive CLI configurable. (Jingwei Lu via kevinwilfong)

[kevinwilfong] HIVE-3695. TestParse breaks due to HIVE-3675. (njain via kevinwilfong)


Changes for Build #1788
[kevinwilfong] HIVE-3557. Access to external URLs in hivetest.py. (Ivan Gorbachev via kevinwilfong)


Changes for Build #1789
[hashutosh] HIVE-3662 : TestHiveServer: testScratchDirShouldClearWhileStartup is failing on Windows (Kanna Karanam via Ashutosh Chauhan)

[hashutosh] HIVE-3659 : TestHiveHistory::testQueryloglocParentDirNotExist Test fails on Windows because of some resource leaks in ZK (Kanna Karanam via Ashutosh Chauhan)

[hashutosh] HIVE-3663 Unable to display the MR Job file path on Windows in case of MR job failures.  (Kanna Karanam via Ashutosh Chauhan)


Changes for Build #1790

Changes for Build #1791

Changes for Build #1792

Changes for Build #1793
[hashutosh] HIVE-3704 : name of some metastore scripts are not per convention (Ashutosh Chauhan)


Changes for Build #1794
[hashutosh] HIVE-3243 : ignore white space between entries of hive/hbase table mapping (Shengsheng Huang via Ashutosh Chauhan)

[hashutosh] HIVE-3215 : JobDebugger should use RunningJob.getTrackingURL (Bhushan Mandhani via Ashutosh Chauhan)


Changes for Build #1795
[cws] HIVE-3437. 0.23 compatibility: fix unit tests when building against 0.23 (Chris Drome via cws)

[hashutosh] HIVE-3626 : RetryingHMSHandler should wrap JDOException inside MetaException (Bhushan Mandhani via Ashutosh Chauhan)

[hashutosh] HIVE-3560 : Hive always prints a warning message when using remote metastore (Travis Crawford via Ashutosh Chauhan)


Changes for Build #1796

Changes for Build #1797
[hashutosh] HIVE-3664 : Avoid to create a symlink for hive-contrib.jar file in dist\lib folder. (Kanna Karanam via Ashutosh Chauhan)


Changes for Build #1798
[namit] HIVE-3706 getBoolVar in FileSinkOperator can be optimized
(Kevin Wilfong via namit)

[namit] HIVE-3707 Round map/reduce progress down when it is in the range [99.5, 100)
(Kevin Wilfong via namit)

[namit] HIVE-3471 Implement grouping sets in hive
(Ivan Gorbachev via namit)


Changes for Build #1799
[hashutosh] HIVE-3291 : fix fs resolvers (Ashish Singh via Ashutosh Chauhan)

[hashutosh] HIVE-3680 : Include Table information in Hive's AddPartitionEvent. (Mithun Radhakrishnan via Ashutosh Chauhan)


Changes for Build #1800
[hashutosh] HIVE-3520 : ivysettings.xml does not let you override .m2/repository (Raja Aluri via Ashutosh Chauhan)

[hashutosh] HIVE-3435 : Get pdk pluginTest passed when triggered from both builtin tests and pdk tests on hadoop23  (Zhenxiao Luo via Ashutosh Chauhan)


Changes for Build #1801



No tests ran.

The Apache Jenkins build system has built Hive-trunk-h0.21 (build #1801)

Status: Still Failing

Check console output at https://builds.apache.org/job/Hive-trunk-h0.21/1801/ to view the results.

Hive-trunk-h0.21 - Build # 1805 - Still Failing

Posted by Apache Jenkins Server <je...@builds.apache.org>.
Changes for Build #1764
[kevinwilfong] HIVE-3610. Add a command "Explain dependency ..." (Sambavi Muthukrishnan via kevinwilfong)


Changes for Build #1765

Changes for Build #1766
[hashutosh] HIVE-3441 : testcases escape1,escape2 fail on windows (Thejas Nair via Ashutosh Chauhan)

[kevinwilfong] HIVE-3499. add tests to use bucketing metadata for partitions. (njain via kevinwilfong)


Changes for Build #1767
[kevinwilfong] HIVE-3276. optimize union sub-queries. (njain via kevinwilfong)


Changes for Build #1768

Changes for Build #1769

Changes for Build #1770
[namit] HIVE-3570 Add/fix facility to collect operator specific statisticsin hive + add hash-in/hash-out
counter for GroupBy Optr (Satadru Pan via namit)

[namit] HIVE-3554 Hive List Bucketing - Query logic
(Gang Tim Liu via namit)

[cws] HIVE-3563. Drop database cascade fails when there are indexes on any tables (Prasad Mujumdar via cws)


Changes for Build #1771
[kevinwilfong] HIVE-3640. Reducer allocation is incorrect if enforce bucketing and mapred.reduce.tasks are both set. (Vighnesh Avadhani via kevinwilfong)


Changes for Build #1772

Changes for Build #1773

Changes for Build #1774

Changes for Build #1775
[namit] HIVE-3673 Sort merge join not used when join columns have different names
(Kevin Wilfong via namit)


Changes for Build #1776
[kevinwilfong] HIVE-3627. eclipse misses library: javolution-@javolution-version@.jar. (Gang Tim Liu via kevinwilfong)


Changes for Build #1777
[kevinwilfong] HIVE-3524. Storing certain Exception objects thrown in HiveMetaStore.java in MetaStoreEndFunctionContext. (Maheshwaran Srinivasan via kevinwilfong)

[cws] HIVE-1977. DESCRIBE TABLE syntax doesn't support specifying a database qualified table name (Zhenxiao Luo via cws)

[cws] HIVE-3674. Test case TestParse broken after recent checkin (Sambavi Muthukrishnan via cws)


Changes for Build #1778
[cws] HIVE-1362. Column level scalar valued statistics on Tables and Partitions (Shreepadma Venugopalan via cws)


Changes for Build #1779

Changes for Build #1780
[kevinwilfong] HIVE-3686. Fix compile errors introduced by the interaction of HIVE-1362 and HIVE-3524. (Shreepadma Venugopalan via kevinwilfong)


Changes for Build #1781
[namit] HIVE-3687 smb_mapjoin_13.q is nondeterministic
(Kevin Wilfong via namit)


Changes for Build #1782
[hashutosh] HIVE-2715: Upgrade Thrift dependency to 0.9.0 (Ashutosh Chauhan)


Changes for Build #1783
[kevinwilfong] HIVE-3654. block relative path access in hive. (njain via kevinwilfong)

[hashutosh] HIVE-3658 : Unable to generate the Hbase related unit tests using velocity templates on Windows (Kanna Karanam via Ashutosh Chauhan)

[hashutosh] HIVE-3661 : Remove the Windows specific = related swizzle path changes from Proxy FileSystems (Kanna Karanam via Ashutosh Chauhan)

[hashutosh] HIVE-3480 : <Resource leak>: Fix the file handle leaks in Symbolic & Symlink related input formats. (Kanna Karanam via Ashutosh Chauhan)


Changes for Build #1784
[kevinwilfong] HIVE-3675. NaN does not work correctly for round(n). (njain via kevinwilfong)

[cws] HIVE-3651. bucketmapjoin?.q tests fail with hadoop 0.23 (Prasad Mujumdar via cws)


Changes for Build #1785
[namit] HIVE-3613 Implement grouping_id function
(Ian Gorbachev via namit)

[namit] HIVE-3692 Update parallel test documentation
(Ivan Gorbachev via namit)

[namit] HIVE-3649 Hive List Bucketing - enhance DDL to specify list bucketing table
(Gang Tim Liu via namit)


Changes for Build #1786
[namit] HIVE-3696 Revert HIVE-3483 which causes performance regression
(Gang Tim Liu via namit)


Changes for Build #1787
[kevinwilfong] HIVE-3621. Make prompt in Hive CLI configurable. (Jingwei Lu via kevinwilfong)

[kevinwilfong] HIVE-3695. TestParse breaks due to HIVE-3675. (njain via kevinwilfong)


Changes for Build #1788
[kevinwilfong] HIVE-3557. Access to external URLs in hivetest.py. (Ivan Gorbachev via kevinwilfong)


Changes for Build #1789
[hashutosh] HIVE-3662 : TestHiveServer: testScratchDirShouldClearWhileStartup is failing on Windows (Kanna Karanam via Ashutosh Chauhan)

[hashutosh] HIVE-3659 : TestHiveHistory::testQueryloglocParentDirNotExist Test fails on Windows because of some resource leaks in ZK (Kanna Karanam via Ashutosh Chauhan)

[hashutosh] HIVE-3663 Unable to display the MR Job file path on Windows in case of MR job failures.  (Kanna Karanam via Ashutosh Chauhan)


Changes for Build #1790

Changes for Build #1791

Changes for Build #1792

Changes for Build #1793
[hashutosh] HIVE-3704 : name of some metastore scripts are not per convention (Ashutosh Chauhan)


Changes for Build #1794
[hashutosh] HIVE-3243 : ignore white space between entries of hive/hbase table mapping (Shengsheng Huang via Ashutosh Chauhan)

[hashutosh] HIVE-3215 : JobDebugger should use RunningJob.getTrackingURL (Bhushan Mandhani via Ashutosh Chauhan)


Changes for Build #1795
[cws] HIVE-3437. 0.23 compatibility: fix unit tests when building against 0.23 (Chris Drome via cws)

[hashutosh] HIVE-3626 : RetryingHMSHandler should wrap JDOException inside MetaException (Bhushan Mandhani via Ashutosh Chauhan)

[hashutosh] HIVE-3560 : Hive always prints a warning message when using remote metastore (Travis Crawford via Ashutosh Chauhan)


Changes for Build #1796

Changes for Build #1797
[hashutosh] HIVE-3664 : Avoid to create a symlink for hive-contrib.jar file in dist\lib folder. (Kanna Karanam via Ashutosh Chauhan)


Changes for Build #1798
[namit] HIVE-3706 getBoolVar in FileSinkOperator can be optimized
(Kevin Wilfong via namit)

[namit] HIVE-3707 Round map/reduce progress down when it is in the range [99.5, 100)
(Kevin Wilfong via namit)

[namit] HIVE-3471 Implement grouping sets in hive
(Ivan Gorbachev via namit)


Changes for Build #1799
[hashutosh] HIVE-3291 : fix fs resolvers (Ashish Singh via Ashutosh Chauhan)

[hashutosh] HIVE-3680 : Include Table information in Hive's AddPartitionEvent. (Mithun Radhakrishnan via Ashutosh Chauhan)


Changes for Build #1800
[hashutosh] HIVE-3520 : ivysettings.xml does not let you override .m2/repository (Raja Aluri via Ashutosh Chauhan)

[hashutosh] HIVE-3435 : Get pdk pluginTest passed when triggered from both builtin tests and pdk tests on hadoop23  (Zhenxiao Luo via Ashutosh Chauhan)


Changes for Build #1801

Changes for Build #1802

Changes for Build #1803

Changes for Build #1804

Changes for Build #1805



1 tests failed.
REGRESSION:  org.apache.hadoop.hive.cli.TestCliDriver.testCliDriver_insert1

Error Message:
Unexpected exception See build/ql/tmp/hive.log, or try "ant test ... -Dtest.silent=false" to get more logs.

Stack Trace:
junit.framework.AssertionFailedError: Unexpected exception
See build/ql/tmp/hive.log, or try "ant test ... -Dtest.silent=false" to get more logs.
	at junit.framework.Assert.fail(Assert.java:47)
	at org.apache.hadoop.hive.cli.TestCliDriver.testCliDriver_insert1(TestCliDriver.java:22574)
	at sun.reflect.NativeMethodAccessorImpl.invoke0(Native Method)
	at sun.reflect.NativeMethodAccessorImpl.invoke(NativeMethodAccessorImpl.java:39)
	at sun.reflect.DelegatingMethodAccessorImpl.invoke(DelegatingMethodAccessorImpl.java:25)
	at java.lang.reflect.Method.invoke(Method.java:597)
	at junit.framework.TestCase.runTest(TestCase.java:168)
	at junit.framework.TestCase.runBare(TestCase.java:134)
	at junit.framework.TestResult$1.protect(TestResult.java:110)
	at junit.framework.TestResult.runProtected(TestResult.java:128)
	at junit.framework.TestResult.run(TestResult.java:113)
	at junit.framework.TestCase.run(TestCase.java:124)
	at junit.framework.TestSuite.runTest(TestSuite.java:232)
	at junit.framework.TestSuite.run(TestSuite.java:227)
	at org.apache.tools.ant.taskdefs.optional.junit.JUnitTestRunner.run(JUnitTestRunner.java:422)
	at org.apache.tools.ant.taskdefs.optional.junit.JUnitTestRunner.launch(JUnitTestRunner.java:931)
	at org.apache.tools.ant.taskdefs.optional.junit.JUnitTestRunner.main(JUnitTestRunner.java:785)




The Apache Jenkins build system has built Hive-trunk-h0.21 (build #1805)

Status: Still Failing

Check console output at https://builds.apache.org/job/Hive-trunk-h0.21/1805/ to view the results.

Hive-trunk-h0.21 - Build # 1804 - Still Failing

Posted by Apache Jenkins Server <je...@builds.apache.org>.
Changes for Build #1764
[kevinwilfong] HIVE-3610. Add a command "Explain dependency ..." (Sambavi Muthukrishnan via kevinwilfong)


Changes for Build #1765

Changes for Build #1766
[hashutosh] HIVE-3441 : testcases escape1,escape2 fail on windows (Thejas Nair via Ashutosh Chauhan)

[kevinwilfong] HIVE-3499. add tests to use bucketing metadata for partitions. (njain via kevinwilfong)


Changes for Build #1767
[kevinwilfong] HIVE-3276. optimize union sub-queries. (njain via kevinwilfong)


Changes for Build #1768

Changes for Build #1769

Changes for Build #1770
[namit] HIVE-3570 Add/fix facility to collect operator specific statisticsin hive + add hash-in/hash-out
counter for GroupBy Optr (Satadru Pan via namit)

[namit] HIVE-3554 Hive List Bucketing - Query logic
(Gang Tim Liu via namit)

[cws] HIVE-3563. Drop database cascade fails when there are indexes on any tables (Prasad Mujumdar via cws)


Changes for Build #1771
[kevinwilfong] HIVE-3640. Reducer allocation is incorrect if enforce bucketing and mapred.reduce.tasks are both set. (Vighnesh Avadhani via kevinwilfong)


Changes for Build #1772

Changes for Build #1773

Changes for Build #1774

Changes for Build #1775
[namit] HIVE-3673 Sort merge join not used when join columns have different names
(Kevin Wilfong via namit)


Changes for Build #1776
[kevinwilfong] HIVE-3627. eclipse misses library: javolution-@javolution-version@.jar. (Gang Tim Liu via kevinwilfong)


Changes for Build #1777
[kevinwilfong] HIVE-3524. Storing certain Exception objects thrown in HiveMetaStore.java in MetaStoreEndFunctionContext. (Maheshwaran Srinivasan via kevinwilfong)

[cws] HIVE-1977. DESCRIBE TABLE syntax doesn't support specifying a database qualified table name (Zhenxiao Luo via cws)

[cws] HIVE-3674. Test case TestParse broken after recent checkin (Sambavi Muthukrishnan via cws)


Changes for Build #1778
[cws] HIVE-1362. Column level scalar valued statistics on Tables and Partitions (Shreepadma Venugopalan via cws)


Changes for Build #1779

Changes for Build #1780
[kevinwilfong] HIVE-3686. Fix compile errors introduced by the interaction of HIVE-1362 and HIVE-3524. (Shreepadma Venugopalan via kevinwilfong)


Changes for Build #1781
[namit] HIVE-3687 smb_mapjoin_13.q is nondeterministic
(Kevin Wilfong via namit)


Changes for Build #1782
[hashutosh] HIVE-2715: Upgrade Thrift dependency to 0.9.0 (Ashutosh Chauhan)


Changes for Build #1783
[kevinwilfong] HIVE-3654. block relative path access in hive. (njain via kevinwilfong)

[hashutosh] HIVE-3658 : Unable to generate the Hbase related unit tests using velocity templates on Windows (Kanna Karanam via Ashutosh Chauhan)

[hashutosh] HIVE-3661 : Remove the Windows specific = related swizzle path changes from Proxy FileSystems (Kanna Karanam via Ashutosh Chauhan)

[hashutosh] HIVE-3480 : <Resource leak>: Fix the file handle leaks in Symbolic & Symlink related input formats. (Kanna Karanam via Ashutosh Chauhan)


Changes for Build #1784
[kevinwilfong] HIVE-3675. NaN does not work correctly for round(n). (njain via kevinwilfong)

[cws] HIVE-3651. bucketmapjoin?.q tests fail with hadoop 0.23 (Prasad Mujumdar via cws)


Changes for Build #1785
[namit] HIVE-3613 Implement grouping_id function
(Ian Gorbachev via namit)

[namit] HIVE-3692 Update parallel test documentation
(Ivan Gorbachev via namit)

[namit] HIVE-3649 Hive List Bucketing - enhance DDL to specify list bucketing table
(Gang Tim Liu via namit)


Changes for Build #1786
[namit] HIVE-3696 Revert HIVE-3483 which causes performance regression
(Gang Tim Liu via namit)


Changes for Build #1787
[kevinwilfong] HIVE-3621. Make prompt in Hive CLI configurable. (Jingwei Lu via kevinwilfong)

[kevinwilfong] HIVE-3695. TestParse breaks due to HIVE-3675. (njain via kevinwilfong)


Changes for Build #1788
[kevinwilfong] HIVE-3557. Access to external URLs in hivetest.py. (Ivan Gorbachev via kevinwilfong)


Changes for Build #1789
[hashutosh] HIVE-3662 : TestHiveServer: testScratchDirShouldClearWhileStartup is failing on Windows (Kanna Karanam via Ashutosh Chauhan)

[hashutosh] HIVE-3659 : TestHiveHistory::testQueryloglocParentDirNotExist Test fails on Windows because of some resource leaks in ZK (Kanna Karanam via Ashutosh Chauhan)

[hashutosh] HIVE-3663 Unable to display the MR Job file path on Windows in case of MR job failures.  (Kanna Karanam via Ashutosh Chauhan)


Changes for Build #1790

Changes for Build #1791

Changes for Build #1792

Changes for Build #1793
[hashutosh] HIVE-3704 : name of some metastore scripts are not per convention (Ashutosh Chauhan)


Changes for Build #1794
[hashutosh] HIVE-3243 : ignore white space between entries of hive/hbase table mapping (Shengsheng Huang via Ashutosh Chauhan)

[hashutosh] HIVE-3215 : JobDebugger should use RunningJob.getTrackingURL (Bhushan Mandhani via Ashutosh Chauhan)


Changes for Build #1795
[cws] HIVE-3437. 0.23 compatibility: fix unit tests when building against 0.23 (Chris Drome via cws)

[hashutosh] HIVE-3626 : RetryingHMSHandler should wrap JDOException inside MetaException (Bhushan Mandhani via Ashutosh Chauhan)

[hashutosh] HIVE-3560 : Hive always prints a warning message when using remote metastore (Travis Crawford via Ashutosh Chauhan)


Changes for Build #1796

Changes for Build #1797
[hashutosh] HIVE-3664 : Avoid to create a symlink for hive-contrib.jar file in dist\lib folder. (Kanna Karanam via Ashutosh Chauhan)


Changes for Build #1798
[namit] HIVE-3706 getBoolVar in FileSinkOperator can be optimized
(Kevin Wilfong via namit)

[namit] HIVE-3707 Round map/reduce progress down when it is in the range [99.5, 100)
(Kevin Wilfong via namit)

[namit] HIVE-3471 Implement grouping sets in hive
(Ivan Gorbachev via namit)


Changes for Build #1799
[hashutosh] HIVE-3291 : fix fs resolvers (Ashish Singh via Ashutosh Chauhan)

[hashutosh] HIVE-3680 : Include Table information in Hive's AddPartitionEvent. (Mithun Radhakrishnan via Ashutosh Chauhan)


Changes for Build #1800
[hashutosh] HIVE-3520 : ivysettings.xml does not let you override .m2/repository (Raja Aluri via Ashutosh Chauhan)

[hashutosh] HIVE-3435 : Get pdk pluginTest passed when triggered from both builtin tests and pdk tests on hadoop23  (Zhenxiao Luo via Ashutosh Chauhan)


Changes for Build #1801

Changes for Build #1802

Changes for Build #1803

Changes for Build #1804



3 tests failed.
REGRESSION:  org.apache.hadoop.hive.metastore.TestMetaStoreEndFunctionListener.testEndFunctionListener

Error Message:
-1

Stack Trace:
java.lang.ArrayIndexOutOfBoundsException: -1
	at java.util.ArrayList.get(ArrayList.java:324)
	at org.apache.hadoop.hive.metastore.TestMetaStoreEndFunctionListener.testEndFunctionListener(TestMetaStoreEndFunctionListener.java:99)
	at sun.reflect.NativeMethodAccessorImpl.invoke0(Native Method)
	at sun.reflect.NativeMethodAccessorImpl.invoke(NativeMethodAccessorImpl.java:39)
	at sun.reflect.DelegatingMethodAccessorImpl.invoke(DelegatingMethodAccessorImpl.java:25)
	at java.lang.reflect.Method.invoke(Method.java:597)
	at junit.framework.TestCase.runTest(TestCase.java:168)
	at junit.framework.TestCase.runBare(TestCase.java:134)
	at junit.framework.TestResult$1.protect(TestResult.java:110)
	at junit.framework.TestResult.runProtected(TestResult.java:128)
	at junit.framework.TestResult.run(TestResult.java:113)
	at junit.framework.TestCase.run(TestCase.java:124)
	at junit.framework.TestSuite.runTest(TestSuite.java:232)
	at junit.framework.TestSuite.run(TestSuite.java:227)
	at org.apache.tools.ant.taskdefs.optional.junit.JUnitTestRunner.run(JUnitTestRunner.java:518)
	at org.apache.tools.ant.taskdefs.optional.junit.JUnitTestRunner.launch(JUnitTestRunner.java:1052)
	at org.apache.tools.ant.taskdefs.optional.junit.JUnitTestRunner.main(JUnitTestRunner.java:906)


REGRESSION:  org.apache.hadoop.hive.metastore.TestMetaStoreEventListener.testListener

Error Message:
null

Stack Trace:
org.apache.thrift.transport.TTransportException
	at org.apache.thrift.transport.TIOStreamTransport.read(TIOStreamTransport.java:132)
	at org.apache.thrift.transport.TTransport.readAll(TTransport.java:84)
	at org.apache.thrift.protocol.TBinaryProtocol.readAll(TBinaryProtocol.java:378)
	at org.apache.thrift.protocol.TBinaryProtocol.readI32(TBinaryProtocol.java:297)
	at org.apache.thrift.protocol.TBinaryProtocol.readMessageBegin(TBinaryProtocol.java:204)
	at org.apache.thrift.TServiceClient.receiveBase(TServiceClient.java:69)
	at org.apache.hadoop.hive.metastore.api.ThriftHiveMetastore$Client.recv_get_database(ThriftHiveMetastore.java:412)
	at org.apache.hadoop.hive.metastore.api.ThriftHiveMetastore$Client.get_database(ThriftHiveMetastore.java:399)
	at org.apache.hadoop.hive.metastore.HiveMetaStoreClient.getDatabase(HiveMetaStoreClient.java:715)
	at org.apache.hadoop.hive.metastore.TestMetaStoreEventListener.testListener(TestMetaStoreEventListener.java:208)
	at sun.reflect.NativeMethodAccessorImpl.invoke0(Native Method)
	at sun.reflect.NativeMethodAccessorImpl.invoke(NativeMethodAccessorImpl.java:39)
	at sun.reflect.DelegatingMethodAccessorImpl.invoke(DelegatingMethodAccessorImpl.java:25)
	at java.lang.reflect.Method.invoke(Method.java:597)
	at junit.framework.TestCase.runTest(TestCase.java:168)
	at junit.framework.TestCase.runBare(TestCase.java:134)
	at junit.framework.TestResult$1.protect(TestResult.java:110)
	at junit.framework.TestResult.runProtected(TestResult.java:128)
	at junit.framework.TestResult.run(TestResult.java:113)
	at junit.framework.TestCase.run(TestCase.java:124)
	at junit.framework.TestSuite.runTest(TestSuite.java:232)
	at junit.framework.TestSuite.run(TestSuite.java:227)
	at org.apache.tools.ant.taskdefs.optional.junit.JUnitTestRunner.run(JUnitTestRunner.java:518)
	at org.apache.tools.ant.taskdefs.optional.junit.JUnitTestRunner.launch(JUnitTestRunner.java:1052)
	at org.apache.tools.ant.taskdefs.optional.junit.JUnitTestRunner.main(JUnitTestRunner.java:906)


FAILED:  org.apache.hadoop.hive.cli.TestNegativeCliDriver.testNegativeCliDriver_stats_aggregator_error_1

Error Message:
Forked Java VM exited abnormally. Please note the time in the report does not reflect the time until the VM exit.

Stack Trace:
junit.framework.AssertionFailedError: Forked Java VM exited abnormally. Please note the time in the report does not reflect the time until the VM exit.
	at net.sf.antcontrib.logic.ForTask.doSequentialIteration(ForTask.java:259)
	at net.sf.antcontrib.logic.ForTask.doToken(ForTask.java:268)
	at net.sf.antcontrib.logic.ForTask.doTheTasks(ForTask.java:324)
	at net.sf.antcontrib.logic.ForTask.execute(ForTask.java:244)




The Apache Jenkins build system has built Hive-trunk-h0.21 (build #1804)

Status: Still Failing

Check console output at https://builds.apache.org/job/Hive-trunk-h0.21/1804/ to view the results.

Hive-trunk-h0.21 - Build # 1803 - Still Failing

Posted by Apache Jenkins Server <je...@builds.apache.org>.
Changes for Build #1764
[kevinwilfong] HIVE-3610. Add a command "Explain dependency ..." (Sambavi Muthukrishnan via kevinwilfong)


Changes for Build #1765

Changes for Build #1766
[hashutosh] HIVE-3441 : testcases escape1,escape2 fail on windows (Thejas Nair via Ashutosh Chauhan)

[kevinwilfong] HIVE-3499. add tests to use bucketing metadata for partitions. (njain via kevinwilfong)


Changes for Build #1767
[kevinwilfong] HIVE-3276. optimize union sub-queries. (njain via kevinwilfong)


Changes for Build #1768

Changes for Build #1769

Changes for Build #1770
[namit] HIVE-3570 Add/fix facility to collect operator specific statisticsin hive + add hash-in/hash-out
counter for GroupBy Optr (Satadru Pan via namit)

[namit] HIVE-3554 Hive List Bucketing - Query logic
(Gang Tim Liu via namit)

[cws] HIVE-3563. Drop database cascade fails when there are indexes on any tables (Prasad Mujumdar via cws)


Changes for Build #1771
[kevinwilfong] HIVE-3640. Reducer allocation is incorrect if enforce bucketing and mapred.reduce.tasks are both set. (Vighnesh Avadhani via kevinwilfong)


Changes for Build #1772

Changes for Build #1773

Changes for Build #1774

Changes for Build #1775
[namit] HIVE-3673 Sort merge join not used when join columns have different names
(Kevin Wilfong via namit)


Changes for Build #1776
[kevinwilfong] HIVE-3627. eclipse misses library: javolution-@javolution-version@.jar. (Gang Tim Liu via kevinwilfong)


Changes for Build #1777
[kevinwilfong] HIVE-3524. Storing certain Exception objects thrown in HiveMetaStore.java in MetaStoreEndFunctionContext. (Maheshwaran Srinivasan via kevinwilfong)

[cws] HIVE-1977. DESCRIBE TABLE syntax doesn't support specifying a database qualified table name (Zhenxiao Luo via cws)

[cws] HIVE-3674. Test case TestParse broken after recent checkin (Sambavi Muthukrishnan via cws)


Changes for Build #1778
[cws] HIVE-1362. Column level scalar valued statistics on Tables and Partitions (Shreepadma Venugopalan via cws)


Changes for Build #1779

Changes for Build #1780
[kevinwilfong] HIVE-3686. Fix compile errors introduced by the interaction of HIVE-1362 and HIVE-3524. (Shreepadma Venugopalan via kevinwilfong)


Changes for Build #1781
[namit] HIVE-3687 smb_mapjoin_13.q is nondeterministic
(Kevin Wilfong via namit)


Changes for Build #1782
[hashutosh] HIVE-2715: Upgrade Thrift dependency to 0.9.0 (Ashutosh Chauhan)


Changes for Build #1783
[kevinwilfong] HIVE-3654. block relative path access in hive. (njain via kevinwilfong)

[hashutosh] HIVE-3658 : Unable to generate the Hbase related unit tests using velocity templates on Windows (Kanna Karanam via Ashutosh Chauhan)

[hashutosh] HIVE-3661 : Remove the Windows specific = related swizzle path changes from Proxy FileSystems (Kanna Karanam via Ashutosh Chauhan)

[hashutosh] HIVE-3480 : <Resource leak>: Fix the file handle leaks in Symbolic & Symlink related input formats. (Kanna Karanam via Ashutosh Chauhan)


Changes for Build #1784
[kevinwilfong] HIVE-3675. NaN does not work correctly for round(n). (njain via kevinwilfong)

[cws] HIVE-3651. bucketmapjoin?.q tests fail with hadoop 0.23 (Prasad Mujumdar via cws)


Changes for Build #1785
[namit] HIVE-3613 Implement grouping_id function
(Ian Gorbachev via namit)

[namit] HIVE-3692 Update parallel test documentation
(Ivan Gorbachev via namit)

[namit] HIVE-3649 Hive List Bucketing - enhance DDL to specify list bucketing table
(Gang Tim Liu via namit)


Changes for Build #1786
[namit] HIVE-3696 Revert HIVE-3483 which causes performance regression
(Gang Tim Liu via namit)


Changes for Build #1787
[kevinwilfong] HIVE-3621. Make prompt in Hive CLI configurable. (Jingwei Lu via kevinwilfong)

[kevinwilfong] HIVE-3695. TestParse breaks due to HIVE-3675. (njain via kevinwilfong)


Changes for Build #1788
[kevinwilfong] HIVE-3557. Access to external URLs in hivetest.py. (Ivan Gorbachev via kevinwilfong)


Changes for Build #1789
[hashutosh] HIVE-3662 : TestHiveServer: testScratchDirShouldClearWhileStartup is failing on Windows (Kanna Karanam via Ashutosh Chauhan)

[hashutosh] HIVE-3659 : TestHiveHistory::testQueryloglocParentDirNotExist Test fails on Windows because of some resource leaks in ZK (Kanna Karanam via Ashutosh Chauhan)

[hashutosh] HIVE-3663 Unable to display the MR Job file path on Windows in case of MR job failures.  (Kanna Karanam via Ashutosh Chauhan)


Changes for Build #1790

Changes for Build #1791

Changes for Build #1792

Changes for Build #1793
[hashutosh] HIVE-3704 : name of some metastore scripts are not per convention (Ashutosh Chauhan)


Changes for Build #1794
[hashutosh] HIVE-3243 : ignore white space between entries of hive/hbase table mapping (Shengsheng Huang via Ashutosh Chauhan)

[hashutosh] HIVE-3215 : JobDebugger should use RunningJob.getTrackingURL (Bhushan Mandhani via Ashutosh Chauhan)


Changes for Build #1795
[cws] HIVE-3437. 0.23 compatibility: fix unit tests when building against 0.23 (Chris Drome via cws)

[hashutosh] HIVE-3626 : RetryingHMSHandler should wrap JDOException inside MetaException (Bhushan Mandhani via Ashutosh Chauhan)

[hashutosh] HIVE-3560 : Hive always prints a warning message when using remote metastore (Travis Crawford via Ashutosh Chauhan)


Changes for Build #1796

Changes for Build #1797
[hashutosh] HIVE-3664 : Avoid to create a symlink for hive-contrib.jar file in dist\lib folder. (Kanna Karanam via Ashutosh Chauhan)


Changes for Build #1798
[namit] HIVE-3706 getBoolVar in FileSinkOperator can be optimized
(Kevin Wilfong via namit)

[namit] HIVE-3707 Round map/reduce progress down when it is in the range [99.5, 100)
(Kevin Wilfong via namit)

[namit] HIVE-3471 Implement grouping sets in hive
(Ivan Gorbachev via namit)


Changes for Build #1799
[hashutosh] HIVE-3291 : fix fs resolvers (Ashish Singh via Ashutosh Chauhan)

[hashutosh] HIVE-3680 : Include Table information in Hive's AddPartitionEvent. (Mithun Radhakrishnan via Ashutosh Chauhan)


Changes for Build #1800
[hashutosh] HIVE-3520 : ivysettings.xml does not let you override .m2/repository (Raja Aluri via Ashutosh Chauhan)

[hashutosh] HIVE-3435 : Get pdk pluginTest passed when triggered from both builtin tests and pdk tests on hadoop23  (Zhenxiao Luo via Ashutosh Chauhan)


Changes for Build #1801

Changes for Build #1802

Changes for Build #1803



1 tests failed.
FAILED:  org.apache.hadoop.hive.cli.TestNegativeCliDriver.testNegativeCliDriver_stats_aggregator_error_1

Error Message:
Forked Java VM exited abnormally. Please note the time in the report does not reflect the time until the VM exit.

Stack Trace:
junit.framework.AssertionFailedError: Forked Java VM exited abnormally. Please note the time in the report does not reflect the time until the VM exit.
	at net.sf.antcontrib.logic.ForTask.doSequentialIteration(ForTask.java:259)
	at net.sf.antcontrib.logic.ForTask.doToken(ForTask.java:268)
	at net.sf.antcontrib.logic.ForTask.doTheTasks(ForTask.java:324)
	at net.sf.antcontrib.logic.ForTask.execute(ForTask.java:244)




The Apache Jenkins build system has built Hive-trunk-h0.21 (build #1803)

Status: Still Failing

Check console output at https://builds.apache.org/job/Hive-trunk-h0.21/1803/ to view the results.

Hive-trunk-h0.21 - Build # 1802 - Still Failing

Posted by Apache Jenkins Server <je...@builds.apache.org>.
Changes for Build #1764
[kevinwilfong] HIVE-3610. Add a command "Explain dependency ..." (Sambavi Muthukrishnan via kevinwilfong)


Changes for Build #1765

Changes for Build #1766
[hashutosh] HIVE-3441 : testcases escape1,escape2 fail on windows (Thejas Nair via Ashutosh Chauhan)

[kevinwilfong] HIVE-3499. add tests to use bucketing metadata for partitions. (njain via kevinwilfong)


Changes for Build #1767
[kevinwilfong] HIVE-3276. optimize union sub-queries. (njain via kevinwilfong)


Changes for Build #1768

Changes for Build #1769

Changes for Build #1770
[namit] HIVE-3570 Add/fix facility to collect operator specific statisticsin hive + add hash-in/hash-out
counter for GroupBy Optr (Satadru Pan via namit)

[namit] HIVE-3554 Hive List Bucketing - Query logic
(Gang Tim Liu via namit)

[cws] HIVE-3563. Drop database cascade fails when there are indexes on any tables (Prasad Mujumdar via cws)


Changes for Build #1771
[kevinwilfong] HIVE-3640. Reducer allocation is incorrect if enforce bucketing and mapred.reduce.tasks are both set. (Vighnesh Avadhani via kevinwilfong)


Changes for Build #1772

Changes for Build #1773

Changes for Build #1774

Changes for Build #1775
[namit] HIVE-3673 Sort merge join not used when join columns have different names
(Kevin Wilfong via namit)


Changes for Build #1776
[kevinwilfong] HIVE-3627. eclipse misses library: javolution-@javolution-version@.jar. (Gang Tim Liu via kevinwilfong)


Changes for Build #1777
[kevinwilfong] HIVE-3524. Storing certain Exception objects thrown in HiveMetaStore.java in MetaStoreEndFunctionContext. (Maheshwaran Srinivasan via kevinwilfong)

[cws] HIVE-1977. DESCRIBE TABLE syntax doesn't support specifying a database qualified table name (Zhenxiao Luo via cws)

[cws] HIVE-3674. Test case TestParse broken after recent checkin (Sambavi Muthukrishnan via cws)


Changes for Build #1778
[cws] HIVE-1362. Column level scalar valued statistics on Tables and Partitions (Shreepadma Venugopalan via cws)


Changes for Build #1779

Changes for Build #1780
[kevinwilfong] HIVE-3686. Fix compile errors introduced by the interaction of HIVE-1362 and HIVE-3524. (Shreepadma Venugopalan via kevinwilfong)


Changes for Build #1781
[namit] HIVE-3687 smb_mapjoin_13.q is nondeterministic
(Kevin Wilfong via namit)


Changes for Build #1782
[hashutosh] HIVE-2715: Upgrade Thrift dependency to 0.9.0 (Ashutosh Chauhan)


Changes for Build #1783
[kevinwilfong] HIVE-3654. block relative path access in hive. (njain via kevinwilfong)

[hashutosh] HIVE-3658 : Unable to generate the Hbase related unit tests using velocity templates on Windows (Kanna Karanam via Ashutosh Chauhan)

[hashutosh] HIVE-3661 : Remove the Windows specific = related swizzle path changes from Proxy FileSystems (Kanna Karanam via Ashutosh Chauhan)

[hashutosh] HIVE-3480 : <Resource leak>: Fix the file handle leaks in Symbolic & Symlink related input formats. (Kanna Karanam via Ashutosh Chauhan)


Changes for Build #1784
[kevinwilfong] HIVE-3675. NaN does not work correctly for round(n). (njain via kevinwilfong)

[cws] HIVE-3651. bucketmapjoin?.q tests fail with hadoop 0.23 (Prasad Mujumdar via cws)


Changes for Build #1785
[namit] HIVE-3613 Implement grouping_id function
(Ian Gorbachev via namit)

[namit] HIVE-3692 Update parallel test documentation
(Ivan Gorbachev via namit)

[namit] HIVE-3649 Hive List Bucketing - enhance DDL to specify list bucketing table
(Gang Tim Liu via namit)


Changes for Build #1786
[namit] HIVE-3696 Revert HIVE-3483 which causes performance regression
(Gang Tim Liu via namit)


Changes for Build #1787
[kevinwilfong] HIVE-3621. Make prompt in Hive CLI configurable. (Jingwei Lu via kevinwilfong)

[kevinwilfong] HIVE-3695. TestParse breaks due to HIVE-3675. (njain via kevinwilfong)


Changes for Build #1788
[kevinwilfong] HIVE-3557. Access to external URLs in hivetest.py. (Ivan Gorbachev via kevinwilfong)


Changes for Build #1789
[hashutosh] HIVE-3662 : TestHiveServer: testScratchDirShouldClearWhileStartup is failing on Windows (Kanna Karanam via Ashutosh Chauhan)

[hashutosh] HIVE-3659 : TestHiveHistory::testQueryloglocParentDirNotExist Test fails on Windows because of some resource leaks in ZK (Kanna Karanam via Ashutosh Chauhan)

[hashutosh] HIVE-3663 Unable to display the MR Job file path on Windows in case of MR job failures.  (Kanna Karanam via Ashutosh Chauhan)


Changes for Build #1790

Changes for Build #1791

Changes for Build #1792

Changes for Build #1793
[hashutosh] HIVE-3704 : name of some metastore scripts are not per convention (Ashutosh Chauhan)


Changes for Build #1794
[hashutosh] HIVE-3243 : ignore white space between entries of hive/hbase table mapping (Shengsheng Huang via Ashutosh Chauhan)

[hashutosh] HIVE-3215 : JobDebugger should use RunningJob.getTrackingURL (Bhushan Mandhani via Ashutosh Chauhan)


Changes for Build #1795
[cws] HIVE-3437. 0.23 compatibility: fix unit tests when building against 0.23 (Chris Drome via cws)

[hashutosh] HIVE-3626 : RetryingHMSHandler should wrap JDOException inside MetaException (Bhushan Mandhani via Ashutosh Chauhan)

[hashutosh] HIVE-3560 : Hive always prints a warning message when using remote metastore (Travis Crawford via Ashutosh Chauhan)


Changes for Build #1796

Changes for Build #1797
[hashutosh] HIVE-3664 : Avoid to create a symlink for hive-contrib.jar file in dist\lib folder. (Kanna Karanam via Ashutosh Chauhan)


Changes for Build #1798
[namit] HIVE-3706 getBoolVar in FileSinkOperator can be optimized
(Kevin Wilfong via namit)

[namit] HIVE-3707 Round map/reduce progress down when it is in the range [99.5, 100)
(Kevin Wilfong via namit)

[namit] HIVE-3471 Implement grouping sets in hive
(Ivan Gorbachev via namit)


Changes for Build #1799
[hashutosh] HIVE-3291 : fix fs resolvers (Ashish Singh via Ashutosh Chauhan)

[hashutosh] HIVE-3680 : Include Table information in Hive's AddPartitionEvent. (Mithun Radhakrishnan via Ashutosh Chauhan)


Changes for Build #1800
[hashutosh] HIVE-3520 : ivysettings.xml does not let you override .m2/repository (Raja Aluri via Ashutosh Chauhan)

[hashutosh] HIVE-3435 : Get pdk pluginTest passed when triggered from both builtin tests and pdk tests on hadoop23  (Zhenxiao Luo via Ashutosh Chauhan)


Changes for Build #1801

Changes for Build #1802



No tests ran.

The Apache Jenkins build system has built Hive-trunk-h0.21 (build #1802)

Status: Still Failing

Check console output at https://builds.apache.org/job/Hive-trunk-h0.21/1802/ to view the results.