You are viewing a plain text version of this content. The canonical link for it is here.
Posted to yarn-dev@hadoop.apache.org by Apache Jenkins Server <je...@builds.apache.org> on 2014/12/30 12:57:17 UTC
Hadoop-Yarn-trunk - Build # 791 - Still Failing
See https://builds.apache.org/job/Hadoop-Yarn-trunk/791/
###################################################################################
########################## LAST 60 LINES OF THE CONSOLE ###########################
[...truncated 8668 lines...]
Tests run: 1, Failures: 0, Errors: 0, Skipped: 0, Time elapsed: 20.205 sec - in org.apache.hadoop.yarn.server.resourcemanager.applicationsmanager.TestAMRMRPCResponseId
Running org.apache.hadoop.yarn.server.resourcemanager.applicationsmanager.TestAMRMRPCNodeUpdates
Tests run: 1, Failures: 0, Errors: 0, Skipped: 0, Time elapsed: 9.986 sec - in org.apache.hadoop.yarn.server.resourcemanager.applicationsmanager.TestAMRMRPCNodeUpdates
Running org.apache.hadoop.yarn.server.resourcemanager.applicationsmanager.TestAMRestart
Tests run: 6, Failures: 0, Errors: 0, Skipped: 0, Time elapsed: 114.133 sec - in org.apache.hadoop.yarn.server.resourcemanager.applicationsmanager.TestAMRestart
Results :
Tests in error:
TestRM.testAppOnMultiNode:188 ยป test timed out after 30000 milliseconds
Tests run: 972, Failures: 0, Errors: 1, Skipped: 1
[INFO] ------------------------------------------------------------------------
[INFO] Reactor Summary:
[INFO]
[INFO] hadoop-yarn ....................................... SUCCESS [ 3.092 s]
[INFO] hadoop-yarn-api ................................... SUCCESS [02:59 min]
[INFO] hadoop-yarn-common ................................ SUCCESS [02:44 min]
[INFO] hadoop-yarn-server ................................ SUCCESS [ 0.092 s]
[INFO] hadoop-yarn-server-common ......................... SUCCESS [ 41.581 s]
[INFO] hadoop-yarn-server-nodemanager .................... SUCCESS [06:08 min]
[INFO] hadoop-yarn-server-web-proxy ...................... SUCCESS [ 21.727 s]
[INFO] hadoop-yarn-server-applicationhistoryservice ...... SUCCESS [03:53 min]
[INFO] hadoop-yarn-server-resourcemanager ................ FAILURE [ 01:07 h]
[INFO] hadoop-yarn-server-tests .......................... SKIPPED
[INFO] hadoop-yarn-client ................................ SKIPPED
[INFO] hadoop-yarn-server-sharedcachemanager ............. SKIPPED
[INFO] hadoop-yarn-applications .......................... SKIPPED
[INFO] hadoop-yarn-applications-distributedshell ......... SKIPPED
[INFO] hadoop-yarn-applications-unmanaged-am-launcher .... SKIPPED
[INFO] hadoop-yarn-site .................................. SKIPPED
[INFO] hadoop-yarn-registry .............................. SKIPPED
[INFO] hadoop-yarn-project ............................... SKIPPED
[INFO] ------------------------------------------------------------------------
[INFO] BUILD FAILURE
[INFO] ------------------------------------------------------------------------
[INFO] Total time: 01:24 h
[INFO] Finished at: 2014-12-30T11:56:50+00:00
[INFO] Final Memory: 63M/704M
[INFO] ------------------------------------------------------------------------
[ERROR] Failed to execute goal org.apache.maven.plugins:maven-surefire-plugin:2.17:test (default-test) on project hadoop-yarn-server-resourcemanager: There was a timeout or other error in the fork -> [Help 1]
[ERROR]
[ERROR] To see the full stack trace of the errors, re-run Maven with the -e switch.
[ERROR] Re-run Maven using the -X switch to enable full debug logging.
[ERROR]
[ERROR] For more information about the errors and possible solutions, please read the following articles:
[ERROR] [Help 1] http://cwiki.apache.org/confluence/display/MAVEN/MojoFailureException
[ERROR]
[ERROR] After correcting the problems, you can resume the build with the command
[ERROR] mvn <goals> -rf :hadoop-yarn-server-resourcemanager
Build step 'Execute shell' marked build as failure
Archiving artifacts
Recording test results
Updating HADOOP-11039
Updating YARN-2938
Sending e-mails to: yarn-dev@hadoop.apache.org
Email was triggered for: Failure
Sending email for trigger: Failure
###################################################################################
############################## FAILED TESTS (if any) ##############################
1 tests failed.
FAILED: org.apache.hadoop.yarn.server.resourcemanager.TestRM.testAppOnMultiNode[0]
Error Message:
test timed out after 30000 milliseconds
Stack Trace:
java.lang.Exception: test timed out after 30000 milliseconds
at java.net.Inet4AddressImpl.lookupAllHostAddr(Native Method)
at java.net.InetAddress$1.lookupAllHostAddr(InetAddress.java:901)
at java.net.InetAddress.getAddressesFromNameService(InetAddress.java:1293)
at java.net.InetAddress.getAllByName0(InetAddress.java:1246)
at java.net.InetAddress.getAllByName(InetAddress.java:1162)
at java.net.InetAddress.getAllByName(InetAddress.java:1098)
at java.net.InetAddress.getByName(InetAddress.java:1048)
at org.apache.hadoop.security.SecurityUtil$QualifiedHostResolver.getInetAddressByName(SecurityUtil.java:598)
at org.apache.hadoop.security.SecurityUtil$QualifiedHostResolver.getByExactName(SecurityUtil.java:571)
at org.apache.hadoop.security.SecurityUtil$QualifiedHostResolver.getByName(SecurityUtil.java:552)
at org.apache.hadoop.security.SecurityUtil.getByName(SecurityUtil.java:464)
at org.apache.hadoop.net.NetUtils.createSocketAddrForHost(NetUtils.java:236)
at org.apache.hadoop.yarn.server.utils.BuilderUtils.newContainerToken(BuilderUtils.java:255)
at org.apache.hadoop.yarn.server.resourcemanager.security.RMContainerTokenSecretManager.createContainerToken(RMContainerTokenSecretManager.java:220)
at org.apache.hadoop.yarn.server.resourcemanager.scheduler.SchedulerApplicationAttempt.pullNewlyAllocatedContainersAndNMTokens(SchedulerApplicationAttempt.java:448)
at org.apache.hadoop.yarn.server.resourcemanager.scheduler.common.fica.FiCaSchedulerApp.getAllocation(FiCaSchedulerApp.java:254)
at org.apache.hadoop.yarn.server.resourcemanager.scheduler.capacity.CapacityScheduler.allocate(CapacityScheduler.java:898)
at org.apache.hadoop.yarn.server.resourcemanager.ApplicationMasterService.allocate(ApplicationMasterService.java:529)
at org.apache.hadoop.yarn.server.resourcemanager.MockAM$2.run(MockAM.java:220)
at org.apache.hadoop.yarn.server.resourcemanager.MockAM$2.run(MockAM.java:217)
at java.security.AccessController.doPrivileged(Native Method)
at javax.security.auth.Subject.doAs(Subject.java:415)
at org.apache.hadoop.security.UserGroupInformation.doAs(UserGroupInformation.java:1669)
at org.apache.hadoop.yarn.server.resourcemanager.MockAM.allocate(MockAM.java:217)
at org.apache.hadoop.yarn.server.resourcemanager.TestRM.testAppOnMultiNode(TestRM.java:188)