You are viewing a plain text version of this content. The canonical link for it is here.
Posted to builds@beam.apache.org by Apache Jenkins Server <je...@builds.apache.org> on 2021/04/03 00:39:38 UTC
Build failed in Jenkins: beam_PostCommit_XVR_Direct #1065
See <https://ci-beam.apache.org/job/beam_PostCommit_XVR_Direct/1065/display/redirect?page=changes>
Changes:
[Ismaël Mejía] [BEAM-11213] Display Beam Metrics in Spark History Server for Classic
[Boyuan Zhang] Re-enable CrossLanguageKafkaIOTest
[noreply] [BEAM-11747] Narrow list of unsupported types in BeamJavaUdfCalcRule.
[noreply] [BEAM-12079] Enforce callable destination arg type for WriteToBigQuery
[Ismaël Mejía] [BEAM-12088] Make file staging uniform among Spark Runners
------------------------------------------
[...truncated 1.32 MB...]
INFO:root:Running (((assert_that/Group/GroupByKey/Read)+(ref_AppliedPTransform_assert_that/Group/Map(_merge_tagged_vals_under_key)_30))+(ref_AppliedPTransform_assert_that/Unkey_31))+(ref_AppliedPTransform_assert_that/Match_32)
INFO:root:Successfully completed job in 9.643744707107544 seconds.
INFO:apache_beam.runners.portability.portable_runner:Job state changed to DONE
ok
test_zetasql_generate_data (apache_beam.transforms.sql_test.SqlTransformTest) ... INFO:apache_beam.utils.subprocess_server:Using pre-built snapshot at <https://ci-beam.apache.org/job/beam_PostCommit_XVR_Direct/ws/src/sdks/java/extensions/sql/expansion-service/build/libs/beam-sdks-java-extensions-sql-expansion-service-2.30.0-SNAPSHOT.jar>
INFO:apache_beam.utils.subprocess_server:Starting service with ['java' '-jar' '<https://ci-beam.apache.org/job/beam_PostCommit_XVR_Direct/ws/src/sdks/java/extensions/sql/expansion-service/build/libs/beam-sdks-java-extensions-sql-expansion-service-2.30.0-SNAPSHOT.jar'> '49963']
DEBUG:root:Waiting for grpc channel to be ready at localhost:49963.
INFO:apache_beam.utils.subprocess_server:b'Starting expansion service at localhost:49963'
DEBUG:root:Waiting for grpc channel to be ready at localhost:49963.
INFO:apache_beam.utils.subprocess_server:b'Apr 03, 2021 12:39:13 AM org.apache.beam.sdk.expansion.service.ExpansionService loadRegisteredTransforms'
INFO:apache_beam.utils.subprocess_server:b'INFO: Registering external transforms: [beam:external:java:sql:v1, beam:external:java:generate_sequence:v1]'
INFO:apache_beam.utils.subprocess_server:b'\tbeam:external:java:sql:v1: org.apache.beam.sdk.expansion.service.ExpansionService$ExternalTransformRegistrarLoader$$Lambda$3/1130478920@5680a178'
INFO:apache_beam.utils.subprocess_server:b'\tbeam:external:java:generate_sequence:v1: org.apache.beam.sdk.expansion.service.ExpansionService$ExternalTransformRegistrarLoader$$Lambda$3/1130478920@5fdef03a'
DEBUG:root:Waiting for grpc channel to be ready at localhost:49963.
DEBUG:root:Waiting for grpc channel to be ready at localhost:49963.
DEBUG:root:Waiting for grpc channel to be ready at localhost:49963.
DEBUG:root:Waiting for grpc channel to be ready at localhost:49963.
INFO:apache_beam.utils.subprocess_server:b'Apr 03, 2021 12:39:14 AM org.apache.beam.sdk.expansion.service.ExpansionService expand'
INFO:apache_beam.utils.subprocess_server:b"INFO: Expanding 'SqlTransform(beam:external:java:sql:v1)' with URN 'beam:external:java:sql:v1'"
INFO:apache_beam.utils.subprocess_server:b'Apr 03, 2021 12:39:15 AM org.apache.beam.sdk.expansion.service.ExpansionService$ExternalTransformRegistrarLoader payloadToConfig'
INFO:apache_beam.utils.subprocess_server:b"WARNING: Configuration class 'org.apache.beam.sdk.extensions.sql.expansion.ExternalSqlTransformRegistrar$Configuration' has no schema registered. Attempting to construct with setter approach."
INFO:apache_beam.utils.subprocess_server:b'Apr 03, 2021 12:39:18 AM org.apache.beam.sdk.extensions.sql.zetasql.ZetaSQLQueryPlanner convertToBeamRelInternal'
INFO:apache_beam.utils.subprocess_server:b'INFO: BEAMPlan>'
INFO:apache_beam.utils.subprocess_server:b"BeamZetaSqlCalcRel(expr#0=[{inputs}], expr#1=[1:BIGINT], expr#2=['foo':VARCHAR], expr#3=[3.1400000000000001243E0:DOUBLE], int=[$t1], str=[$t2], flt=[$t3])"
INFO:apache_beam.utils.subprocess_server:b' BeamValuesRel(tuples=[[{ 0 }]])'
INFO:apache_beam.utils.subprocess_server:b''
DEBUG:root:Sending SIGINT to job_server
DEBUG:root:Unhandled type_constraint: Union[]
DEBUG:root:Unhandled type_constraint: Union[]
DEBUG:root:Unhandled type_constraint: Union[]
DEBUG:root:Unhandled type_constraint: Union[]
WARNING:root:Make sure that locally built Python SDK docker image has Python 3.6 interpreter.
INFO:root:Default Python SDK image for environment is apache/beam_python3.6_sdk:2.30.0.dev
INFO:root:No image given, using default Python SDK image
WARNING:root:Make sure that locally built Python SDK docker image has Python 3.6 interpreter.
INFO:root:Default Python SDK image for environment is apache/beam_python3.6_sdk:2.30.0.dev
INFO:root:Python SDK container image set to "apache/beam_python3.6_sdk:2.30.0.dev" for Docker environment
INFO:apache_beam.runners.portability.fn_api_runner.translations:==================== <function lift_combiners at 0x7f60cbbf8488> ====================
DEBUG:apache_beam.runners.portability.fn_api_runner.translations:16 [1, 1, 1, 1, 1, 1, 1, 1, 1, 1, 1, 1, 1, 1, 1, 1]
DEBUG:apache_beam.runners.portability.fn_api_runner.translations:Stages: ['external_9SqlTransform(beam:external:java:sql:v1)/BeamValuesRel_13/Create.Values/Read(CreateSource)/Impulse\n SqlTransform(beam:external:java:sql:v1)/BeamValuesRel_13/Create.Values/Read(CreateSource)/Impulse:beam:transform:impulse:v1\n must follow: \n downstream_side_inputs: <unknown>', 'external_9SqlTransform(beam:external:java:sql:v1)/BeamValuesRel_13/Create.Values/Read(CreateSource)/ParDo(OutputSingleSource)/ParMultiDo(OutputSingleSource)\n SqlTransform(beam:external:java:sql:v1)/BeamValuesRel_13/Create.Values/Read(CreateSource)/ParDo(OutputSingleSource)/ParMultiDo(OutputSingleSource):beam:transform:pardo:v1\n must follow: \n downstream_side_inputs: <unknown>', 'external_9SqlTransform(beam:external:java:sql:v1)/BeamValuesRel_13/Create.Values/Read(CreateSource)/ParDo(BoundedSourceAsSDFWrapper)/ParMultiDo(BoundedSourceAsSDFWrapper)\n SqlTransform(beam:external:java:sql:v1)/BeamValuesRel_13/Create.Values/Read(CreateSource)/ParDo(BoundedSourceAsSDFWrapper)/ParMultiDo(BoundedSourceAsSDFWrapper):beam:transform:pardo:v1\n must follow: \n downstream_side_inputs: <unknown>', 'external_9SqlTransform(beam:external:java:sql:v1)/BeamZetaSqlCalcRel_17/ParDo(Calc)/ParMultiDo(Calc)\n SqlTransform(beam:external:java:sql:v1)/BeamZetaSqlCalcRel_17/ParDo(Calc)/ParMultiDo(Calc):beam:transform:pardo:v1\n must follow: \n downstream_side_inputs: <unknown>', 'ref_AppliedPTransform_assert_that/Create/Impulse_5\n assert_that/Create/Impulse:beam:transform:impulse:v1\n must follow: \n downstream_side_inputs: <unknown>', 'ref_AppliedPTransform_assert_that/Create/FlatMap(<lambda at core.py:2963>)_6\n assert_that/Create/FlatMap(<lambda at core.py:2963>):beam:transform:pardo:v1\n must follow: \n downstream_side_inputs: <unknown>', 'ref_AppliedPTransform_assert_that/Create/Map(decode)_8\n assert_that/Create/Map(decode):beam:transform:pardo:v1\n must follow: \n downstream_side_inputs: <unknown>', 'ref_AppliedPTransform_assert_that/WindowInto(WindowIntoFn)_9\n assert_that/WindowInto(WindowIntoFn):beam:transform:window_into:v1\n must follow: \n downstream_side_inputs: <unknown>', 'ref_AppliedPTransform_assert_that/ToVoidKey_10\n assert_that/ToVoidKey:beam:transform:pardo:v1\n must follow: \n downstream_side_inputs: <unknown>', 'ref_AppliedPTransform_assert_that/Group/pair_with_0_12\n assert_that/Group/pair_with_0:beam:transform:pardo:v1\n must follow: \n downstream_side_inputs: <unknown>', 'ref_AppliedPTransform_assert_that/Group/pair_with_1_13\n assert_that/Group/pair_with_1:beam:transform:pardo:v1\n must follow: \n downstream_side_inputs: <unknown>', 'ref_AppliedPTransform_assert_that/Group/Flatten_14\n assert_that/Group/Flatten:beam:transform:flatten:v1\n must follow: \n downstream_side_inputs: <unknown>', 'ref_AppliedPTransform_assert_that/Group/GroupByKey_15\n assert_that/Group/GroupByKey:beam:transform:group_by_key:v1\n must follow: \n downstream_side_inputs: <unknown>', 'ref_AppliedPTransform_assert_that/Group/Map(_merge_tagged_vals_under_key)_16\n assert_that/Group/Map(_merge_tagged_vals_under_key):beam:transform:pardo:v1\n must follow: \n downstream_side_inputs: <unknown>', 'ref_AppliedPTransform_assert_that/Unkey_17\n assert_that/Unkey:beam:transform:pardo:v1\n must follow: \n downstream_side_inputs: <unknown>', 'ref_AppliedPTransform_assert_that/Match_18\n assert_that/Match:beam:transform:pardo:v1\n must follow: \n downstream_side_inputs: <unknown>']
INFO:apache_beam.runners.portability.fn_api_runner.translations:==================== <function sort_stages at 0x7f60cbbf8b70> ====================
DEBUG:apache_beam.runners.portability.fn_api_runner.translations:16 [1, 1, 1, 1, 1, 1, 1, 1, 1, 1, 1, 1, 1, 1, 1, 1]
DEBUG:apache_beam.runners.portability.fn_api_runner.translations:Stages: ['external_9SqlTransform(beam:external:java:sql:v1)/BeamValuesRel_13/Create.Values/Read(CreateSource)/Impulse\n SqlTransform(beam:external:java:sql:v1)/BeamValuesRel_13/Create.Values/Read(CreateSource)/Impulse:beam:transform:impulse:v1\n must follow: \n downstream_side_inputs: <unknown>', 'external_9SqlTransform(beam:external:java:sql:v1)/BeamValuesRel_13/Create.Values/Read(CreateSource)/ParDo(OutputSingleSource)/ParMultiDo(OutputSingleSource)\n SqlTransform(beam:external:java:sql:v1)/BeamValuesRel_13/Create.Values/Read(CreateSource)/ParDo(OutputSingleSource)/ParMultiDo(OutputSingleSource):beam:transform:pardo:v1\n must follow: \n downstream_side_inputs: <unknown>', 'external_9SqlTransform(beam:external:java:sql:v1)/BeamValuesRel_13/Create.Values/Read(CreateSource)/ParDo(BoundedSourceAsSDFWrapper)/ParMultiDo(BoundedSourceAsSDFWrapper)\n SqlTransform(beam:external:java:sql:v1)/BeamValuesRel_13/Create.Values/Read(CreateSource)/ParDo(BoundedSourceAsSDFWrapper)/ParMultiDo(BoundedSourceAsSDFWrapper):beam:transform:pardo:v1\n must follow: \n downstream_side_inputs: <unknown>', 'external_9SqlTransform(beam:external:java:sql:v1)/BeamZetaSqlCalcRel_17/ParDo(Calc)/ParMultiDo(Calc)\n SqlTransform(beam:external:java:sql:v1)/BeamZetaSqlCalcRel_17/ParDo(Calc)/ParMultiDo(Calc):beam:transform:pardo:v1\n must follow: \n downstream_side_inputs: <unknown>', 'ref_AppliedPTransform_assert_that/Create/Impulse_5\n assert_that/Create/Impulse:beam:transform:impulse:v1\n must follow: \n downstream_side_inputs: <unknown>', 'ref_AppliedPTransform_assert_that/Create/FlatMap(<lambda at core.py:2963>)_6\n assert_that/Create/FlatMap(<lambda at core.py:2963>):beam:transform:pardo:v1\n must follow: \n downstream_side_inputs: <unknown>', 'ref_AppliedPTransform_assert_that/Create/Map(decode)_8\n assert_that/Create/Map(decode):beam:transform:pardo:v1\n must follow: \n downstream_side_inputs: <unknown>', 'ref_AppliedPTransform_assert_that/WindowInto(WindowIntoFn)_9\n assert_that/WindowInto(WindowIntoFn):beam:transform:window_into:v1\n must follow: \n downstream_side_inputs: <unknown>', 'ref_AppliedPTransform_assert_that/ToVoidKey_10\n assert_that/ToVoidKey:beam:transform:pardo:v1\n must follow: \n downstream_side_inputs: <unknown>', 'ref_AppliedPTransform_assert_that/Group/pair_with_0_12\n assert_that/Group/pair_with_0:beam:transform:pardo:v1\n must follow: \n downstream_side_inputs: <unknown>', 'ref_AppliedPTransform_assert_that/Group/pair_with_1_13\n assert_that/Group/pair_with_1:beam:transform:pardo:v1\n must follow: \n downstream_side_inputs: <unknown>', 'ref_AppliedPTransform_assert_that/Group/Flatten_14\n assert_that/Group/Flatten:beam:transform:flatten:v1\n must follow: \n downstream_side_inputs: <unknown>', 'ref_AppliedPTransform_assert_that/Group/GroupByKey_15\n assert_that/Group/GroupByKey:beam:transform:group_by_key:v1\n must follow: \n downstream_side_inputs: <unknown>', 'ref_AppliedPTransform_assert_that/Group/Map(_merge_tagged_vals_under_key)_16\n assert_that/Group/Map(_merge_tagged_vals_under_key):beam:transform:pardo:v1\n must follow: \n downstream_side_inputs: <unknown>', 'ref_AppliedPTransform_assert_that/Unkey_17\n assert_that/Unkey:beam:transform:pardo:v1\n must follow: \n downstream_side_inputs: <unknown>', 'ref_AppliedPTransform_assert_that/Match_18\n assert_that/Match:beam:transform:pardo:v1\n must follow: \n downstream_side_inputs: <unknown>']
INFO:apache_beam.runners.portability.portable_runner:Job state changed to STOPPED
INFO:apache_beam.runners.portability.portable_runner:Job state changed to STARTING
INFO:apache_beam.runners.portability.portable_runner:Job state changed to RUNNING
INFO:root:==================== <function annotate_downstream_side_inputs at 0x7fe929726620> ====================
INFO:root:==================== <function fix_side_input_pcoll_coders at 0x7fe929726730> ====================
INFO:root:==================== <function pack_combiners at 0x7fe929726b70> ====================
INFO:root:==================== <function lift_combiners at 0x7fe929726c80> ====================
INFO:root:==================== <function expand_sdf at 0x7fe929726e18> ====================
INFO:root:==================== <function expand_gbk at 0x7fe929726ea0> ====================
INFO:root:==================== <function sink_flattens at 0x7fe929727048> ====================
INFO:root:==================== <function greedily_fuse at 0x7fe9297270d0> ====================
INFO:root:==================== <function read_to_impulse at 0x7fe929727158> ====================
INFO:root:==================== <function impulse_to_input at 0x7fe9297271e0> ====================
INFO:root:==================== <function sort_stages at 0x7fe929727400> ====================
INFO:root:==================== <function setup_timer_mapping at 0x7fe929727378> ====================
INFO:root:==================== <function populate_data_channel_coders at 0x7fe929727488> ====================
INFO:root:starting control server on port 39975
INFO:root:starting data server on port 41221
INFO:root:starting state server on port 32977
INFO:root:starting logging server on port 34651
INFO:root:Created Worker handler <apache_beam.runners.portability.fn_api_runner.worker_handlers.DockerSdkWorkerHandler object at 0x7fe929151cf8> for environment external_9beam:env:docker:v1 (beam:env:docker:v1, b'\n apache/beam_java8_sdk:2.30.0.dev')
INFO:root:Attempting to pull image apache/beam_java8_sdk:2.30.0.dev
INFO:root:Unable to pull image apache/beam_java8_sdk:2.30.0.dev, defaulting to local image if it exists
INFO:root:Waiting for docker to start up. Current status is running
INFO:root:Docker container is running. container_id = b'16f33d4914dc86e939ab0143a33eda0b473b8b318f30cfbda02e75b704f4d451', worker_id = worker_40
INFO:root:Running ((((external_9SqlTransform(beam:external:java:sql:v1)/BeamValuesRel_13/Create.Values/Read(CreateSource)/Impulse)+(external_9SqlTransform(beam:external:java:sql:v1)/BeamValuesRel_13/Create.Values/Read(CreateSource)/ParDo(OutputSingleSource)/ParMultiDo(OutputSingleSource)))+(SqlTransform(beam:external:java:sql:v1)/BeamValuesRel_13/Create.Values/Read(CreateSource)/ParDo(BoundedSourceAsSDFWrapper)/ParMultiDo(BoundedSourceAsSDFWrapper)/PairWithRestriction))+(SqlTransform(beam:external:java:sql:v1)/BeamValuesRel_13/Create.Values/Read(CreateSource)/ParDo(BoundedSourceAsSDFWrapper)/ParMultiDo(BoundedSourceAsSDFWrapper)/SplitAndSizeRestriction))+(external_9SqlTransform(beam:external:java:sql:v1)/BeamValuesRel_13/Create.Values/Read(CreateSource)/ParDo(OutputSingleSource)/ParMultiDo(OutputSingleSource).output_split/Write)
INFO:root:Running (((external_9SqlTransform(beam:external:java:sql:v1)/BeamValuesRel_13/Create.Values/Read(CreateSource)/ParDo(OutputSingleSource)/ParMultiDo(OutputSingleSource).output_split/Read)+(SqlTransform(beam:external:java:sql:v1)/BeamValuesRel_13/Create.Values/Read(CreateSource)/ParDo(BoundedSourceAsSDFWrapper)/ParMultiDo(BoundedSourceAsSDFWrapper)/Process))+(external_9SqlTransform(beam:external:java:sql:v1)/BeamZetaSqlCalcRel_17/ParDo(Calc)/ParMultiDo(Calc)))+(ref_PCollection_PCollection_1/Write)
INFO:root:Created Worker handler <apache_beam.runners.portability.fn_api_runner.worker_handlers.DockerSdkWorkerHandler object at 0x7fe9291b2898> for environment ref_Environment_default_environment_1 (beam:env:docker:v1, b'\n$apache/beam_python3.6_sdk:2.30.0.dev')
INFO:root:Attempting to pull image apache/beam_python3.6_sdk:2.30.0.dev
INFO:root:Unable to pull image apache/beam_python3.6_sdk:2.30.0.dev, defaulting to local image if it exists
INFO:root:Waiting for docker to start up. Current status is running
INFO:root:Docker container is running. container_id = b'e0cca0f0ab9ca9c50bacadc4c8a7f518606348dd74383b60c4892387653a27b7', worker_id = worker_41
INFO:root:Running (((((ref_PCollection_PCollection_1/Read)+(ref_AppliedPTransform_assert_that/WindowInto(WindowIntoFn)_9))+(ref_AppliedPTransform_assert_that/ToVoidKey_10))+(ref_AppliedPTransform_assert_that/Group/pair_with_1_13))+(assert_that/Group/Flatten/Transcode/1))+(assert_that/Group/Flatten/Write/1)
INFO:root:Running (((((ref_AppliedPTransform_assert_that/Create/Impulse_5)+(ref_AppliedPTransform_assert_that/Create/FlatMap(<lambda at core.py:2963>)_6))+(ref_AppliedPTransform_assert_that/Create/Map(decode)_8))+(ref_AppliedPTransform_assert_that/Group/pair_with_0_12))+(assert_that/Group/Flatten/Transcode/0))+(assert_that/Group/Flatten/Write/0)
INFO:root:Running (assert_that/Group/Flatten/Read)+(assert_that/Group/GroupByKey/Write)
INFO:root:Running (((assert_that/Group/GroupByKey/Read)+(ref_AppliedPTransform_assert_that/Group/Map(_merge_tagged_vals_under_key)_16))+(ref_AppliedPTransform_assert_that/Unkey_17))+(ref_AppliedPTransform_assert_that/Match_18)
INFO:root:Successfully completed job in 11.356863975524902 seconds.
INFO:apache_beam.runners.portability.portable_runner:Job state changed to DONE
ok
======================================================================
ERROR: test_agg (apache_beam.transforms.sql_test.SqlTransformTest)
----------------------------------------------------------------------
Traceback (most recent call last):
File "<https://ci-beam.apache.org/job/beam_PostCommit_XVR_Direct/ws/src/sdks/python/apache_beam/transforms/sql_test.py",> line 121, in test_agg
assert_that(out, equal_to([("foo", 3, 3, 2), ("bar", 4, 8, 1.414)]))
File "<https://ci-beam.apache.org/job/beam_PostCommit_XVR_Direct/ws/src/sdks/python/apache_beam/pipeline.py",> line 582, in __exit__
self.result = self.run()
File "<https://ci-beam.apache.org/job/beam_PostCommit_XVR_Direct/ws/src/sdks/python/apache_beam/testing/test_pipeline.py",> line 112, in run
False if self.not_use_test_runner_api else test_runner_api))
File "<https://ci-beam.apache.org/job/beam_PostCommit_XVR_Direct/ws/src/sdks/python/apache_beam/pipeline.py",> line 561, in run
return self.runner.run_pipeline(self, self._options)
File "<https://ci-beam.apache.org/job/beam_PostCommit_XVR_Direct/ws/src/sdks/python/apache_beam/runners/portability/portable_runner.py",> line 442, in run_pipeline
job_service_handle.submit(proto_pipeline)
File "<https://ci-beam.apache.org/job/beam_PostCommit_XVR_Direct/ws/src/sdks/python/apache_beam/runners/portability/portable_runner.py",> line 110, in submit
prepare_response = self.prepare(proto_pipeline)
File "<https://ci-beam.apache.org/job/beam_PostCommit_XVR_Direct/ws/src/sdks/python/apache_beam/runners/portability/portable_runner.py",> line 204, in prepare
pipeline_options=self.get_pipeline_options()),
File "<https://ci-beam.apache.org/job/beam_PostCommit_XVR_Direct/ws/src/sdks/python/apache_beam/runners/portability/portable_runner.py",> line 147, in get_pipeline_options
options_response = send_options_request()
File "<https://ci-beam.apache.org/job/beam_PostCommit_XVR_Direct/ws/src/sdks/python/apache_beam/runners/portability/portable_runner.py",> line 144, in send_options_request
raise e
File "<https://ci-beam.apache.org/job/beam_PostCommit_XVR_Direct/ws/src/sdks/python/apache_beam/runners/portability/portable_runner.py",> line 137, in send_options_request
timeout=self.timeout)
File "<https://ci-beam.apache.org/job/beam_PostCommit_XVR_Direct/ws/src/build/gradleenv/1922375555/lib/python3.6/site-packages/grpc/_channel.py",> line 923, in __call__
return _end_unary_response_blocking(state, call, False, None)
File "<https://ci-beam.apache.org/job/beam_PostCommit_XVR_Direct/ws/src/build/gradleenv/1922375555/lib/python3.6/site-packages/grpc/_channel.py",> line 826, in _end_unary_response_blocking
raise _InactiveRpcError(state)
grpc._channel._InactiveRpcError: <_InactiveRpcError of RPC that terminated with:
status = StatusCode.UNIMPLEMENTED
details = "Method not found!"
debug_error_string = "{"created":"@1617410222.569082696","description":"Error received from peer ipv4:127.0.0.1:18088","file":"src/core/lib/surface/call.cc","file_line":1067,"grpc_message":"Method not found!","grpc_status":12}"
>
-------------------- >> begin captured logging << --------------------
avro.schema: Level 5: Register new name for 'org.apache.avro.file.Header'
avro.schema: Level 5: Register new name for 'org.apache.avro.file.magic'
avro.schema: Level 5: Register new name for 'org.apache.avro.file.sync'
azure.storage.blob._shared.avro.schema: Level 5: Register new name for 'org.apache.avro.file.Header'
azure.storage.blob._shared.avro.schema: Level 5: Register new name for 'org.apache.avro.file.magic'
azure.storage.blob._shared.avro.schema: Level 5: Register new name for 'org.apache.avro.file.sync'
apache_beam.typehints.native_type_compatibility: INFO: Using Any for unsupported type: typing.Sequence[~T]
root: WARNING: python-snappy is not installed; some tests will be skipped.
root: WARNING: Tensorflow is not installed, so skipping some tests.
apache_beam.runners.interactive.interactive_environment: WARNING: Dependencies required for Interactive Beam PCollection visualization are not available, please use: `pip install apache-beam[interactive]` to install necessary dependencies to enable all data visualization features.
apache_beam.runners.interactive.interactive_environment: WARNING: You cannot use Interactive Beam features when you are not in an interactive environment such as a Jupyter notebook or ipython terminal.
root: WARNING: Make sure that locally built Python SDK docker image has Python 3.6 interpreter.
root: INFO: Default Python SDK image for environment is apache/beam_python3.6_sdk:2.30.0.dev
apache_beam.utils.subprocess_server: INFO: Using pre-built snapshot at <https://ci-beam.apache.org/job/beam_PostCommit_XVR_Direct/ws/src/sdks/java/extensions/sql/expansion-service/build/libs/beam-sdks-java-extensions-sql-expansion-service-2.30.0-SNAPSHOT.jar>
apache_beam.utils.subprocess_server: INFO: Starting service with ['java' '-jar' '<https://ci-beam.apache.org/job/beam_PostCommit_XVR_Direct/ws/src/sdks/java/extensions/sql/expansion-service/build/libs/beam-sdks-java-extensions-sql-expansion-service-2.30.0-SNAPSHOT.jar'> '60243']
root: DEBUG: Waiting for grpc channel to be ready at localhost:60243.
apache_beam.utils.subprocess_server: INFO: b'Starting expansion service at localhost:60243'
root: DEBUG: Waiting for grpc channel to be ready at localhost:60243.
apache_beam.utils.subprocess_server: INFO: b'Apr 03, 2021 12:36:49 AM org.apache.beam.sdk.expansion.service.ExpansionService loadRegisteredTransforms'
apache_beam.utils.subprocess_server: INFO: b'INFO: Registering external transforms: [beam:external:java:sql:v1, beam:external:java:generate_sequence:v1]'
apache_beam.utils.subprocess_server: INFO: b'\tbeam:external:java:sql:v1: org.apache.beam.sdk.expansion.service.ExpansionService$ExternalTransformRegistrarLoader$$Lambda$3/1130478920@5680a178'
apache_beam.utils.subprocess_server: INFO: b'\tbeam:external:java:generate_sequence:v1: org.apache.beam.sdk.expansion.service.ExpansionService$ExternalTransformRegistrarLoader$$Lambda$3/1130478920@5fdef03a'
root: DEBUG: Waiting for grpc channel to be ready at localhost:60243.
root: DEBUG: Waiting for grpc channel to be ready at localhost:60243.
root: DEBUG: Waiting for grpc channel to be ready at localhost:60243.
root: DEBUG: Waiting for grpc channel to be ready at localhost:60243.
apache_beam.utils.subprocess_server: INFO: b'Apr 03, 2021 12:36:50 AM org.apache.beam.sdk.expansion.service.ExpansionService expand'
apache_beam.utils.subprocess_server: INFO: b"INFO: Expanding 'SqlTransform(beam:external:java:sql:v1)' with URN 'beam:external:java:sql:v1'"
apache_beam.utils.subprocess_server: INFO: b'Apr 03, 2021 12:36:51 AM org.apache.beam.sdk.expansion.service.ExpansionService$ExternalTransformRegistrarLoader payloadToConfig'
apache_beam.utils.subprocess_server: INFO: b"WARNING: Configuration class 'org.apache.beam.sdk.extensions.sql.expansion.ExternalSqlTransformRegistrar$Configuration' has no schema registered. Attempting to construct with setter approach."
apache_beam.utils.subprocess_server: INFO: b'Apr 03, 2021 12:36:53 AM org.apache.beam.sdk.extensions.sql.impl.CalciteQueryPlanner convertToBeamRel'
apache_beam.utils.subprocess_server: INFO: b'INFO: SQL:'
apache_beam.utils.subprocess_server: INFO: b'SELECT `PCOLLECTION`.`str`, COUNT(*) AS `count`, SUM(`PCOLLECTION`.`id`) AS `sum`, AVG(`PCOLLECTION`.`flt`) AS `avg`'
apache_beam.utils.subprocess_server: INFO: b'FROM `beam`.`PCOLLECTION` AS `PCOLLECTION`'
apache_beam.utils.subprocess_server: INFO: b'GROUP BY `PCOLLECTION`.`str`'
apache_beam.utils.subprocess_server: INFO: b'Apr 03, 2021 12:36:53 AM org.apache.beam.sdk.extensions.sql.impl.CalciteQueryPlanner convertToBeamRel'
apache_beam.utils.subprocess_server: INFO: b'INFO: SQLPlan>'
apache_beam.utils.subprocess_server: INFO: b'LogicalAggregate(group=[{0}], count=[COUNT()], sum=[SUM($1)], avg=[AVG($2)])'
apache_beam.utils.subprocess_server: INFO: b' LogicalProject(str=[$1], id=[$0], flt=[$2])'
apache_beam.utils.subprocess_server: INFO: b' BeamIOSourceRel(table=[[beam, PCOLLECTION]])'
apache_beam.utils.subprocess_server: INFO: b''
apache_beam.utils.subprocess_server: INFO: b'Apr 03, 2021 12:36:53 AM org.apache.beam.sdk.extensions.sql.impl.CalciteQueryPlanner convertToBeamRel'
apache_beam.utils.subprocess_server: INFO: b'INFO: BEAMPlan>'
apache_beam.utils.subprocess_server: INFO: b'BeamAggregationRel(group=[{1}], count=[COUNT()], sum=[SUM($0)], avg=[AVG($2)])'
apache_beam.utils.subprocess_server: INFO: b' BeamIOSourceRel(table=[[beam, PCOLLECTION]])'
apache_beam.utils.subprocess_server: INFO: b''
root: DEBUG: Sending SIGINT to job_server
root: DEBUG: Unhandled type_constraint: Union[]
root: DEBUG: Unhandled type_constraint: Union[]
root: DEBUG: Unhandled type_constraint: Union[]
root: DEBUG: Unhandled type_constraint: Union[]
root: WARNING: Make sure that locally built Python SDK docker image has Python 3.6 interpreter.
root: INFO: Default Python SDK image for environment is apache/beam_python3.6_sdk:2.30.0.dev
root: INFO: No image given, using default Python SDK image
root: WARNING: Make sure that locally built Python SDK docker image has Python 3.6 interpreter.
root: INFO: Default Python SDK image for environment is apache/beam_python3.6_sdk:2.30.0.dev
root: INFO: Python SDK container image set to "apache/beam_python3.6_sdk:2.30.0.dev" for Docker environment
apache_beam.runners.portability.fn_api_runner.translations: INFO: ==================== <function lift_combiners at 0x7f60cbbf8488> ====================
apache_beam.runners.portability.fn_api_runner.translations: DEBUG: 25 [1, 1, 1, 1, 1, 1, 1, 1, 1, 1, 1, 1, 1, 1, 1, 1, 1, 1, 1, 1, 1, 1, 1, 1, 1]
apache_beam.runners.portability.fn_api_runner.translations: DEBUG: Stages: ['ref_AppliedPTransform_Create/Impulse_3\n Create/Impulse:beam:transform:impulse:v1\n must follow: \n downstream_side_inputs: <unknown>', 'ref_AppliedPTransform_Create/FlatMap(<lambda at core.py:2963>)_4\n Create/FlatMap(<lambda at core.py:2963>):beam:transform:pardo:v1\n must follow: \n downstream_side_inputs: <unknown>', 'ref_AppliedPTransform_Create/MaybeReshuffle/Reshuffle/AddRandomKeys_7\n Create/MaybeReshuffle/Reshuffle/AddRandomKeys:beam:transform:pardo:v1\n must follow: \n downstream_side_inputs: <unknown>', 'ref_AppliedPTransform_Create/MaybeReshuffle/Reshuffle/ReshufflePerKey/Map(reify_timestamps)_9\n Create/MaybeReshuffle/Reshuffle/ReshufflePerKey/Map(reify_timestamps):beam:transform:pardo:v1\n must follow: \n downstream_side_inputs: <unknown>', 'ref_AppliedPTransform_Create/MaybeReshuffle/Reshuffle/ReshufflePerKey/GroupByKey_10\n Create/MaybeReshuffle/Reshuffle/ReshufflePerKey/GroupByKey:beam:transform:group_by_key:v1\n must follow: \n downstream_side_inputs: <unknown>', 'ref_AppliedPTransform_Create/MaybeReshuffle/Reshuffle/ReshufflePerKey/FlatMap(restore_timestamps)_11\n Create/MaybeReshuffle/Reshuffle/ReshufflePerKey/FlatMap(restore_timestamps):beam:transform:pardo:v1\n must follow: \n downstream_side_inputs: <unknown>', 'ref_AppliedPTransform_Create/MaybeReshuffle/Reshuffle/RemoveRandomKeys_12\n Create/MaybeReshuffle/Reshuffle/RemoveRandomKeys:beam:transform:pardo:v1\n must follow: \n downstream_side_inputs: <unknown>', 'ref_AppliedPTransform_Create/Map(decode)_13\n Create/Map(decode):beam:transform:pardo:v1\n must follow: \n downstream_side_inputs: <unknown>', 'external_1SqlTransform(beam:external:java:sql:v1)/BeamAggregationRel_40/Group.CombineFieldsByFields/ToKvs/selectKeys/AddKeys/Map/ParMultiDo(Anonymous)\n SqlTransform(beam:external:java:sql:v1)/BeamAggregationRel_40/Group.CombineFieldsByFields/ToKvs/selectKeys/AddKeys/Map/ParMultiDo(Anonymous):beam:transform:pardo:v1\n must follow: \n downstream_side_inputs: <unknown>', 'external_1SqlTransform(beam:external:java:sql:v1)/BeamAggregationRel_40/Group.CombineFieldsByFields/ToKvs/GroupByKey\n SqlTransform(beam:external:java:sql:v1)/BeamAggregationRel_40/Group.CombineFieldsByFields/ToKvs/GroupByKey:beam:transform:group_by_key:v1\n must follow: \n downstream_side_inputs: <unknown>', 'external_1SqlTransform(beam:external:java:sql:v1)/BeamAggregationRel_40/Group.CombineFieldsByFields/Combine/ParDo(Anonymous)/ParMultiDo(Anonymous)\n SqlTransform(beam:external:java:sql:v1)/BeamAggregationRel_40/Group.CombineFieldsByFields/Combine/ParDo(Anonymous)/ParMultiDo(Anonymous):beam:transform:pardo:v1\n must follow: \n downstream_side_inputs: <unknown>', 'external_1SqlTransform(beam:external:java:sql:v1)/BeamAggregationRel_40/Group.CombineFieldsByFields/ToRow/ParMultiDo(Anonymous)\n SqlTransform(beam:external:java:sql:v1)/BeamAggregationRel_40/Group.CombineFieldsByFields/ToRow/ParMultiDo(Anonymous):beam:transform:pardo:v1\n must follow: \n downstream_side_inputs: <unknown>', 'external_1SqlTransform(beam:external:java:sql:v1)/BeamAggregationRel_40/mergeRecord/ParMultiDo(Anonymous)\n SqlTransform(beam:external:java:sql:v1)/BeamAggregationRel_40/mergeRecord/ParMultiDo(Anonymous):beam:transform:pardo:v1\n must follow: \n downstream_side_inputs: <unknown>', 'ref_AppliedPTransform_assert_that/Create/Impulse_17\n assert_that/Create/Impulse:beam:transform:impulse:v1\n must follow: \n downstream_side_inputs: <unknown>', 'ref_AppliedPTransform_assert_that/Create/FlatMap(<lambda at core.py:2963>)_18\n assert_that/Create/FlatMap(<lambda at core.py:2963>):beam:transform:pardo:v1\n must follow: \n downstream_side_inputs: <unknown>', 'ref_AppliedPTransform_assert_that/Create/Map(decode)_20\n assert_that/Create/Map(decode):beam:transform:pardo:v1\n must follow: \n downstream_side_inputs: <unknown>', 'ref_AppliedPTransform_assert_that/WindowInto(WindowIntoFn)_21\n assert_that/WindowInto(WindowIntoFn):beam:transform:window_into:v1\n must follow: \n downstream_side_inputs: <unknown>', 'ref_AppliedPTransform_assert_that/ToVoidKey_22\n assert_that/ToVoidKey:beam:transform:pardo:v1\n must follow: \n downstream_side_inputs: <unknown>', 'ref_AppliedPTransform_assert_that/Group/pair_with_0_24\n assert_that/Group/pair_with_0:beam:transform:pardo:v1\n must follow: \n downstream_side_inputs: <unknown>', 'ref_AppliedPTransform_assert_that/Group/pair_with_1_25\n assert_that/Group/pair_with_1:beam:transform:pardo:v1\n must follow: \n downstream_side_inputs: <unknown>', 'ref_AppliedPTransform_assert_that/Group/Flatten_26\n assert_that/Group/Flatten:beam:transform:flatten:v1\n must follow: \n downstream_side_inputs: <unknown>', 'ref_AppliedPTransform_assert_that/Group/GroupByKey_27\n assert_that/Group/GroupByKey:beam:transform:group_by_key:v1\n must follow: \n downstream_side_inputs: <unknown>', 'ref_AppliedPTransform_assert_that/Group/Map(_merge_tagged_vals_under_key)_28\n assert_that/Group/Map(_merge_tagged_vals_under_key):beam:transform:pardo:v1\n must follow: \n downstream_side_inputs: <unknown>', 'ref_AppliedPTransform_assert_that/Unkey_29\n assert_that/Unkey:beam:transform:pardo:v1\n must follow: \n downstream_side_inputs: <unknown>', 'ref_AppliedPTransform_assert_that/Match_30\n assert_that/Match:beam:transform:pardo:v1\n must follow: \n downstream_side_inputs: <unknown>']
apache_beam.runners.portability.fn_api_runner.translations: INFO: ==================== <function sort_stages at 0x7f60cbbf8b70> ====================
apache_beam.runners.portability.fn_api_runner.translations: DEBUG: 25 [1, 1, 1, 1, 1, 1, 1, 1, 1, 1, 1, 1, 1, 1, 1, 1, 1, 1, 1, 1, 1, 1, 1, 1, 1]
apache_beam.runners.portability.fn_api_runner.translations: DEBUG: Stages: ['ref_AppliedPTransform_Create/Impulse_3\n Create/Impulse:beam:transform:impulse:v1\n must follow: \n downstream_side_inputs: <unknown>', 'ref_AppliedPTransform_Create/FlatMap(<lambda at core.py:2963>)_4\n Create/FlatMap(<lambda at core.py:2963>):beam:transform:pardo:v1\n must follow: \n downstream_side_inputs: <unknown>', 'ref_AppliedPTransform_Create/MaybeReshuffle/Reshuffle/AddRandomKeys_7\n Create/MaybeReshuffle/Reshuffle/AddRandomKeys:beam:transform:pardo:v1\n must follow: \n downstream_side_inputs: <unknown>', 'ref_AppliedPTransform_Create/MaybeReshuffle/Reshuffle/ReshufflePerKey/Map(reify_timestamps)_9\n Create/MaybeReshuffle/Reshuffle/ReshufflePerKey/Map(reify_timestamps):beam:transform:pardo:v1\n must follow: \n downstream_side_inputs: <unknown>', 'ref_AppliedPTransform_Create/MaybeReshuffle/Reshuffle/ReshufflePerKey/GroupByKey_10\n Create/MaybeReshuffle/Reshuffle/ReshufflePerKey/GroupByKey:beam:transform:group_by_key:v1\n must follow: \n downstream_side_inputs: <unknown>', 'ref_AppliedPTransform_Create/MaybeReshuffle/Reshuffle/ReshufflePerKey/FlatMap(restore_timestamps)_11\n Create/MaybeReshuffle/Reshuffle/ReshufflePerKey/FlatMap(restore_timestamps):beam:transform:pardo:v1\n must follow: \n downstream_side_inputs: <unknown>', 'ref_AppliedPTransform_Create/MaybeReshuffle/Reshuffle/RemoveRandomKeys_12\n Create/MaybeReshuffle/Reshuffle/RemoveRandomKeys:beam:transform:pardo:v1\n must follow: \n downstream_side_inputs: <unknown>', 'ref_AppliedPTransform_Create/Map(decode)_13\n Create/Map(decode):beam:transform:pardo:v1\n must follow: \n downstream_side_inputs: <unknown>', 'external_1SqlTransform(beam:external:java:sql:v1)/BeamAggregationRel_40/Group.CombineFieldsByFields/ToKvs/selectKeys/AddKeys/Map/ParMultiDo(Anonymous)\n SqlTransform(beam:external:java:sql:v1)/BeamAggregationRel_40/Group.CombineFieldsByFields/ToKvs/selectKeys/AddKeys/Map/ParMultiDo(Anonymous):beam:transform:pardo:v1\n must follow: \n downstream_side_inputs: <unknown>', 'external_1SqlTransform(beam:external:java:sql:v1)/BeamAggregationRel_40/Group.CombineFieldsByFields/ToKvs/GroupByKey\n SqlTransform(beam:external:java:sql:v1)/BeamAggregationRel_40/Group.CombineFieldsByFields/ToKvs/GroupByKey:beam:transform:group_by_key:v1\n must follow: \n downstream_side_inputs: <unknown>', 'external_1SqlTransform(beam:external:java:sql:v1)/BeamAggregationRel_40/Group.CombineFieldsByFields/Combine/ParDo(Anonymous)/ParMultiDo(Anonymous)\n SqlTransform(beam:external:java:sql:v1)/BeamAggregationRel_40/Group.CombineFieldsByFields/Combine/ParDo(Anonymous)/ParMultiDo(Anonymous):beam:transform:pardo:v1\n must follow: \n downstream_side_inputs: <unknown>', 'external_1SqlTransform(beam:external:java:sql:v1)/BeamAggregationRel_40/Group.CombineFieldsByFields/ToRow/ParMultiDo(Anonymous)\n SqlTransform(beam:external:java:sql:v1)/BeamAggregationRel_40/Group.CombineFieldsByFields/ToRow/ParMultiDo(Anonymous):beam:transform:pardo:v1\n must follow: \n downstream_side_inputs: <unknown>', 'external_1SqlTransform(beam:external:java:sql:v1)/BeamAggregationRel_40/mergeRecord/ParMultiDo(Anonymous)\n SqlTransform(beam:external:java:sql:v1)/BeamAggregationRel_40/mergeRecord/ParMultiDo(Anonymous):beam:transform:pardo:v1\n must follow: \n downstream_side_inputs: <unknown>', 'ref_AppliedPTransform_assert_that/Create/Impulse_17\n assert_that/Create/Impulse:beam:transform:impulse:v1\n must follow: \n downstream_side_inputs: <unknown>', 'ref_AppliedPTransform_assert_that/Create/FlatMap(<lambda at core.py:2963>)_18\n assert_that/Create/FlatMap(<lambda at core.py:2963>):beam:transform:pardo:v1\n must follow: \n downstream_side_inputs: <unknown>', 'ref_AppliedPTransform_assert_that/Create/Map(decode)_20\n assert_that/Create/Map(decode):beam:transform:pardo:v1\n must follow: \n downstream_side_inputs: <unknown>', 'ref_AppliedPTransform_assert_that/WindowInto(WindowIntoFn)_21\n assert_that/WindowInto(WindowIntoFn):beam:transform:window_into:v1\n must follow: \n downstream_side_inputs: <unknown>', 'ref_AppliedPTransform_assert_that/ToVoidKey_22\n assert_that/ToVoidKey:beam:transform:pardo:v1\n must follow: \n downstream_side_inputs: <unknown>', 'ref_AppliedPTransform_assert_that/Group/pair_with_0_24\n assert_that/Group/pair_with_0:beam:transform:pardo:v1\n must follow: \n downstream_side_inputs: <unknown>', 'ref_AppliedPTransform_assert_that/Group/pair_with_1_25\n assert_that/Group/pair_with_1:beam:transform:pardo:v1\n must follow: \n downstream_side_inputs: <unknown>', 'ref_AppliedPTransform_assert_that/Group/Flatten_26\n assert_that/Group/Flatten:beam:transform:flatten:v1\n must follow: \n downstream_side_inputs: <unknown>', 'ref_AppliedPTransform_assert_that/Group/GroupByKey_27\n assert_that/Group/GroupByKey:beam:transform:group_by_key:v1\n must follow: \n downstream_side_inputs: <unknown>', 'ref_AppliedPTransform_assert_that/Group/Map(_merge_tagged_vals_under_key)_28\n assert_that/Group/Map(_merge_tagged_vals_under_key):beam:transform:pardo:v1\n must follow: \n downstream_side_inputs: <unknown>', 'ref_AppliedPTransform_assert_that/Unkey_29\n assert_that/Unkey:beam:transform:pardo:v1\n must follow: \n downstream_side_inputs: <unknown>', 'ref_AppliedPTransform_assert_that/Match_30\n assert_that/Match:beam:transform:pardo:v1\n must follow: \n downstream_side_inputs: <unknown>']
--------------------- >> end captured logging << ---------------------
----------------------------------------------------------------------
XML: nosetests-xlangSqlValidateRunner.xml
----------------------------------------------------------------------
XML: <https://ci-beam.apache.org/job/beam_PostCommit_XVR_Direct/ws/src/sdks/python/nosetests.xml>
----------------------------------------------------------------------
Ran 9 tests in 168.862s
FAILED (errors=1)
> Task :sdks:python:test-suites:direct:xlang:validatesCrossLanguageRunnerPythonUsingSql FAILED
> Task :sdks:python:test-suites:direct:xlang:validatesCrossLanguageRunnerJavaUsingJava FROM-CACHE
> Task :sdks:python:test-suites:direct:xlang:validatesCrossLanguageRunnerJavaUsingPython FROM-CACHE
> Task :sdks:python:test-suites:direct:xlang:validatesCrossLanguageRunnerCleanup
Stopping expansion service pid: 10411.
Stopping expansion service pid: 10414.
> Task :sdks:python:test-suites:direct:xlang:fnApiJobServerCleanup
Killing process at 1655
FAILURE: Build completed with 3 failures.
1: Task failed with an exception.
-----------
* What went wrong:
Execution failed for task ':sdks:python:test-suites:direct:xlang:validatesCrossLanguageRunnerPythonUsingJava'.
> Process 'command 'sh'' finished with non-zero exit value 1
* Try:
Run with --stacktrace option to get the stack trace. Run with --info or --debug option to get more log output. Run with --scan to get full insights.
==============================================================================
2: Task failed with an exception.
-----------
* What went wrong:
Execution failed for task ':sdks:python:test-suites:direct:xlang:validatesCrossLanguageRunnerPythonUsingPython'.
> Process 'command 'sh'' finished with non-zero exit value 1
* Try:
Run with --stacktrace option to get the stack trace. Run with --info or --debug option to get more log output. Run with --scan to get full insights.
==============================================================================
3: Task failed with an exception.
-----------
* What went wrong:
Execution failed for task ':sdks:python:test-suites:direct:xlang:validatesCrossLanguageRunnerPythonUsingSql'.
> Process 'command 'sh'' finished with non-zero exit value 1
* Try:
Run with --stacktrace option to get the stack trace. Run with --info or --debug option to get more log output. Run with --scan to get full insights.
==============================================================================
* Get more help at https://help.gradle.org
Deprecated Gradle features were used in this build, making it incompatible with Gradle 7.0.
Use '--warning-mode all' to show the individual deprecation warnings.
See https://docs.gradle.org/6.8/userguide/command_line_interface.html#sec:command_line_warnings
BUILD FAILED in 13m 10s
157 actionable tasks: 32 executed, 3 from cache, 122 up-to-date
Gradle was unable to watch the file system for changes. The inotify watches limit is too low.
Publishing build scan...
https://gradle.com/s/xwcvkgzxl44ss
Build step 'Invoke Gradle script' changed build result to FAILURE
Build step 'Invoke Gradle script' marked build as failure
---------------------------------------------------------------------
To unsubscribe, e-mail: builds-unsubscribe@beam.apache.org
For additional commands, e-mail: builds-help@beam.apache.org
Jenkins build is back to normal : beam_PostCommit_XVR_Direct #1066
Posted by Apache Jenkins Server <je...@builds.apache.org>.
See <https://ci-beam.apache.org/job/beam_PostCommit_XVR_Direct/1066/display/redirect>
---------------------------------------------------------------------
To unsubscribe, e-mail: builds-unsubscribe@beam.apache.org
For additional commands, e-mail: builds-help@beam.apache.org