You are viewing a plain text version of this content. The canonical link for it is here.
Posted to builds@beam.apache.org by Apache Jenkins Server <je...@builds.apache.org> on 2022/06/28 03:46:54 UTC

Build failed in Jenkins: beam_PostCommit_Python_Examples_Flink #560

See <https://ci-beam.apache.org/job/beam_PostCommit_Python_Examples_Flink/560/display/redirect?page=changes>

Changes:

[Pablo Estrada] Blog post and updates for release 2.40.0

[noreply] Issue#20877 Updated Interactive Beam README (#22034)


------------------------------------------
[...truncated 54.92 MB...]
INFO     apache_beam.utils.subprocess_server:subprocess_server.py:125 b'INFO: Disconnect job manager a2a9aeded9bad9adf683bd5cca394c4f@akka://flink/user/rpc/jobmanager_3 for job 781981648deab1a2d0eb615686bb431c from the resource manager.'
INFO     apache_beam.utils.subprocess_server:subprocess_server.py:125 b'Jun 28, 2022 3:46:31 AM org.apache.flink.runtime.rest.RestServerEndpoint lambda$closeAsync$1'
INFO     apache_beam.utils.subprocess_server:subprocess_server.py:125 b'INFO: Shut down complete.'
INFO     apache_beam.utils.subprocess_server:subprocess_server.py:125 b'Jun 28, 2022 3:46:31 AM org.apache.flink.runtime.resourcemanager.ResourceManager deregisterApplication'
INFO     apache_beam.utils.subprocess_server:subprocess_server.py:125 b'INFO: Shut down cluster because application is in CANCELED, diagnostics DispatcherResourceManagerComponent has been closed..'
INFO     apache_beam.utils.subprocess_server:subprocess_server.py:125 b'Jun 28, 2022 3:46:31 AM org.apache.flink.runtime.io.disk.FileChannelManagerImpl lambda$getFileCloser$0'
INFO     apache_beam.utils.subprocess_server:subprocess_server.py:125 b'INFO: FileChannelManager removed spill file directory /tmp/flink-io-833bc097-9537-435d-9865-8239718d4e68'
INFO     apache_beam.utils.subprocess_server:subprocess_server.py:125 b'Jun 28, 2022 3:46:31 AM org.apache.flink.runtime.entrypoint.component.DispatcherResourceManagerComponent closeAsyncInternal'
INFO     apache_beam.utils.subprocess_server:subprocess_server.py:125 b'INFO: Closing components.'
INFO     apache_beam.utils.subprocess_server:subprocess_server.py:125 b'Jun 28, 2022 3:46:31 AM org.apache.flink.runtime.io.network.NettyShuffleEnvironment close'
INFO     apache_beam.utils.subprocess_server:subprocess_server.py:125 b'INFO: Shutting down the network environment and its components.'
INFO     apache_beam.utils.subprocess_server:subprocess_server.py:125 b'Jun 28, 2022 3:46:31 AM org.apache.flink.runtime.io.disk.FileChannelManagerImpl lambda$getFileCloser$0'
INFO     apache_beam.utils.subprocess_server:subprocess_server.py:125 b'INFO: FileChannelManager removed spill file directory /tmp/flink-netty-shuffle-ffa29836-2d22-4696-a39e-b3573df60be6'
INFO     apache_beam.utils.subprocess_server:subprocess_server.py:125 b'Jun 28, 2022 3:46:31 AM org.apache.flink.runtime.dispatcher.runner.AbstractDispatcherLeaderProcess closeInternal'
INFO     apache_beam.utils.subprocess_server:subprocess_server.py:125 b'INFO: Stopping SessionDispatcherLeaderProcess.'
INFO     apache_beam.utils.subprocess_server:subprocess_server.py:125 b'Jun 28, 2022 3:46:31 AM org.apache.flink.runtime.taskexecutor.KvStateService shutdown'
INFO     apache_beam.utils.subprocess_server:subprocess_server.py:125 b'INFO: Shutting down the kvState service and its components.'
INFO     apache_beam.utils.subprocess_server:subprocess_server.py:125 b'Jun 28, 2022 3:46:31 AM org.apache.flink.runtime.taskexecutor.DefaultJobLeaderService stop'
INFO     apache_beam.utils.subprocess_server:subprocess_server.py:125 b'INFO: Stop job leader service.'
INFO     apache_beam.utils.subprocess_server:subprocess_server.py:125 b'Jun 28, 2022 3:46:31 AM org.apache.flink.runtime.resourcemanager.ResourceManagerServiceImpl closeAsync'
INFO     apache_beam.utils.subprocess_server:subprocess_server.py:125 b'INFO: Stopping resource manager service.'
INFO     apache_beam.utils.subprocess_server:subprocess_server.py:125 b'Jun 28, 2022 3:46:31 AM org.apache.flink.runtime.filecache.FileCache shutdown'
INFO     apache_beam.utils.subprocess_server:subprocess_server.py:125 b'INFO: removed file cache directory /tmp/flink-dist-cache-3667bde1-fdf6-48a1-8b5d-999fa19c814a'
INFO     apache_beam.utils.subprocess_server:subprocess_server.py:125 b'Jun 28, 2022 3:46:31 AM org.apache.flink.runtime.resourcemanager.slotmanager.DeclarativeSlotManager close'
INFO     apache_beam.utils.subprocess_server:subprocess_server.py:125 b'INFO: Closing the slot manager.'
INFO     apache_beam.utils.subprocess_server:subprocess_server.py:125 b'Jun 28, 2022 3:46:31 AM org.apache.flink.runtime.resourcemanager.slotmanager.DeclarativeSlotManager suspend'
INFO     apache_beam.utils.subprocess_server:subprocess_server.py:125 b'INFO: Suspending the slot manager.'
INFO     apache_beam.utils.subprocess_server:subprocess_server.py:125 b'Jun 28, 2022 3:46:31 AM org.apache.flink.runtime.taskexecutor.TaskExecutor handleOnStopException'
INFO     apache_beam.utils.subprocess_server:subprocess_server.py:125 b'INFO: Stopped TaskExecutor akka://flink/user/rpc/taskmanager_0.'
INFO     apache_beam.utils.subprocess_server:subprocess_server.py:125 b'Jun 28, 2022 3:46:31 AM org.apache.flink.runtime.dispatcher.Dispatcher onStop'
INFO     apache_beam.utils.subprocess_server:subprocess_server.py:125 b'INFO: Stopping dispatcher akka://flink/user/rpc/dispatcher_2.'
INFO     apache_beam.utils.subprocess_server:subprocess_server.py:125 b'Jun 28, 2022 3:46:31 AM org.apache.flink.runtime.dispatcher.Dispatcher terminateRunningJobs'
INFO     apache_beam.utils.subprocess_server:subprocess_server.py:125 b'INFO: Stopping all currently running jobs of dispatcher akka://flink/user/rpc/dispatcher_2.'
INFO     apache_beam.utils.subprocess_server:subprocess_server.py:125 b'Jun 28, 2022 3:46:31 AM org.apache.flink.runtime.dispatcher.Dispatcher lambda$onStop$1'
INFO     apache_beam.utils.subprocess_server:subprocess_server.py:125 b'INFO: Stopped dispatcher akka://flink/user/rpc/dispatcher_2.'
INFO     apache_beam.utils.subprocess_server:subprocess_server.py:125 b'Jun 28, 2022 3:46:31 AM org.apache.flink.runtime.rpc.akka.AkkaRpcService stopService'
INFO     apache_beam.utils.subprocess_server:subprocess_server.py:125 b'INFO: Stopping Akka RPC service.'
INFO     apache_beam.utils.subprocess_server:subprocess_server.py:125 b'Jun 28, 2022 3:46:31 AM org.apache.flink.runtime.rpc.akka.AkkaRpcService stopService'
INFO     apache_beam.utils.subprocess_server:subprocess_server.py:125 b'INFO: Stopping Akka RPC service.'
INFO     apache_beam.utils.subprocess_server:subprocess_server.py:125 b'Jun 28, 2022 3:46:31 AM org.apache.flink.runtime.rpc.akka.AkkaRpcService lambda$stopService$8'
INFO     apache_beam.utils.subprocess_server:subprocess_server.py:125 b'INFO: Stopped Akka RPC service.'
INFO     apache_beam.utils.subprocess_server:subprocess_server.py:125 b'Jun 28, 2022 3:46:31 AM org.apache.flink.runtime.blob.AbstractBlobCache close'
INFO     apache_beam.utils.subprocess_server:subprocess_server.py:125 b'INFO: Shutting down BLOB cache'
INFO     apache_beam.utils.subprocess_server:subprocess_server.py:125 b'Jun 28, 2022 3:46:31 AM org.apache.flink.runtime.blob.AbstractBlobCache close'
INFO     apache_beam.utils.subprocess_server:subprocess_server.py:125 b'INFO: Shutting down BLOB cache'
INFO     apache_beam.utils.subprocess_server:subprocess_server.py:125 b'Jun 28, 2022 3:46:31 AM org.apache.flink.runtime.blob.BlobServer close'
INFO     apache_beam.utils.subprocess_server:subprocess_server.py:125 b'INFO: Stopped BLOB server at 0.0.0.0:34733'
INFO     apache_beam.utils.subprocess_server:subprocess_server.py:125 b'Jun 28, 2022 3:46:31 AM org.apache.flink.runtime.rpc.akka.AkkaRpcService lambda$stopService$8'
INFO     apache_beam.utils.subprocess_server:subprocess_server.py:125 b'INFO: Stopped Akka RPC service.'
INFO     apache_beam.io.gcp.gcsio:gcsio.py:583 Starting the file information of the input
INFO     apache_beam.io.gcp.gcsio:gcsio.py:610 Finished listing 11 files in 0.04256916046142578 seconds.
INFO     apache_beam.io.gcp.gcsio:gcsio.py:583 Starting the file information of the input
INFO     apache_beam.io.gcp.gcsio:gcsio.py:610 Finished listing 11 files in 0.04978585243225098 seconds.
INFO     apache_beam.io.gcp.gcsio:gcsio.py:583 Starting the file information of the input
INFO     apache_beam.io.gcp.gcsio:gcsio.py:610 Finished listing 33 files in 0.06622624397277832 seconds.
PASSED                                                                   [ 95%]
apache_beam/examples/dataframe/wordcount_test.py::WordCountTest::test_basics 
-------------------------------- live log call ---------------------------------
INFO     root:pipeline.py:188 Missing pipeline option (runner). Executing pipeline using the default runner: DirectRunner.
INFO     root:transforms.py:182 Computing dataframe stage <ComputeStage(PTransform) label=[[ComputedExpression[set_column_DataFrame_139856323359184], ComputedExpression[set_index_DataFrame_139856868452560], ComputedExpression[pre_combine_sum_DataFrame_139856282764560]]:139856291990224]> for Stage[inputs={PlaceholderExpression[placeholder_DataFrame_139857493791824]}, partitioning=Arbitrary, ops=[ComputedExpression[set_column_DataFrame_139856323359184], ComputedExpression[set_index_DataFrame_139856868452560], ComputedExpression[pre_combine_sum_DataFrame_139856282764560]], outputs={ComputedExpression[pre_combine_sum_DataFrame_139856282764560], PlaceholderExpression[placeholder_DataFrame_139857493791824]}]
INFO     root:transforms.py:182 Computing dataframe stage <ComputeStage(PTransform) label=[[ComputedExpression[post_combine_sum_DataFrame_139856834224784]]:139856323360336]> for Stage[inputs={ComputedExpression[pre_combine_sum_DataFrame_139856282764560]}, partitioning=Index, ops=[ComputedExpression[post_combine_sum_DataFrame_139856834224784]], outputs={ComputedExpression[post_combine_sum_DataFrame_139856834224784]}]
INFO     apache_beam.io.fileio:fileio.py:589 Added temporary directory /tmp/.temp987a0799-69ae-4b19-be9c-b997ed4d1388
INFO     root:environments.py:376 Default Python SDK image for environment is apache/beam_python3.7_sdk:2.41.0.dev
INFO     apache_beam.runners.portability.fn_api_runner.translations:translations.py:714 ==================== <function annotate_downstream_side_inputs at 0x7f3307bdfc20> ====================
INFO     apache_beam.runners.portability.fn_api_runner.translations:translations.py:714 ==================== <function fix_side_input_pcoll_coders at 0x7f3307bdfd40> ====================
INFO     apache_beam.runners.portability.fn_api_runner.translations:translations.py:714 ==================== <function pack_combiners at 0x7f3307be0290> ====================
INFO     apache_beam.runners.portability.fn_api_runner.translations:translations.py:714 ==================== <function lift_combiners at 0x7f3307be0320> ====================
INFO     apache_beam.runners.portability.fn_api_runner.translations:translations.py:714 ==================== <function expand_sdf at 0x7f3307be04d0> ====================
INFO     apache_beam.runners.portability.fn_api_runner.translations:translations.py:714 ==================== <function expand_gbk at 0x7f3307be0560> ====================
INFO     apache_beam.runners.portability.fn_api_runner.translations:translations.py:714 ==================== <function sink_flattens at 0x7f3307be0680> ====================
INFO     apache_beam.runners.portability.fn_api_runner.translations:translations.py:714 ==================== <function greedily_fuse at 0x7f3307be0710> ====================
INFO     apache_beam.runners.portability.fn_api_runner.translations:translations.py:714 ==================== <function read_to_impulse at 0x7f3307be07a0> ====================
INFO     apache_beam.runners.portability.fn_api_runner.translations:translations.py:714 ==================== <function impulse_to_input at 0x7f3307be0830> ====================
INFO     apache_beam.runners.portability.fn_api_runner.translations:translations.py:714 ==================== <function sort_stages at 0x7f3307be0a70> ====================
INFO     apache_beam.runners.portability.fn_api_runner.translations:translations.py:714 ==================== <function add_impulse_to_dangling_transforms at 0x7f3307be0b90> ====================
INFO     apache_beam.runners.portability.fn_api_runner.translations:translations.py:714 ==================== <function setup_timer_mapping at 0x7f3307be09e0> ====================
INFO     apache_beam.runners.portability.fn_api_runner.translations:translations.py:714 ==================== <function populate_data_channel_coders at 0x7f3307be0b00> ====================
INFO     apache_beam.runners.worker.statecache:statecache.py:172 Creating state cache with size 100
INFO     apache_beam.runners.portability.fn_api_runner.worker_handlers:worker_handlers.py:919 Created Worker handler <apache_beam.runners.portability.fn_api_runner.worker_handlers.EmbeddedWorkerHandler object at 0x7f32d7731890> for environment ref_Environment_default_environment_1 (beam:env:embedded_python:v1, b'')
INFO     apache_beam.io.fileio:fileio.py:676 Moving temporary file /tmp/.temp987a0799-69ae-4b19-be9c-b997ed4d1388/505433658786295208_d9d6dbf3-5c0c-4fbc-9ae8-d63f3d98f762 to dir: /tmp as tmpuevtjh7k.result-00000-of-00001. Res: FileResult(file_name='/tmp/.temp987a0799-69ae-4b19-be9c-b997ed4d1388/505433658786295208_d9d6dbf3-5c0c-4fbc-9ae8-d63f3d98f762', shard_index=-1, total_shards=0, window=GlobalWindow, pane=None, destination=None)
INFO     apache_beam.io.fileio:fileio.py:699 Checking orphaned temporary files for destination None and window GlobalWindow
INFO     apache_beam.io.fileio:fileio.py:712 Some files may be left orphaned in the temporary folder: []
PASSED                                                                   [100%]

=============================== warnings summary ===============================
apache_beam/examples/complete/game/hourly_team_score_it_test.py::HourlyTeamScoreIT::test_hourly_team_score_output_checksum_on_small_input
  <https://ci-beam.apache.org/job/beam_PostCommit_Python_Examples_Flink/ws/src/sdks/python/apache_beam/io/gcp/tests/utils.py>:63: PendingDeprecationWarning: Client.dataset is deprecated and will be removed in a future version. Use a string like 'my_project.my_dataset' or a cloud.google.bigquery.DatasetReference object, instead.
    dataset_ref = client.dataset(unique_dataset_name, project=project)

apache_beam/examples/complete/game/hourly_team_score_it_test.py::HourlyTeamScoreIT::test_hourly_team_score_output_checksum_on_small_input
apache_beam/examples/cookbook/bigquery_tornadoes_it_test.py::BigqueryTornadoesIT::test_bigquery_tornadoes_it
apache_beam/examples/cookbook/filters_test.py::FiltersTest::test_filters_output_bigquery_matcher
  <https://ci-beam.apache.org/job/beam_PostCommit_Python_Examples_Flink/ws/src/sdks/python/apache_beam/io/gcp/bigquery.py>:2205: BeamDeprecationWarning: options is deprecated since First stable release. References to <pipeline>.options will not be supported
    is_streaming_pipeline = p.options.view_as(StandardOptions).streaming

apache_beam/examples/complete/game/hourly_team_score_it_test.py::HourlyTeamScoreIT::test_hourly_team_score_output_checksum_on_small_input
apache_beam/examples/cookbook/bigquery_tornadoes_it_test.py::BigqueryTornadoesIT::test_bigquery_tornadoes_it
apache_beam/examples/cookbook/filters_test.py::FiltersTest::test_filters_output_bigquery_matcher
  <https://ci-beam.apache.org/job/beam_PostCommit_Python_Examples_Flink/ws/src/sdks/python/apache_beam/io/gcp/bigquery.py>:2211: BeamDeprecationWarning: options is deprecated since First stable release. References to <pipeline>.options will not be supported
    experiments = p.options.view_as(DebugOptions).experiments or []

apache_beam/examples/complete/game/hourly_team_score_it_test.py::HourlyTeamScoreIT::test_hourly_team_score_output_checksum_on_small_input
apache_beam/examples/cookbook/bigquery_tornadoes_it_test.py::BigqueryTornadoesIT::test_bigquery_tornadoes_it
apache_beam/examples/cookbook/filters_test.py::FiltersTest::test_filters_output_bigquery_matcher
  <https://ci-beam.apache.org/job/beam_PostCommit_Python_Examples_Flink/ws/src/sdks/python/apache_beam/io/gcp/bigquery_file_loads.py>:1129: BeamDeprecationWarning: options is deprecated since First stable release. References to <pipeline>.options will not be supported
    temp_location = p.options.view_as(GoogleCloudOptions).temp_location

apache_beam/examples/complete/game/hourly_team_score_it_test.py::HourlyTeamScoreIT::test_hourly_team_score_output_checksum_on_small_input
apache_beam/examples/cookbook/bigquery_tornadoes_it_test.py::BigqueryTornadoesIT::test_bigquery_tornadoes_it
apache_beam/examples/cookbook/filters_test.py::FiltersTest::test_filters_output_bigquery_matcher
  <https://ci-beam.apache.org/job/beam_PostCommit_Python_Examples_Flink/ws/src/sdks/python/apache_beam/io/gcp/bigquery_file_loads.py>:1131: BeamDeprecationWarning: options is deprecated since First stable release. References to <pipeline>.options will not be supported
    p.options.view_as(GoogleCloudOptions).job_name or 'AUTOMATIC_JOB_NAME')

apache_beam/examples/cookbook/bigquery_side_input_it_test.py::BigQuerySideInputIT::test_bigquery_side_input_it
apache_beam/examples/cookbook/bigquery_side_input_it_test.py::BigQuerySideInputIT::test_bigquery_side_input_it
apache_beam/examples/cookbook/bigquery_tornadoes_it_test.py::BigqueryTornadoesIT::test_bigquery_tornadoes_it
apache_beam/examples/cookbook/filters_test.py::FiltersTest::test_filters_output_bigquery_matcher
apache_beam/examples/dataframe/flight_delays_it_test.py::FlightDelaysTest::test_flight_delays
  <https://ci-beam.apache.org/job/beam_PostCommit_Python_Examples_Flink/ws/src/sdks/python/apache_beam/io/gcp/bigquery.py>:2527: BeamDeprecationWarning: options is deprecated since First stable release. References to <pipeline>.options will not be supported
    temp_location = pcoll.pipeline.options.view_as(

apache_beam/examples/cookbook/bigquery_side_input_it_test.py::BigQuerySideInputIT::test_bigquery_side_input_it
apache_beam/examples/cookbook/bigquery_side_input_it_test.py::BigQuerySideInputIT::test_bigquery_side_input_it
apache_beam/examples/cookbook/bigquery_tornadoes_it_test.py::BigqueryTornadoesIT::test_bigquery_tornadoes_it
apache_beam/examples/cookbook/filters_test.py::FiltersTest::test_filters_output_bigquery_matcher
apache_beam/examples/dataframe/flight_delays_it_test.py::FlightDelaysTest::test_flight_delays
  <https://ci-beam.apache.org/job/beam_PostCommit_Python_Examples_Flink/ws/src/sdks/python/apache_beam/io/gcp/bigquery.py>:2529: BeamDeprecationWarning: options is deprecated since First stable release. References to <pipeline>.options will not be supported
    job_name = pcoll.pipeline.options.view_as(GoogleCloudOptions).job_name

apache_beam/examples/cookbook/bigquery_side_input_it_test.py::BigQuerySideInputIT::test_bigquery_side_input_it
apache_beam/examples/cookbook/bigquery_side_input_it_test.py::BigQuerySideInputIT::test_bigquery_side_input_it
apache_beam/examples/cookbook/bigquery_tornadoes_it_test.py::BigqueryTornadoesIT::test_bigquery_tornadoes_it
apache_beam/examples/cookbook/filters_test.py::FiltersTest::test_filters_output_bigquery_matcher
apache_beam/examples/dataframe/flight_delays_it_test.py::FlightDelaysTest::test_flight_delays
  <https://ci-beam.apache.org/job/beam_PostCommit_Python_Examples_Flink/ws/src/sdks/python/apache_beam/io/gcp/bigquery.py>:2560: BeamDeprecationWarning: options is deprecated since First stable release. References to <pipeline>.options will not be supported
    | _PassThroughThenCleanup(files_to_remove_pcoll))

apache_beam/examples/cookbook/bigquery_tornadoes_it_test.py::BigqueryTornadoesIT::test_bigquery_tornadoes_it
apache_beam/examples/cookbook/filters_test.py::FiltersTest::test_filters_output_bigquery_matcher
  <https://ci-beam.apache.org/job/beam_PostCommit_Python_Examples_Flink/ws/src/sdks/python/apache_beam/io/gcp/bigquery.py>:2201: BeamDeprecationWarning: options is deprecated since First stable release. References to <pipeline>.options will not be supported
    self.table_reference.projectId = pcoll.pipeline.options.view_as(

apache_beam/examples/cookbook/bigquery_tornadoes_it_test.py::BigqueryTornadoesIT::test_bigquery_tornadoes_it
apache_beam/examples/cookbook/filters_test.py::FiltersTest::test_filters_output_bigquery_matcher
  <https://ci-beam.apache.org/job/beam_PostCommit_Python_Examples_Flink/ws/src/sdks/python/apache_beam/io/gcp/tests/utils.py>:100: PendingDeprecationWarning: Client.dataset is deprecated and will be removed in a future version. Use a string like 'my_project.my_dataset' or a cloud.google.bigquery.DatasetReference object, instead.
    table_ref = client.dataset(dataset_id).table(table_id)

apache_beam/examples/dataframe/flight_delays_it_test.py::FlightDelaysTest::test_flight_delays
apache_beam/examples/dataframe/flight_delays_it_test.py::FlightDelaysTest::test_flight_delays
  <https://ci-beam.apache.org/job/beam_PostCommit_Python_Examples_Flink/ws/src/sdks/python/apache_beam/examples/dataframe/flight_delays.py>:47: FutureWarning: Dropping of nuisance columns in DataFrame reductions (with 'numeric_only=None') is deprecated; in a future version this will raise TypeError.  Select only valid columns before calling the reduction.
    return airline_df[at_top_airports].mean()

apache_beam/examples/dataframe/flight_delays_it_test.py::FlightDelaysTest::test_flight_delays
apache_beam/examples/dataframe/wordcount_test.py::WordCountTest::test_basics
  <https://ci-beam.apache.org/job/beam_PostCommit_Python_Examples_Flink/ws/src/sdks/python/apache_beam/io/fileio.py>:584: BeamDeprecationWarning: options is deprecated since First stable release. References to <pipeline>.options will not be supported
    p.options.view_as(GoogleCloudOptions).temp_location or

-- Docs: https://docs.pytest.org/en/latest/warnings.html
- generated xml file: <https://ci-beam.apache.org/job/beam_PostCommit_Python_Examples_Flink/ws/src/sdks/python/pytest_postCommitExamples-flink-py37.xml> -
===== 22 passed, 2 skipped, 5756 deselected, 36 warnings in 403.58 seconds =====

Exception in thread read_grpc_client_inputs:
Traceback (most recent call last):
  File "/usr/lib/python3.7/threading.py", line 926, in _bootstrap_inner
    self.run()
  File "/usr/lib/python3.7/threading.py", line 870, in run
    self._target(*self._args, **self._kwargs)
  File "<https://ci-beam.apache.org/job/beam_PostCommit_Python_Examples_Flink/ws/src/sdks/python/apache_beam/runners/worker/data_plane.py",> line 671, in <lambda>
    target=lambda: self._read_inputs(elements_iterator),
  File "<https://ci-beam.apache.org/job/beam_PostCommit_Python_Examples_Flink/ws/src/sdks/python/apache_beam/runners/worker/data_plane.py",> line 654, in _read_inputs
    for elements in elements_iterator:
  File "<https://ci-beam.apache.org/job/beam_PostCommit_Python_Examples_Flink/ws/src/build/gradleenv/2022703441/lib/python3.7/site-packages/grpc/_channel.py",> line 426, in __next__
    return self._next()
  File "<https://ci-beam.apache.org/job/beam_PostCommit_Python_Examples_Flink/ws/src/build/gradleenv/2022703441/lib/python3.7/site-packages/grpc/_channel.py",> line 826, in _next
    raise self
grpc._channel._MultiThreadedRendezvous: <_MultiThreadedRendezvous of RPC that terminated with:
	status = StatusCode.CANCELLED
	details = "Multiplexer hanging up"
	debug_error_string = "{"created":"@1656387889.994535517","description":"Error received from peer ipv6:[::1]:34335","file":"src/core/lib/surface/call.cc","file_line":966,"grpc_message":"Multiplexer hanging up","grpc_status":1}"
>

Exception in thread read_grpc_client_inputs:
Traceback (most recent call last):
  File "/usr/lib/python3.7/threading.py", line 926, in _bootstrap_inner
    self.run()
  File "/usr/lib/python3.7/threading.py", line 870, in run
    self._target(*self._args, **self._kwargs)
  File "<https://ci-beam.apache.org/job/beam_PostCommit_Python_Examples_Flink/ws/src/sdks/python/apache_beam/runners/worker/data_plane.py",> line 671, in <lambda>
    target=lambda: self._read_inputs(elements_iterator),
  File "<https://ci-beam.apache.org/job/beam_PostCommit_Python_Examples_Flink/ws/src/sdks/python/apache_beam/runners/worker/data_plane.py",> line 654, in _read_inputs
    for elements in elements_iterator:
  File "<https://ci-beam.apache.org/job/beam_PostCommit_Python_Examples_Flink/ws/src/build/gradleenv/2022703441/lib/python3.7/site-packages/grpc/_channel.py",> line 426, in __next__
    return self._next()
  File "<https://ci-beam.apache.org/job/beam_PostCommit_Python_Examples_Flink/ws/src/build/gradleenv/2022703441/lib/python3.7/site-packages/grpc/_channel.py",> line 826, in _next
    raise self
grpc._channel._MultiThreadedRendezvous: <_MultiThreadedRendezvous of RPC that terminated with:
	status = StatusCode.CANCELLED
	details = "Multiplexer hanging up"
	debug_error_string = "{"created":"@1656387893.351641464","description":"Error received from peer ipv6:[::1]:32989","file":"src/core/lib/surface/call.cc","file_line":966,"grpc_message":"Multiplexer hanging up","grpc_status":1}"
>

Exception in thread read_grpc_client_inputs:
Traceback (most recent call last):
  File "/usr/lib/python3.7/threading.py", line 926, in _bootstrap_inner
    self.run()
  File "/usr/lib/python3.7/threading.py", line 870, in run
    self._target(*self._args, **self._kwargs)
  File "<https://ci-beam.apache.org/job/beam_PostCommit_Python_Examples_Flink/ws/src/sdks/python/apache_beam/runners/worker/data_plane.py",> line 671, in <lambda>
    target=lambda: self._read_inputs(elements_iterator),
  File "<https://ci-beam.apache.org/job/beam_PostCommit_Python_Examples_Flink/ws/src/sdks/python/apache_beam/runners/worker/data_plane.py",> line 654, in _read_inputs
    for elements in elements_iterator:
  File "<https://ci-beam.apache.org/job/beam_PostCommit_Python_Examples_Flink/ws/src/build/gradleenv/2022703441/lib/python3.7/site-packages/grpc/_channel.py",> line 426, in __next__
    return self._next()
  File "<https://ci-beam.apache.org/job/beam_PostCommit_Python_Examples_Flink/ws/src/build/gradleenv/2022703441/lib/python3.7/site-packages/grpc/_channel.py",> line 826, in _next
    raise self
grpc._channel._MultiThreadedRendezvous: <_MultiThreadedRendezvous of RPC that terminated with:
	status = StatusCode.CANCELLED
	details = "Multiplexer hanging up"
	debug_error_string = "{"created":"@1656387893.472578407","description":"Error received from peer ipv6:[::1]:43063","file":"src/core/lib/surface/call.cc","file_line":966,"grpc_message":"Multiplexer hanging up","grpc_status":1}"
>


FAILURE: Build failed with an exception.

* What went wrong:
Execution failed for task ':sdks:python:test-suites:portable:py39:installGcpTest'.
> Process 'command 'sh'' finished with non-zero exit value 1

* Try:
> Run with --stacktrace option to get the stack trace.
> Run with --info or --debug option to get more log output.
> Run with --scan to get full insights.

* Get more help at https://help.gradle.org

Deprecated Gradle features were used in this build, making it incompatible with Gradle 8.0.

You can use '--warning-mode all' to show the individual deprecation warnings and determine if they come from your own scripts or plugins.

See https://docs.gradle.org/7.4/userguide/command_line_interface.html#sec:command_line_warnings

BUILD FAILED in 8m 30s
132 actionable tasks: 86 executed, 44 from cache, 2 up-to-date

Publishing build scan...
https://gradle.com/s/cu6thkjis35wy

Build step 'Invoke Gradle script' changed build result to FAILURE
Build step 'Invoke Gradle script' marked build as failure

---------------------------------------------------------------------
To unsubscribe, e-mail: builds-unsubscribe@beam.apache.org
For additional commands, e-mail: builds-help@beam.apache.org


Jenkins build is back to normal : beam_PostCommit_Python_Examples_Flink #561

Posted by Apache Jenkins Server <je...@builds.apache.org>.
See <https://ci-beam.apache.org/job/beam_PostCommit_Python_Examples_Flink/561/display/redirect>


---------------------------------------------------------------------
To unsubscribe, e-mail: builds-unsubscribe@beam.apache.org
For additional commands, e-mail: builds-help@beam.apache.org