You are viewing a plain text version of this content. The canonical link for it is here.
Posted to dev@lucene.apache.org by Apache Jenkins Server <je...@builds.apache.org> on 2012/10/23 20:08:03 UTC
[JENKINS] Lucene-Solr-Tests-trunk-java7 - Build # 3335 - Failure
Build: https://builds.apache.org/job/Lucene-Solr-Tests-trunk-java7/3335/
All tests passed
Build Log:
[...truncated 24628 lines...]
-documentation-lint:
[echo] Checking for broken links...
[exec]
[exec] Crawl/parse...
[exec]
[exec] Verify...
[echo] Checking for missing docs...
[exec]
[exec] build/docs/classification/org/apache/lucene/classification/ClassificationResult.html
[exec] missing Constructors: ClassificationResult(java.lang.String, double)
[exec] missing Methods: getAssignedClass()
[exec] missing Methods: getScore()
[exec]
[exec] build/docs/classification/org/apache/lucene/classification/KNearestNeighborClassifier.html
[exec] missing Constructors: KNearestNeighborClassifier(int)
[exec]
[exec] Missing javadocs were found!
BUILD FAILED
/usr/home/hudson/hudson-slave/workspace/Lucene-Solr-Tests-trunk-java7/build.xml:60: The following error occurred while executing this line:
/usr/home/hudson/hudson-slave/workspace/Lucene-Solr-Tests-trunk-java7/lucene/build.xml:252: The following error occurred while executing this line:
/usr/home/hudson/hudson-slave/workspace/Lucene-Solr-Tests-trunk-java7/lucene/common-build.xml:1919: exec returned: 1
Total time: 46 minutes 30 seconds
Build step 'Invoke Ant' marked build as failure
Archiving artifacts
Recording test results
Email was triggered for: Failure
Sending email for trigger: Failure
[JENKINS] Lucene-Solr-Tests-trunk-java7 - Build # 3337 - Still
Failing
Posted by Apache Jenkins Server <je...@builds.apache.org>.
Build: https://builds.apache.org/job/Lucene-Solr-Tests-trunk-java7/3337/
All tests passed
Build Log:
[...truncated 24620 lines...]
-documentation-lint:
[echo] Checking for broken links...
[exec]
[exec] Crawl/parse...
[exec]
[exec] Verify...
[echo] Checking for missing docs...
[exec]
[exec] build/docs/classification/org/apache/lucene/classification/ClassificationResult.html
[exec] missing Constructors: ClassificationResult(java.lang.String, double)
[exec] missing Methods: getAssignedClass()
[exec] missing Methods: getScore()
[exec]
[exec] build/docs/classification/org/apache/lucene/classification/KNearestNeighborClassifier.html
[exec] missing Constructors: KNearestNeighborClassifier(int)
[exec]
[exec] Missing javadocs were found!
BUILD FAILED
/usr/home/hudson/hudson-slave/workspace/Lucene-Solr-Tests-trunk-java7/build.xml:60: The following error occurred while executing this line:
/usr/home/hudson/hudson-slave/workspace/Lucene-Solr-Tests-trunk-java7/lucene/build.xml:252: The following error occurred while executing this line:
/usr/home/hudson/hudson-slave/workspace/Lucene-Solr-Tests-trunk-java7/lucene/common-build.xml:1919: exec returned: 1
Total time: 45 minutes 27 seconds
Build step 'Invoke Ant' marked build as failure
Archiving artifacts
Recording test results
Email was triggered for: Failure
Sending email for trigger: Failure
[JENKINS] Lucene-Solr-Tests-trunk-java7 - Build # 3336 - Still
Failing
Posted by Apache Jenkins Server <je...@builds.apache.org>.
Build: https://builds.apache.org/job/Lucene-Solr-Tests-trunk-java7/3336/
All tests passed
Build Log:
[...truncated 24623 lines...]
-documentation-lint:
[echo] Checking for broken links...
[exec]
[exec] Crawl/parse...
[exec]
[exec] Verify...
[echo] Checking for missing docs...
[exec]
[exec] build/docs/classification/org/apache/lucene/classification/KNearestNeighborClassifier.html
[exec] missing Constructors: KNearestNeighborClassifier(int)
[exec]
[exec] build/docs/classification/org/apache/lucene/classification/ClassificationResult.html
[exec] missing Constructors: ClassificationResult(java.lang.String, double)
[exec] missing Methods: getAssignedClass()
[exec] missing Methods: getScore()
[exec]
[exec] Missing javadocs were found!
BUILD FAILED
/usr/home/hudson/hudson-slave/workspace/Lucene-Solr-Tests-trunk-java7/build.xml:60: The following error occurred while executing this line:
/usr/home/hudson/hudson-slave/workspace/Lucene-Solr-Tests-trunk-java7/lucene/build.xml:252: The following error occurred while executing this line:
/usr/home/hudson/hudson-slave/workspace/Lucene-Solr-Tests-trunk-java7/lucene/common-build.xml:1919: exec returned: 1
Total time: 43 minutes 24 seconds
Build step 'Invoke Ant' marked build as failure
Archiving artifacts
Recording test results
Email was triggered for: Failure
Sending email for trigger: Failure