You are viewing a plain text version of this content. The canonical link for it is here.
Posted to builds@beam.apache.org by Apache Jenkins Server <je...@builds.apache.org> on 2022/07/30 09:25:11 UTC
Build failed in Jenkins: beam_PostCommit_Java_Nexmark_Dataflow_V2_Java17 #882
See <https://ci-beam.apache.org/job/beam_PostCommit_Java_Nexmark_Dataflow_V2_Java17/882/display/redirect>
Changes:
------------------------------------------
[...truncated 12.46 KB...]
> Task :sdks:java:harness:createCheckerFrameworkManifest
> Task :runners:local-java:createCheckerFrameworkManifest
> Task :sdks:java:harness:processResources NO-SOURCE
> Task :runners:local-java:processResources NO-SOURCE
> Task :sdks:java:extensions:google-cloud-platform-core:createCheckerFrameworkManifest
> Task :runners:java-fn-execution:createCheckerFrameworkManifest
> Task :runners:direct-java:processResources NO-SOURCE
> Task :sdks:java:extensions:google-cloud-platform-core:processResources NO-SOURCE
> Task :runners:java-fn-execution:processResources NO-SOURCE
> Task :sdks:java:expansion-service:createCheckerFrameworkManifest
> Task :model:fn-execution:processResources
> Task :model:job-management:processResources
> Task :sdks:java:core:generateGrammarSource FROM-CACHE
> Task :sdks:java:expansion-service:processResources NO-SOURCE
> Task :sdks:java:io:kafka:createCheckerFrameworkManifest
> Task :sdks:java:io:kafka:processResources NO-SOURCE
> Task :runners:google-cloud-dataflow-java:createCheckerFrameworkManifest
> Task :sdks:java:extensions:arrow:createCheckerFrameworkManifest
> Task :sdks:java:container:java17:copyJdkOptions
> Task :sdks:java:extensions:arrow:processResources NO-SOURCE
> Task :sdks:java:extensions:protobuf:createCheckerFrameworkManifest
> Task :sdks:java:io:google-cloud-platform:createCheckerFrameworkManifest
> Task :release:go-licenses:java:copyLicenses
> Task :release:go-licenses:java:dockerClean UP-TO-DATE
> Task :sdks:java:io:google-cloud-platform:processResources NO-SOURCE
> Task :sdks:java:extensions:protobuf:extractProto
> Task :sdks:java:extensions:protobuf:processResources NO-SOURCE
> Task :sdks:java:extensions:join-library:createCheckerFrameworkManifest
> Task :sdks:java:container:java17:copyLicenses
> Task :sdks:java:extensions:join-library:processResources NO-SOURCE
> Task :sdks:java:container:java17:dockerClean UP-TO-DATE
> Task :release:go-licenses:java:dockerPrepare
> Task :sdks:java:io:mongodb:createCheckerFrameworkManifest
> Task :sdks:java:io:hadoop-common:createCheckerFrameworkManifest
> Task :sdks:java:io:mongodb:processResources NO-SOURCE
> Task :sdks:java:io:hadoop-common:processResources NO-SOURCE
> Task :sdks:java:io:parquet:createCheckerFrameworkManifest
> Task :sdks:java:extensions:sql:udf:createCheckerFrameworkManifest
> Task :sdks:java:io:parquet:processResources NO-SOURCE
> Task :runners:google-cloud-dataflow-java:processResources
> Task :sdks:java:core:processResources
> Task :sdks:java:extensions:sql:zetasql:createCheckerFrameworkManifest
> Task :sdks:java:testing:test-utils:createCheckerFrameworkManifest
> Task :sdks:java:testing:nexmark:createCheckerFrameworkManifest
> Task :sdks:java:extensions:sql:zetasql:processResources NO-SOURCE
> Task :sdks:java:testing:test-utils:processResources NO-SOURCE
> Task :sdks:java:testing:nexmark:processResources
> Task :sdks:java:extensions:sql:udf:compileJava FROM-CACHE
> Task :sdks:java:extensions:sql:udf:processResources NO-SOURCE
> Task :sdks:java:extensions:sql:udf:classes UP-TO-DATE
> Task :sdks:java:extensions:sql:udf:jar
> Task :sdks:java:container:downloadCloudProfilerAgent
version.txt
NOTICES
profiler_java_agent.so
> Task :release:go-licenses:java:docker
Sending build context to Docker daemon 6.656kB
Step 1/8 : FROM golang:1.18-bullseye
---> e3c0472b1b62
Step 2/8 : WORKDIR /usr/src/app
---> Using cache
---> 3bc9bebefb6b
Step 3/8 : COPY go.mod ./
---> Using cache
---> d086d5736231
Step 4/8 : RUN go install github.com/google/go-licenses@latest
---> Using cache
---> bc4a07053926
Step 5/8 : COPY get-licenses.sh /opt/apache/beam/
---> Using cache
---> a450829f7621
Step 6/8 : ARG sdk_location
---> Using cache
---> 257d9fa2543f
Step 7/8 : ENV sdk_location=$sdk_location
---> Using cache
---> 74ed2813e543
Step 8/8 : ENTRYPOINT /opt/apache/beam/get-licenses.sh
---> Using cache
---> 0028d1eda794
Successfully built 0028d1eda794
Successfully tagged golicenses-java:latest
> Task :model:pipeline:extractIncludeProto
> Task :model:pipeline:extractProto
> Task :model:pipeline:generateProto FROM-CACHE
> Task :sdks:java:extensions:sql:copyFmppTemplatesFromCalciteCore
> Task :sdks:java:extensions:sql:copyFmppTemplatesFromSrc
> Task :model:pipeline:compileJava FROM-CACHE
> Task :model:pipeline:processResources
> Task :model:pipeline:classes
> Task :model:pipeline:jar
> Task :model:pipeline:shadowJar FROM-CACHE
> Task :release:go-licenses:java:dockerRun
+ rm -rf '/output/*'
+ go get github.com/apache/beam/sdks/v2/java/container
> Task :sdks:java:extensions:sql:generateFmppSources
> Task :model:fn-execution:extractIncludeProto
> Task :model:job-management:extractIncludeProto
> Task :model:fn-execution:generateProto FROM-CACHE
> Task :model:job-management:generateProto FROM-CACHE
> Task :model:job-management:compileJava FROM-CACHE
> Task :model:job-management:classes
> Task :model:fn-execution:compileJava FROM-CACHE
> Task :model:fn-execution:classes
> Task :model:fn-execution:shadowJar FROM-CACHE
> Task :model:job-management:shadowJar FROM-CACHE
> Task :release:go-licenses:java:dockerRun
go: downloading github.com/apache/beam/sdks/v2 v2.40.0
go: downloading github.com/apache/beam v2.40.0+incompatible
> Task :sdks:java:core:compileJava FAILED
> Task :sdks:java:extensions:sql:compileJavacc
Java Compiler Compiler Version 4.0 (Parser Generator)
(type "javacc" with no arguments for help)
Reading from file <https://ci-beam.apache.org/job/beam_PostCommit_Java_Nexmark_Dataflow_V2_Java17/ws/src/sdks/java/extensions/sql/build/generated/fmpp/javacc/Parser.jj> . . .
Note: UNICODE_INPUT option is specified. Please make sure you create the parser/lexer using a Reader with the correct character encoding.
Warning: Lookahead adequacy checking not being performed since option LOOKAHEAD is more than 1. Set option FORCE_LA_CHECK to true to force checking.
File "TokenMgrError.java" does not exist. Will create one.
File "ParseException.java" does not exist. Will create one.
File "Token.java" does not exist. Will create one.
File "SimpleCharStream.java" does not exist. Will create one.
Parser generated with 0 errors and 1 warnings.
> Task :sdks:java:extensions:sql:createCheckerFrameworkManifest
> Task :sdks:java:extensions:sql:processResources
> Task :sdks:java:container:generateLicenseReport
> Task :release:go-licenses:java:dockerRun
go: downloading github.com/golang/protobuf v1.5.2
go: downloading google.golang.org/grpc v1.47.0
go: downloading google.golang.org/protobuf v1.28.0
go: downloading google.golang.org/genproto v0.0.0-20220602131408-e326c6e8e9c8
go: downloading golang.org/x/net v0.0.0-20220607020251-c690dde0001d
go: downloading golang.org/x/sys v0.0.0-20220520151302-bc2c85ada10a
go: downloading golang.org/x/text v0.3.7
go: added github.com/apache/beam/sdks/v2 v2.40.0
go: added github.com/golang/protobuf v1.5.2
go: added golang.org/x/net v0.0.0-20220607020251-c690dde0001d
go: added golang.org/x/sys v0.0.0-20220520151302-bc2c85ada10a
go: added golang.org/x/text v0.3.7
go: added google.golang.org/genproto v0.0.0-20220602131408-e326c6e8e9c8
go: added google.golang.org/grpc v1.47.0
go: added google.golang.org/protobuf v1.28.0
+ go-licenses save github.com/apache/beam/sdks/v2/java/container --save_path=/output/licenses
W0730 09:24:51.811174 30 library.go:94] "golang.org/x/sys/unix" contains non-Go code that can't be inspected for further dependencies:
/go/pkg/mod/golang.org/x/sys@v0.0.0-20220520151302-bc2c85ada10a/unix/asm_linux_amd64.s
+ go-licenses csv github.com/apache/beam/sdks/v2/java/container
+ tee /output/licenses/list.csv
W0730 09:24:55.935433 189 library.go:94] "golang.org/x/sys/unix" contains non-Go code that can't be inspected for further dependencies:
/go/pkg/mod/golang.org/x/sys@v0.0.0-20220520151302-bc2c85ada10a/unix/asm_linux_amd64.s
github.com/apache/beam/sdks/v2/go/pkg/beam,https://github.com/apache/beam/blob/sdks/v2.40.0/sdks/go/README.md,Apache-2.0
github.com/apache/beam/sdks/v2/java/container,https://github.com/apache/beam/blob/sdks/v2.40.0/sdks/LICENSE,Apache-2.0
github.com/golang/protobuf,https://github.com/golang/protobuf/blob/v1.5.2/LICENSE,BSD-3-Clause
golang.org/x/net,https://cs.opensource.google/go/x/net/+/c690dde0:LICENSE,BSD-3-Clause
golang.org/x/sys,https://cs.opensource.google/go/x/sys/+/bc2c85ad:LICENSE,BSD-3-Clause
golang.org/x/text,https://cs.opensource.google/go/x/text/+/v0.3.7:LICENSE,BSD-3-Clause
google.golang.org/genproto/googleapis/rpc/status,https://github.com/googleapis/go-genproto/blob/e326c6e8e9c8/LICENSE,Apache-2.0
google.golang.org/grpc,https://github.com/grpc/grpc-go/blob/v1.47.0/LICENSE,Apache-2.0
google.golang.org/protobuf,https://github.com/protocolbuffers/protobuf-go/blob/v1.28.0/LICENSE,BSD-3-Clause
+ chmod -R a+w /output/licenses
> Task :release:go-licenses:java:createLicenses
> Task :sdks:java:container:java17:copyGolangLicenses
> Task :sdks:java:container:pullLicenses
Copying already-fetched licenses from <https://ci-beam.apache.org/job/beam_PostCommit_Java_Nexmark_Dataflow_V2_Java17/ws/src/sdks/java/container/build/reports/dependency-license> to <https://ci-beam.apache.org/job/beam_PostCommit_Java_Nexmark_Dataflow_V2_Java17/ws/src/sdks/java/container/build/target/java_third_party_licenses>
Collecting pip
Using cached pip-22.2.1-py3-none-any.whl (2.0 MB)
Collecting setuptools
Using cached setuptools-63.2.0-py3-none-any.whl (1.2 MB)
Collecting wheel
Using cached wheel-0.37.1-py2.py3-none-any.whl (35 kB)
Installing collected packages: pip, setuptools, wheel
Attempting uninstall: pip
Found existing installation: pip 20.0.2
Uninstalling pip-20.0.2:
Successfully uninstalled pip-20.0.2
Attempting uninstall: setuptools
Found existing installation: setuptools 44.0.0
Uninstalling setuptools-44.0.0:
Successfully uninstalled setuptools-44.0.0
Successfully installed pip-22.2.1 setuptools-63.2.0 wheel-0.37.1
Collecting beautifulsoup4<5.0,>=4.9.0
Using cached beautifulsoup4-4.11.1-py3-none-any.whl (128 kB)
Collecting pyyaml<6.0.0,>=3.12
Using cached PyYAML-5.4.1-cp38-cp38-manylinux1_x86_64.whl (662 kB)
Collecting tenacity<6.0,>=5.0.2
Using cached tenacity-5.1.5-py2.py3-none-any.whl (34 kB)
Collecting soupsieve>1.2
Using cached soupsieve-2.3.2.post1-py3-none-any.whl (37 kB)
Collecting six>=1.9.0
Using cached six-1.16.0-py2.py3-none-any.whl (11 kB)
Installing collected packages: soupsieve, six, pyyaml, tenacity, beautifulsoup4
Successfully installed beautifulsoup4-4.11.1 pyyaml-5.4.1 six-1.16.0 soupsieve-2.3.2.post1 tenacity-5.1.5
Executing python <https://ci-beam.apache.org/job/beam_PostCommit_Java_Nexmark_Dataflow_V2_Java17/ws/src/sdks/java/container/license_scripts/pull_licenses_java.py> --license_index=<https://ci-beam.apache.org/job/beam_PostCommit_Java_Nexmark_Dataflow_V2_Java17/ws/src/sdks/java/container/build/reports/dependency-license/index.json> --output_dir=<https://ci-beam.apache.org/job/beam_PostCommit_Java_Nexmark_Dataflow_V2_Java17/ws/src/sdks/java/container/build/target/java_third_party_licenses> --dep_url_yaml=<https://ci-beam.apache.org/job/beam_PostCommit_Java_Nexmark_Dataflow_V2_Java17/ws/src/sdks/java/container/license_scripts/dep_urls_java.yaml> --manual_license_path=<https://ci-beam.apache.org/job/beam_PostCommit_Java_Nexmark_Dataflow_V2_Java17/ws/src/sdks/java/container/license_scripts/manual_licenses>
INFO:root:Pulling license for 240 dependencies using 16 threads.
INFO:root:Replaced local file URL with file://<https://ci-beam.apache.org/job/beam_PostCommit_Java_Nexmark_Dataflow_V2_Java17/ws/src/sdks/java/container/license_scripts/manual_licenses/xz/COPYING> for xz-1.5
INFO:root:pull_licenses_java.py succeed. It took 10.70853 seconds with 16 threads.
Copying licenses from <https://ci-beam.apache.org/job/beam_PostCommit_Java_Nexmark_Dataflow_V2_Java17/ws/src/sdks/java/container/build/target/java_third_party_licenses> to <https://ci-beam.apache.org/job/beam_PostCommit_Java_Nexmark_Dataflow_V2_Java17/ws/src/sdks/java/container/build/target/third_party_licenses.>
Finished license_scripts.sh
> Task :sdks:java:container:goPrepare UP-TO-DATE
> Task :sdks:java:container:java17:copyJavaThirdPartyLicenses
> Task :sdks:java:container:goBuild
/home/jenkins/go/bin/go1.18.1 build -o ./build/target/linux_amd64/boot boot.go boot_test.go
> Task :sdks:java:container:java17:copySdkHarnessLauncher
Execution optimizations have been disabled for task ':sdks:java:container:java17:copySdkHarnessLauncher' to ensure correctness due to the following reasons:
- Gradle detected a problem with the following location: '<https://ci-beam.apache.org/job/beam_PostCommit_Java_Nexmark_Dataflow_V2_Java17/ws/src/sdks/java/container/build/target'.> Reason: Task ':sdks:java:container:java17:copySdkHarnessLauncher' uses this output of task ':sdks:java:container:downloadCloudProfilerAgent' without declaring an explicit or implicit dependency. This can lead to incorrect results being produced, depending on what order the tasks are executed. Please refer to https://docs.gradle.org/7.4/userguide/validation_problems.html#implicit_dependency for more details about this problem.
- Gradle detected a problem with the following location: '<https://ci-beam.apache.org/job/beam_PostCommit_Java_Nexmark_Dataflow_V2_Java17/ws/src/sdks/java/container/build/target'.> Reason: Task ':sdks:java:container:java17:copySdkHarnessLauncher' uses this output of task ':sdks:java:container:pullLicenses' without declaring an explicit or implicit dependency. This can lead to incorrect results being produced, depending on what order the tasks are executed. Please refer to https://docs.gradle.org/7.4/userguide/validation_problems.html#implicit_dependency for more details about this problem.
FAILURE: Build failed with an exception.
* What went wrong:
Execution failed for task ':sdks:java:core:compileJava'.
> java.util.ConcurrentModificationException (no error message)
* Try:
> Run with --stacktrace option to get the stack trace.
> Run with --info or --debug option to get more log output.
> Run with --scan to get full insights.
* Get more help at https://help.gradle.org
Deprecated Gradle features were used in this build, making it incompatible with Gradle 8.0.
You can use '--warning-mode all' to show the individual deprecation warnings and determine if they come from your own scripts or plugins.
See https://docs.gradle.org/7.4/userguide/command_line_interface.html#sec:command_line_warnings
Execution optimizations have been disabled for 1 invalid unit(s) of work during this build to ensure correctness.
Please consult deprecation warnings for more details.
BUILD FAILED in 44s
84 actionable tasks: 65 executed, 15 from cache, 4 up-to-date
Publishing build scan...
https://gradle.com/s/rgabl33we632k
Build step 'Invoke Gradle script' changed build result to FAILURE
Build step 'Invoke Gradle script' marked build as failure
---------------------------------------------------------------------
To unsubscribe, e-mail: builds-unsubscribe@beam.apache.org
For additional commands, e-mail: builds-help@beam.apache.org
Jenkins build is back to normal : beam_PostCommit_Java_Nexmark_Dataflow_V2_Java17 #883
Posted by Apache Jenkins Server <je...@builds.apache.org>.
See <https://ci-beam.apache.org/job/beam_PostCommit_Java_Nexmark_Dataflow_V2_Java17/883/display/redirect>
---------------------------------------------------------------------
To unsubscribe, e-mail: builds-unsubscribe@beam.apache.org
For additional commands, e-mail: builds-help@beam.apache.org