You are viewing a plain text version of this content. The canonical link for it is here.
Posted to dev@kafka.apache.org by Apache Jenkins Server <je...@builds.apache.org> on 2020/01/03 00:05:29 UTC
Build failed in Jenkins: kafka-trunk-jdk11 #1048
See <https://builds.apache.org/job/kafka-trunk-jdk11/1048/display/redirect?page=changes>
Changes:
[github] MINOR: Remove spammy, unhelpful log message in the controller (#7879)
------------------------------------------
[...truncated 2.79 MB...]
org.apache.kafka.streams.TestTopicsTest > testRecordList PASSED
org.apache.kafka.streams.TestTopicsTest > testNonExistingInputTopic STARTED
org.apache.kafka.streams.TestTopicsTest > testNonExistingInputTopic PASSED
org.apache.kafka.streams.TestTopicsTest > testKeyValuesToMap STARTED
org.apache.kafka.streams.TestTopicsTest > testKeyValuesToMap PASSED
org.apache.kafka.streams.TestTopicsTest > testRecordsToList STARTED
org.apache.kafka.streams.TestTopicsTest > testRecordsToList PASSED
org.apache.kafka.streams.TestTopicsTest > testKeyValueListDuration STARTED
org.apache.kafka.streams.TestTopicsTest > testKeyValueListDuration PASSED
org.apache.kafka.streams.TestTopicsTest > testInputToString STARTED
org.apache.kafka.streams.TestTopicsTest > testInputToString PASSED
org.apache.kafka.streams.TestTopicsTest > testTimestamp STARTED
org.apache.kafka.streams.TestTopicsTest > testTimestamp PASSED
org.apache.kafka.streams.TestTopicsTest > testWithHeaders STARTED
org.apache.kafka.streams.TestTopicsTest > testWithHeaders PASSED
org.apache.kafka.streams.TestTopicsTest > testKeyValue STARTED
org.apache.kafka.streams.TestTopicsTest > testKeyValue PASSED
org.apache.kafka.streams.TestTopicsTest > shouldNotAllowToCreateTopicWithNullTopicName STARTED
org.apache.kafka.streams.TestTopicsTest > shouldNotAllowToCreateTopicWithNullTopicName PASSED
org.apache.kafka.streams.test.ConsumerRecordFactoryTest > shouldCreateConsumerRecordsFromKeyValuePairs STARTED
org.apache.kafka.streams.test.ConsumerRecordFactoryTest > shouldCreateConsumerRecordsFromKeyValuePairs PASSED
org.apache.kafka.streams.test.ConsumerRecordFactoryTest > shouldNotAllowToCreateTopicWithNullTopicNameWithNullKeyAndDefaultTimestamp STARTED
org.apache.kafka.streams.test.ConsumerRecordFactoryTest > shouldNotAllowToCreateTopicWithNullTopicNameWithNullKeyAndDefaultTimestamp PASSED
org.apache.kafka.streams.test.ConsumerRecordFactoryTest > shouldRequireCustomTopicNameIfNotDefaultFactoryTopicNameWithDefaultTimestamp STARTED
org.apache.kafka.streams.test.ConsumerRecordFactoryTest > shouldRequireCustomTopicNameIfNotDefaultFactoryTopicNameWithDefaultTimestamp PASSED
org.apache.kafka.streams.test.ConsumerRecordFactoryTest > shouldNotAllowToCreateTopicWithNullTopicNameWithNullKey STARTED
org.apache.kafka.streams.test.ConsumerRecordFactoryTest > shouldNotAllowToCreateTopicWithNullTopicNameWithNullKey PASSED
org.apache.kafka.streams.test.ConsumerRecordFactoryTest > shouldCreateNullKeyConsumerRecordWithOtherTopicNameAndTimestampWithTimetamp STARTED
org.apache.kafka.streams.test.ConsumerRecordFactoryTest > shouldCreateNullKeyConsumerRecordWithOtherTopicNameAndTimestampWithTimetamp PASSED
org.apache.kafka.streams.test.ConsumerRecordFactoryTest > shouldCreateConsumerRecordWithTimestamp STARTED
org.apache.kafka.streams.test.ConsumerRecordFactoryTest > shouldCreateConsumerRecordWithTimestamp PASSED
org.apache.kafka.streams.test.ConsumerRecordFactoryTest > shouldNotAllowToCreateTopicWithNullHeaders STARTED
org.apache.kafka.streams.test.ConsumerRecordFactoryTest > shouldNotAllowToCreateTopicWithNullHeaders PASSED
org.apache.kafka.streams.test.ConsumerRecordFactoryTest > shouldNotAllowToCreateTopicWithNullTopicNameWithDefaultTimestamp STARTED
org.apache.kafka.streams.test.ConsumerRecordFactoryTest > shouldNotAllowToCreateTopicWithNullTopicNameWithDefaultTimestamp PASSED
org.apache.kafka.streams.test.ConsumerRecordFactoryTest > shouldRequireCustomTopicNameIfNotDefaultFactoryTopicName STARTED
org.apache.kafka.streams.test.ConsumerRecordFactoryTest > shouldRequireCustomTopicNameIfNotDefaultFactoryTopicName PASSED
org.apache.kafka.streams.test.ConsumerRecordFactoryTest > shouldRequireCustomTopicNameIfNotDefaultFactoryTopicNameWithNullKey STARTED
org.apache.kafka.streams.test.ConsumerRecordFactoryTest > shouldRequireCustomTopicNameIfNotDefaultFactoryTopicNameWithNullKey PASSED
org.apache.kafka.streams.test.ConsumerRecordFactoryTest > shouldCreateConsumerRecord STARTED
org.apache.kafka.streams.test.ConsumerRecordFactoryTest > shouldCreateConsumerRecord PASSED
org.apache.kafka.streams.test.ConsumerRecordFactoryTest > shouldCreateNullKeyConsumerRecord STARTED
org.apache.kafka.streams.test.ConsumerRecordFactoryTest > shouldCreateNullKeyConsumerRecord PASSED
org.apache.kafka.streams.test.ConsumerRecordFactoryTest > shouldCreateConsumerRecordWithOtherTopicName STARTED
org.apache.kafka.streams.test.ConsumerRecordFactoryTest > shouldCreateConsumerRecordWithOtherTopicName PASSED
org.apache.kafka.streams.test.ConsumerRecordFactoryTest > shouldAdvanceTime STARTED
org.apache.kafka.streams.test.ConsumerRecordFactoryTest > shouldAdvanceTime PASSED
org.apache.kafka.streams.test.ConsumerRecordFactoryTest > shouldNotAllowToCreateTopicWithNullTopicNameWithKeyValuePairs STARTED
org.apache.kafka.streams.test.ConsumerRecordFactoryTest > shouldNotAllowToCreateTopicWithNullTopicNameWithKeyValuePairs PASSED
org.apache.kafka.streams.test.ConsumerRecordFactoryTest > shouldRequireCustomTopicNameIfNotDefaultFactoryTopicNameWithKeyValuePairsAndCustomTimestamps STARTED
org.apache.kafka.streams.test.ConsumerRecordFactoryTest > shouldRequireCustomTopicNameIfNotDefaultFactoryTopicNameWithKeyValuePairsAndCustomTimestamps PASSED
org.apache.kafka.streams.test.ConsumerRecordFactoryTest > shouldRequireCustomTopicNameIfNotDefaultFactoryTopicNameWithKeyValuePairs STARTED
org.apache.kafka.streams.test.ConsumerRecordFactoryTest > shouldRequireCustomTopicNameIfNotDefaultFactoryTopicNameWithKeyValuePairs PASSED
org.apache.kafka.streams.test.ConsumerRecordFactoryTest > shouldCreateConsumerRecordWithOtherTopicNameAndTimestamp STARTED
org.apache.kafka.streams.test.ConsumerRecordFactoryTest > shouldCreateConsumerRecordWithOtherTopicNameAndTimestamp PASSED
org.apache.kafka.streams.test.ConsumerRecordFactoryTest > shouldNotAllowToCreateTopicWithNullTopicNameWithKeyValuePairsAndCustomTimestamps STARTED
org.apache.kafka.streams.test.ConsumerRecordFactoryTest > shouldNotAllowToCreateTopicWithNullTopicNameWithKeyValuePairsAndCustomTimestamps PASSED
org.apache.kafka.streams.test.ConsumerRecordFactoryTest > shouldNotAllowToCreateTopicWithNullTopicName STARTED
org.apache.kafka.streams.test.ConsumerRecordFactoryTest > shouldNotAllowToCreateTopicWithNullTopicName PASSED
org.apache.kafka.streams.test.ConsumerRecordFactoryTest > shouldCreateConsumerRecordsFromKeyValuePairsWithCustomTimestampAndIncrementsAndNotAdvanceTime STARTED
org.apache.kafka.streams.test.ConsumerRecordFactoryTest > shouldCreateConsumerRecordsFromKeyValuePairsWithCustomTimestampAndIncrementsAndNotAdvanceTime PASSED
org.apache.kafka.streams.test.ConsumerRecordFactoryTest > shouldCreateNullKeyConsumerRecordWithTimestampWithTimestamp STARTED
org.apache.kafka.streams.test.ConsumerRecordFactoryTest > shouldCreateNullKeyConsumerRecordWithTimestampWithTimestamp PASSED
org.apache.kafka.streams.test.ConsumerRecordFactoryTest > shouldRequireCustomTopicNameIfNotDefaultFactoryTopicNameWithNullKeyAndDefaultTimestamp STARTED
org.apache.kafka.streams.test.ConsumerRecordFactoryTest > shouldRequireCustomTopicNameIfNotDefaultFactoryTopicNameWithNullKeyAndDefaultTimestamp PASSED
org.apache.kafka.streams.test.ConsumerRecordFactoryTest > shouldCreateConsumerRecordsFromKeyValuePairsWithTimestampAndIncrements STARTED
org.apache.kafka.streams.test.ConsumerRecordFactoryTest > shouldCreateConsumerRecordsFromKeyValuePairsWithTimestampAndIncrements PASSED
org.apache.kafka.streams.MockTimeTest > shouldGetNanosAsMillis STARTED
org.apache.kafka.streams.MockTimeTest > shouldGetNanosAsMillis PASSED
org.apache.kafka.streams.MockTimeTest > shouldSetStartTime STARTED
org.apache.kafka.streams.MockTimeTest > shouldSetStartTime PASSED
org.apache.kafka.streams.MockTimeTest > shouldNotAllowNegativeSleep STARTED
org.apache.kafka.streams.MockTimeTest > shouldNotAllowNegativeSleep PASSED
org.apache.kafka.streams.MockTimeTest > shouldAdvanceTimeOnSleep STARTED
org.apache.kafka.streams.MockTimeTest > shouldAdvanceTimeOnSleep PASSED
org.apache.kafka.streams.internals.KeyValueStoreFacadeTest > shouldReturnIsOpen STARTED
org.apache.kafka.streams.internals.KeyValueStoreFacadeTest > shouldReturnIsOpen PASSED
org.apache.kafka.streams.internals.KeyValueStoreFacadeTest > shouldDeleteAndReturnPlainValue STARTED
org.apache.kafka.streams.internals.KeyValueStoreFacadeTest > shouldDeleteAndReturnPlainValue PASSED
org.apache.kafka.streams.internals.KeyValueStoreFacadeTest > shouldReturnName STARTED
org.apache.kafka.streams.internals.KeyValueStoreFacadeTest > shouldReturnName PASSED
org.apache.kafka.streams.internals.KeyValueStoreFacadeTest > shouldPutWithUnknownTimestamp STARTED
org.apache.kafka.streams.internals.KeyValueStoreFacadeTest > shouldPutWithUnknownTimestamp PASSED
org.apache.kafka.streams.internals.KeyValueStoreFacadeTest > shouldPutAllWithUnknownTimestamp STARTED
org.apache.kafka.streams.internals.KeyValueStoreFacadeTest > shouldPutAllWithUnknownTimestamp PASSED
org.apache.kafka.streams.internals.KeyValueStoreFacadeTest > shouldReturnIsPersistent STARTED
org.apache.kafka.streams.internals.KeyValueStoreFacadeTest > shouldReturnIsPersistent PASSED
org.apache.kafka.streams.internals.KeyValueStoreFacadeTest > shouldPutIfAbsentWithUnknownTimestamp STARTED
org.apache.kafka.streams.internals.KeyValueStoreFacadeTest > shouldPutIfAbsentWithUnknownTimestamp PASSED
org.apache.kafka.streams.internals.KeyValueStoreFacadeTest > shouldForwardClose STARTED
org.apache.kafka.streams.internals.KeyValueStoreFacadeTest > shouldForwardClose PASSED
org.apache.kafka.streams.internals.KeyValueStoreFacadeTest > shouldForwardFlush STARTED
org.apache.kafka.streams.internals.KeyValueStoreFacadeTest > shouldForwardFlush PASSED
org.apache.kafka.streams.internals.KeyValueStoreFacadeTest > shouldForwardInit STARTED
org.apache.kafka.streams.internals.KeyValueStoreFacadeTest > shouldForwardInit PASSED
> Task :streams:upgrade-system-tests-21:spotbugsMain NO-SOURCE
> Task :streams:upgrade-system-tests-21:test
> Task :streams:upgrade-system-tests-22:compileJava NO-SOURCE
> Task :streams:upgrade-system-tests-22:processResources NO-SOURCE
> Task :streams:upgrade-system-tests-22:classes UP-TO-DATE
> Task :streams:upgrade-system-tests-22:checkstyleMain NO-SOURCE
> Task :streams:upgrade-system-tests-22:compileTestJava
> Task :streams:upgrade-system-tests-22:processTestResources NO-SOURCE
> Task :streams:upgrade-system-tests-22:testClasses
> Task :streams:upgrade-system-tests-22:checkstyleTest
> Task :streams:upgrade-system-tests-22:spotbugsMain NO-SOURCE
> Task :streams:upgrade-system-tests-22:test
> Task :streams:upgrade-system-tests-23:compileJava NO-SOURCE
> Task :streams:upgrade-system-tests-23:processResources NO-SOURCE
> Task :streams:upgrade-system-tests-23:classes UP-TO-DATE
> Task :streams:upgrade-system-tests-23:checkstyleMain NO-SOURCE
> Task :streams:upgrade-system-tests-23:compileTestJava
> Task :streams:upgrade-system-tests-23:processTestResources NO-SOURCE
> Task :streams:upgrade-system-tests-23:testClasses
> Task :streams:upgrade-system-tests-23:checkstyleTest
> Task :streams:upgrade-system-tests-23:spotbugsMain NO-SOURCE
> Task :streams:upgrade-system-tests-23:test
> Task :streams:upgrade-system-tests-24:compileJava NO-SOURCE
> Task :streams:upgrade-system-tests-24:processResources NO-SOURCE
> Task :streams:upgrade-system-tests-24:classes UP-TO-DATE
> Task :streams:upgrade-system-tests-24:checkstyleMain NO-SOURCE
> Task :streams:upgrade-system-tests-24:compileTestJava
> Task :streams:upgrade-system-tests-24:processTestResources NO-SOURCE
> Task :streams:upgrade-system-tests-24:testClasses
> Task :streams:upgrade-system-tests-24:checkstyleTest
> Task :streams:upgrade-system-tests-24:spotbugsMain NO-SOURCE
> Task :streams:upgrade-system-tests-24:test
FAILURE: Build failed with an exception.
* What went wrong:
Execution failed for task ':core:test'.
> There were failing tests. See the report at: file://<https://builds.apache.org/job/kafka-trunk-jdk11/ws/core/build/reports/tests/test/index.html>
* Try:
Run with --stacktrace option to get the stack trace. Run with --info or --debug option to get more log output. Run with --scan to get full insights.
* Get more help at https://help.gradle.org
Deprecated Gradle features were used in this build, making it incompatible with Gradle 6.0.
Use '--warning-mode all' to show the individual deprecation warnings.
See https://docs.gradle.org/5.6.2/userguide/command_line_interface.html#sec:command_line_warnings
BUILD FAILED in 1h 38m 48s
209 actionable tasks: 179 executed, 30 up-to-date
Build step 'Execute shell' marked build as failure
Recording test results
ERROR: No tool found matching GRADLE_4_10_2_HOME
Setting GRADLE_4_10_3_HOME=/home/jenkins/tools/gradle/4.10.3
ERROR: No tool found matching GRADLE_4_10_2_HOME
Setting GRADLE_4_10_3_HOME=/home/jenkins/tools/gradle/4.10.3
Not sending mail to unregistered user noreply@github.com
Not sending mail to unregistered user wangguoz@gmail.com
Jenkins build is back to normal : kafka-trunk-jdk11 #1053
Posted by Apache Jenkins Server <je...@builds.apache.org>.
See <https://builds.apache.org/job/kafka-trunk-jdk11/1053/display/redirect?page=changes>
Build failed in Jenkins: kafka-trunk-jdk11 #1052
Posted by Apache Jenkins Server <je...@builds.apache.org>.
See <https://builds.apache.org/job/kafka-trunk-jdk11/1052/display/redirect?page=changes>
Changes:
[github] MINOR: Fix failing test case in TransactionLogTest (#7895)
------------------------------------------
[...truncated 2.79 MB...]
org.apache.kafka.streams.test.ConsumerRecordFactoryTest > shouldRequireCustomTopicNameIfNotDefaultFactoryTopicName STARTED
org.apache.kafka.streams.test.ConsumerRecordFactoryTest > shouldRequireCustomTopicNameIfNotDefaultFactoryTopicName PASSED
org.apache.kafka.streams.test.ConsumerRecordFactoryTest > shouldRequireCustomTopicNameIfNotDefaultFactoryTopicNameWithNullKey STARTED
org.apache.kafka.streams.test.ConsumerRecordFactoryTest > shouldRequireCustomTopicNameIfNotDefaultFactoryTopicNameWithNullKey PASSED
org.apache.kafka.streams.test.ConsumerRecordFactoryTest > shouldCreateConsumerRecord STARTED
org.apache.kafka.streams.test.ConsumerRecordFactoryTest > shouldCreateConsumerRecord PASSED
org.apache.kafka.streams.test.ConsumerRecordFactoryTest > shouldCreateNullKeyConsumerRecord STARTED
org.apache.kafka.streams.test.ConsumerRecordFactoryTest > shouldCreateNullKeyConsumerRecord PASSED
org.apache.kafka.streams.test.ConsumerRecordFactoryTest > shouldCreateConsumerRecordWithOtherTopicName STARTED
org.apache.kafka.streams.test.ConsumerRecordFactoryTest > shouldCreateConsumerRecordWithOtherTopicName PASSED
org.apache.kafka.streams.test.ConsumerRecordFactoryTest > shouldAdvanceTime STARTED
org.apache.kafka.streams.test.ConsumerRecordFactoryTest > shouldAdvanceTime PASSED
org.apache.kafka.streams.test.ConsumerRecordFactoryTest > shouldNotAllowToCreateTopicWithNullTopicNameWithKeyValuePairs STARTED
org.apache.kafka.streams.test.ConsumerRecordFactoryTest > shouldNotAllowToCreateTopicWithNullTopicNameWithKeyValuePairs PASSED
org.apache.kafka.streams.test.ConsumerRecordFactoryTest > shouldRequireCustomTopicNameIfNotDefaultFactoryTopicNameWithKeyValuePairsAndCustomTimestamps STARTED
org.apache.kafka.streams.test.ConsumerRecordFactoryTest > shouldRequireCustomTopicNameIfNotDefaultFactoryTopicNameWithKeyValuePairsAndCustomTimestamps PASSED
org.apache.kafka.streams.test.ConsumerRecordFactoryTest > shouldRequireCustomTopicNameIfNotDefaultFactoryTopicNameWithKeyValuePairs STARTED
org.apache.kafka.streams.test.ConsumerRecordFactoryTest > shouldRequireCustomTopicNameIfNotDefaultFactoryTopicNameWithKeyValuePairs PASSED
org.apache.kafka.streams.test.ConsumerRecordFactoryTest > shouldCreateConsumerRecordWithOtherTopicNameAndTimestamp STARTED
org.apache.kafka.streams.test.ConsumerRecordFactoryTest > shouldCreateConsumerRecordWithOtherTopicNameAndTimestamp PASSED
org.apache.kafka.streams.test.ConsumerRecordFactoryTest > shouldNotAllowToCreateTopicWithNullTopicNameWithKeyValuePairsAndCustomTimestamps STARTED
org.apache.kafka.streams.test.ConsumerRecordFactoryTest > shouldNotAllowToCreateTopicWithNullTopicNameWithKeyValuePairsAndCustomTimestamps PASSED
org.apache.kafka.streams.test.ConsumerRecordFactoryTest > shouldNotAllowToCreateTopicWithNullTopicName STARTED
org.apache.kafka.streams.test.ConsumerRecordFactoryTest > shouldNotAllowToCreateTopicWithNullTopicName PASSED
org.apache.kafka.streams.test.ConsumerRecordFactoryTest > shouldCreateConsumerRecordsFromKeyValuePairsWithCustomTimestampAndIncrementsAndNotAdvanceTime STARTED
org.apache.kafka.streams.test.ConsumerRecordFactoryTest > shouldCreateConsumerRecordsFromKeyValuePairsWithCustomTimestampAndIncrementsAndNotAdvanceTime PASSED
org.apache.kafka.streams.test.ConsumerRecordFactoryTest > shouldCreateNullKeyConsumerRecordWithTimestampWithTimestamp STARTED
org.apache.kafka.streams.test.ConsumerRecordFactoryTest > shouldCreateNullKeyConsumerRecordWithTimestampWithTimestamp PASSED
org.apache.kafka.streams.test.ConsumerRecordFactoryTest > shouldRequireCustomTopicNameIfNotDefaultFactoryTopicNameWithNullKeyAndDefaultTimestamp STARTED
org.apache.kafka.streams.test.ConsumerRecordFactoryTest > shouldRequireCustomTopicNameIfNotDefaultFactoryTopicNameWithNullKeyAndDefaultTimestamp PASSED
org.apache.kafka.streams.test.ConsumerRecordFactoryTest > shouldCreateConsumerRecordsFromKeyValuePairsWithTimestampAndIncrements STARTED
org.apache.kafka.streams.test.ConsumerRecordFactoryTest > shouldCreateConsumerRecordsFromKeyValuePairsWithTimestampAndIncrements PASSED
org.apache.kafka.streams.MockTimeTest > shouldGetNanosAsMillis STARTED
org.apache.kafka.streams.MockTimeTest > shouldGetNanosAsMillis PASSED
org.apache.kafka.streams.MockTimeTest > shouldSetStartTime STARTED
org.apache.kafka.streams.MockTimeTest > shouldSetStartTime PASSED
org.apache.kafka.streams.MockTimeTest > shouldNotAllowNegativeSleep STARTED
org.apache.kafka.streams.MockTimeTest > shouldNotAllowNegativeSleep PASSED
org.apache.kafka.streams.MockTimeTest > shouldAdvanceTimeOnSleep STARTED
org.apache.kafka.streams.MockTimeTest > shouldAdvanceTimeOnSleep PASSED
org.apache.kafka.streams.internals.KeyValueStoreFacadeTest > shouldReturnIsOpen STARTED
org.apache.kafka.streams.internals.KeyValueStoreFacadeTest > shouldReturnIsOpen PASSED
org.apache.kafka.streams.internals.KeyValueStoreFacadeTest > shouldDeleteAndReturnPlainValue STARTED
org.apache.kafka.streams.internals.KeyValueStoreFacadeTest > shouldDeleteAndReturnPlainValue PASSED
org.apache.kafka.streams.internals.KeyValueStoreFacadeTest > shouldReturnName STARTED
org.apache.kafka.streams.internals.KeyValueStoreFacadeTest > shouldReturnName PASSED
org.apache.kafka.streams.internals.KeyValueStoreFacadeTest > shouldPutWithUnknownTimestamp STARTED
org.apache.kafka.streams.internals.KeyValueStoreFacadeTest > shouldPutWithUnknownTimestamp PASSED
org.apache.kafka.streams.internals.KeyValueStoreFacadeTest > shouldPutAllWithUnknownTimestamp STARTED
org.apache.kafka.streams.internals.KeyValueStoreFacadeTest > shouldPutAllWithUnknownTimestamp PASSED
org.apache.kafka.streams.internals.KeyValueStoreFacadeTest > shouldReturnIsPersistent STARTED
org.apache.kafka.streams.internals.KeyValueStoreFacadeTest > shouldReturnIsPersistent PASSED
org.apache.kafka.streams.internals.KeyValueStoreFacadeTest > shouldPutIfAbsentWithUnknownTimestamp STARTED
org.apache.kafka.streams.internals.KeyValueStoreFacadeTest > shouldPutIfAbsentWithUnknownTimestamp PASSED
org.apache.kafka.streams.internals.KeyValueStoreFacadeTest > shouldForwardClose STARTED
org.apache.kafka.streams.internals.KeyValueStoreFacadeTest > shouldForwardClose PASSED
org.apache.kafka.streams.internals.KeyValueStoreFacadeTest > shouldForwardFlush STARTED
org.apache.kafka.streams.internals.KeyValueStoreFacadeTest > shouldForwardFlush PASSED
org.apache.kafka.streams.internals.KeyValueStoreFacadeTest > shouldForwardInit STARTED
org.apache.kafka.streams.internals.KeyValueStoreFacadeTest > shouldForwardInit PASSED
> Task :streams:upgrade-system-tests-0100:spotbugsMain NO-SOURCE
> Task :streams:upgrade-system-tests-0100:test
> Task :streams:upgrade-system-tests-0101:compileJava NO-SOURCE
> Task :streams:upgrade-system-tests-0101:processResources NO-SOURCE
> Task :streams:upgrade-system-tests-0101:classes UP-TO-DATE
> Task :streams:upgrade-system-tests-0101:checkstyleMain NO-SOURCE
> Task :streams:upgrade-system-tests-0101:compileTestJava
> Task :streams:upgrade-system-tests-0101:processTestResources NO-SOURCE
> Task :streams:upgrade-system-tests-0101:testClasses
> Task :streams:upgrade-system-tests-0101:checkstyleTest
> Task :streams:upgrade-system-tests-0101:spotbugsMain NO-SOURCE
> Task :streams:upgrade-system-tests-0101:test
> Task :streams:upgrade-system-tests-0102:compileJava NO-SOURCE
> Task :streams:upgrade-system-tests-0102:processResources NO-SOURCE
> Task :streams:upgrade-system-tests-0102:classes UP-TO-DATE
> Task :streams:upgrade-system-tests-0102:checkstyleMain NO-SOURCE
> Task :streams:upgrade-system-tests-0102:compileTestJava
> Task :streams:upgrade-system-tests-0102:processTestResources NO-SOURCE
> Task :streams:upgrade-system-tests-0102:testClasses
> Task :streams:upgrade-system-tests-0102:checkstyleTest
> Task :streams:upgrade-system-tests-0102:spotbugsMain NO-SOURCE
> Task :streams:upgrade-system-tests-0102:test
> Task :streams:upgrade-system-tests-0110:compileJava NO-SOURCE
> Task :streams:upgrade-system-tests-0110:processResources NO-SOURCE
> Task :streams:upgrade-system-tests-0110:classes UP-TO-DATE
> Task :streams:upgrade-system-tests-0110:checkstyleMain NO-SOURCE
> Task :streams:upgrade-system-tests-0110:compileTestJava
> Task :streams:upgrade-system-tests-0110:processTestResources NO-SOURCE
> Task :streams:upgrade-system-tests-0110:testClasses
> Task :streams:upgrade-system-tests-0110:checkstyleTest
> Task :streams:upgrade-system-tests-0110:spotbugsMain NO-SOURCE
> Task :streams:upgrade-system-tests-0110:test
> Task :streams:upgrade-system-tests-10:compileJava NO-SOURCE
> Task :streams:upgrade-system-tests-10:processResources NO-SOURCE
> Task :streams:upgrade-system-tests-10:classes UP-TO-DATE
> Task :streams:upgrade-system-tests-10:checkstyleMain NO-SOURCE
> Task :streams:upgrade-system-tests-10:compileTestJava
> Task :streams:upgrade-system-tests-10:processTestResources NO-SOURCE
> Task :streams:upgrade-system-tests-10:testClasses
> Task :streams:upgrade-system-tests-10:checkstyleTest
> Task :streams:upgrade-system-tests-10:spotbugsMain NO-SOURCE
> Task :streams:upgrade-system-tests-10:test
> Task :streams:upgrade-system-tests-11:compileJava NO-SOURCE
> Task :streams:upgrade-system-tests-11:processResources NO-SOURCE
> Task :streams:upgrade-system-tests-11:classes UP-TO-DATE
> Task :streams:upgrade-system-tests-11:checkstyleMain NO-SOURCE
> Task :streams:upgrade-system-tests-11:compileTestJava
> Task :streams:upgrade-system-tests-11:processTestResources NO-SOURCE
> Task :streams:upgrade-system-tests-11:testClasses
> Task :streams:upgrade-system-tests-11:checkstyleTest
> Task :streams:upgrade-system-tests-11:spotbugsMain NO-SOURCE
> Task :streams:upgrade-system-tests-11:test
> Task :streams:upgrade-system-tests-20:compileJava NO-SOURCE
> Task :streams:upgrade-system-tests-20:processResources NO-SOURCE
> Task :streams:upgrade-system-tests-20:classes UP-TO-DATE
> Task :streams:upgrade-system-tests-20:checkstyleMain NO-SOURCE
> Task :streams:upgrade-system-tests-20:compileTestJava
> Task :streams:upgrade-system-tests-20:processTestResources NO-SOURCE
> Task :streams:upgrade-system-tests-20:testClasses
> Task :streams:upgrade-system-tests-20:checkstyleTest
> Task :streams:upgrade-system-tests-20:spotbugsMain NO-SOURCE
> Task :streams:upgrade-system-tests-20:test
> Task :streams:upgrade-system-tests-21:compileJava NO-SOURCE
> Task :streams:upgrade-system-tests-21:processResources NO-SOURCE
> Task :streams:upgrade-system-tests-21:classes UP-TO-DATE
> Task :streams:upgrade-system-tests-21:checkstyleMain NO-SOURCE
> Task :streams:upgrade-system-tests-21:compileTestJava
> Task :streams:upgrade-system-tests-21:processTestResources NO-SOURCE
> Task :streams:upgrade-system-tests-21:testClasses
> Task :streams:upgrade-system-tests-21:checkstyleTest
> Task :streams:upgrade-system-tests-21:spotbugsMain NO-SOURCE
> Task :streams:upgrade-system-tests-21:test
> Task :streams:upgrade-system-tests-22:compileJava NO-SOURCE
> Task :streams:upgrade-system-tests-22:processResources NO-SOURCE
> Task :streams:upgrade-system-tests-22:classes UP-TO-DATE
> Task :streams:upgrade-system-tests-22:checkstyleMain NO-SOURCE
> Task :streams:upgrade-system-tests-22:compileTestJava
> Task :streams:upgrade-system-tests-22:processTestResources NO-SOURCE
> Task :streams:upgrade-system-tests-22:testClasses
> Task :streams:upgrade-system-tests-22:checkstyleTest
> Task :streams:upgrade-system-tests-22:spotbugsMain NO-SOURCE
> Task :streams:upgrade-system-tests-22:test
> Task :streams:upgrade-system-tests-23:compileJava NO-SOURCE
> Task :streams:upgrade-system-tests-23:processResources NO-SOURCE
> Task :streams:upgrade-system-tests-23:classes UP-TO-DATE
> Task :streams:upgrade-system-tests-23:checkstyleMain NO-SOURCE
> Task :streams:upgrade-system-tests-23:compileTestJava
> Task :streams:upgrade-system-tests-23:processTestResources NO-SOURCE
> Task :streams:upgrade-system-tests-23:testClasses
> Task :streams:upgrade-system-tests-23:checkstyleTest
> Task :streams:upgrade-system-tests-23:spotbugsMain NO-SOURCE
> Task :streams:upgrade-system-tests-23:test
> Task :streams:upgrade-system-tests-24:compileJava NO-SOURCE
> Task :streams:upgrade-system-tests-24:processResources NO-SOURCE
> Task :streams:upgrade-system-tests-24:classes UP-TO-DATE
> Task :streams:upgrade-system-tests-24:checkstyleMain NO-SOURCE
> Task :streams:upgrade-system-tests-24:compileTestJava
> Task :streams:upgrade-system-tests-24:processTestResources NO-SOURCE
> Task :streams:upgrade-system-tests-24:testClasses
> Task :streams:upgrade-system-tests-24:checkstyleTest
> Task :streams:upgrade-system-tests-24:spotbugsMain NO-SOURCE
> Task :streams:upgrade-system-tests-24:test
FAILURE: Build failed with an exception.
* What went wrong:
Execution failed for task ':streams:test'.
> There were failing tests. See the report at: file://<https://builds.apache.org/job/kafka-trunk-jdk11/ws/streams/build/reports/tests/test/index.html>
* Try:
Run with --stacktrace option to get the stack trace. Run with --info or --debug option to get more log output. Run with --scan to get full insights.
* Get more help at https://help.gradle.org
Deprecated Gradle features were used in this build, making it incompatible with Gradle 6.0.
Use '--warning-mode all' to show the individual deprecation warnings.
See https://docs.gradle.org/5.6.2/userguide/command_line_interface.html#sec:command_line_warnings
BUILD FAILED in 1h 43m 8s
209 actionable tasks: 179 executed, 30 up-to-date
Build step 'Execute shell' marked build as failure
Recording test results
ERROR: No tool found matching GRADLE_4_10_2_HOME
Setting GRADLE_4_10_3_HOME=/home/jenkins/tools/gradle/4.10.3
ERROR: No tool found matching GRADLE_4_10_2_HOME
Setting GRADLE_4_10_3_HOME=/home/jenkins/tools/gradle/4.10.3
Not sending mail to unregistered user noreply@github.com
Not sending mail to unregistered user wangguoz@gmail.com
Not sending mail to unregistered user manikumar.reddy@gmail.com
Build failed in Jenkins: kafka-trunk-jdk11 #1051
Posted by Apache Jenkins Server <je...@builds.apache.org>.
See <https://builds.apache.org/job/kafka-trunk-jdk11/1051/display/redirect?page=changes>
Changes:
[manikumar.reddy] MINOR: Remove compilation warnings (#7888)
------------------------------------------
[...truncated 5.65 MB...]
org.apache.kafka.streams.TopologyTestDriverTest > shouldThrowPatternNotValidForTopicNameException[Eos enabled = false] PASSED
org.apache.kafka.streams.TopologyTestDriverTest > shouldUseSourceSpecificDeserializersDeprecated[Eos enabled = false] STARTED
org.apache.kafka.streams.TopologyTestDriverTest > shouldUseSourceSpecificDeserializersDeprecated[Eos enabled = false] PASSED
org.apache.kafka.streams.TopologyTestDriverTest > shouldPunctuateIfEvenTimeAdvances[Eos enabled = false] STARTED
org.apache.kafka.streams.TopologyTestDriverTest > shouldPunctuateIfEvenTimeAdvances[Eos enabled = false] PASSED
org.apache.kafka.streams.TopologyTestDriverTest > shouldInitProcessor[Eos enabled = false] STARTED
org.apache.kafka.streams.TopologyTestDriverTest > shouldInitProcessor[Eos enabled = false] PASSED
org.apache.kafka.streams.TopologyTestDriverTest > shouldThrowForUnknownTopic[Eos enabled = false] STARTED
org.apache.kafka.streams.TopologyTestDriverTest > shouldThrowForUnknownTopic[Eos enabled = false] PASSED
org.apache.kafka.streams.TopologyTestDriverTest > shouldPunctuateOnStreamsTime[Eos enabled = false] STARTED
org.apache.kafka.streams.TopologyTestDriverTest > shouldPunctuateOnStreamsTime[Eos enabled = false] PASSED
org.apache.kafka.streams.TopologyTestDriverTest > shouldThrowIfInMemoryBuiltInStoreIsAccessedWithUntypedMethod[Eos enabled = false] STARTED
org.apache.kafka.streams.TopologyTestDriverTest > shouldThrowIfInMemoryBuiltInStoreIsAccessedWithUntypedMethod[Eos enabled = false] PASSED
org.apache.kafka.streams.TopologyTestDriverTest > shouldProcessFromSourcesThatMatchMultiplePattern[Eos enabled = false] STARTED
org.apache.kafka.streams.TopologyTestDriverTest > shouldProcessFromSourcesThatMatchMultiplePattern[Eos enabled = false] PASSED
org.apache.kafka.streams.TopologyTestDriverTest > shouldPopulateGlobalStore[Eos enabled = false] STARTED
org.apache.kafka.streams.TopologyTestDriverTest > shouldPopulateGlobalStore[Eos enabled = false] PASSED
org.apache.kafka.streams.TopologyTestDriverTest > shouldThrowIfPersistentBuiltInStoreIsAccessedWithUntypedMethod[Eos enabled = false] STARTED
org.apache.kafka.streams.TopologyTestDriverTest > shouldThrowIfPersistentBuiltInStoreIsAccessedWithUntypedMethod[Eos enabled = false] PASSED
org.apache.kafka.streams.TopologyTestDriverTest > shouldAllowPrePopulatingStatesStoresWithCachingEnabled[Eos enabled = false] STARTED
org.apache.kafka.streams.TopologyTestDriverTest > shouldAllowPrePopulatingStatesStoresWithCachingEnabled[Eos enabled = false] PASSED
org.apache.kafka.streams.TopologyTestDriverTest > shouldReturnCorrectPersistentStoreTypeOnly[Eos enabled = false] STARTED
org.apache.kafka.streams.TopologyTestDriverTest > shouldReturnCorrectPersistentStoreTypeOnly[Eos enabled = false] PASSED
org.apache.kafka.streams.TopologyTestDriverTest > shouldUseSourceSpecificDeserializers[Eos enabled = false] STARTED
org.apache.kafka.streams.TopologyTestDriverTest > shouldUseSourceSpecificDeserializers[Eos enabled = false] PASSED
org.apache.kafka.streams.TopologyTestDriverTest > shouldReturnAllStores[Eos enabled = false] STARTED
org.apache.kafka.streams.TopologyTestDriverTest > shouldReturnAllStores[Eos enabled = false] PASSED
org.apache.kafka.streams.TopologyTestDriverTest > shouldNotCreateStateDirectoryForStatelessTopology[Eos enabled = false] STARTED
org.apache.kafka.streams.TopologyTestDriverTest > shouldNotCreateStateDirectoryForStatelessTopology[Eos enabled = false] PASSED
org.apache.kafka.streams.TopologyTestDriverTest > shouldReturnAllStoresNames[Eos enabled = false] STARTED
org.apache.kafka.streams.TopologyTestDriverTest > shouldReturnAllStoresNames[Eos enabled = false] PASSED
org.apache.kafka.streams.TopologyTestDriverTest > shouldProcessConsumerRecordList[Eos enabled = false] STARTED
org.apache.kafka.streams.TopologyTestDriverTest > shouldProcessConsumerRecordList[Eos enabled = false] PASSED
org.apache.kafka.streams.TopologyTestDriverTest > shouldUseSinkSpecificSerializers[Eos enabled = false] STARTED
org.apache.kafka.streams.TopologyTestDriverTest > shouldUseSinkSpecificSerializers[Eos enabled = false] PASSED
org.apache.kafka.streams.TopologyTestDriverTest > shouldFlushStoreForFirstInput[Eos enabled = false] STARTED
org.apache.kafka.streams.TopologyTestDriverTest > shouldFlushStoreForFirstInput[Eos enabled = false] PASSED
org.apache.kafka.streams.TopologyTestDriverTest > shouldProcessFromSourceThatMatchPattern[Eos enabled = false] STARTED
org.apache.kafka.streams.TopologyTestDriverTest > shouldProcessFromSourceThatMatchPattern[Eos enabled = false] PASSED
org.apache.kafka.streams.TopologyTestDriverTest > shouldUpdateStoreForNewKey[Eos enabled = false] STARTED
org.apache.kafka.streams.TopologyTestDriverTest > shouldUpdateStoreForNewKey[Eos enabled = false] PASSED
org.apache.kafka.streams.TopologyTestDriverTest > shouldSendRecordViaCorrectSourceTopicDeprecated[Eos enabled = false] STARTED
org.apache.kafka.streams.TopologyTestDriverTest > shouldSendRecordViaCorrectSourceTopicDeprecated[Eos enabled = false] PASSED
org.apache.kafka.streams.TopologyTestDriverTest > shouldPunctuateOnWallClockTime[Eos enabled = false] STARTED
org.apache.kafka.streams.TopologyTestDriverTest > shouldPunctuateOnWallClockTime[Eos enabled = false] PASSED
org.apache.kafka.streams.TopologyTestDriverTest > shouldSetRecordMetadata[Eos enabled = false] STARTED
org.apache.kafka.streams.TopologyTestDriverTest > shouldSetRecordMetadata[Eos enabled = false] PASSED
org.apache.kafka.streams.TopologyTestDriverTest > shouldNotUpdateStoreForLargerValue[Eos enabled = false] STARTED
org.apache.kafka.streams.TopologyTestDriverTest > shouldNotUpdateStoreForLargerValue[Eos enabled = false] PASSED
org.apache.kafka.streams.TopologyTestDriverTest > shouldReturnCorrectInMemoryStoreTypeOnly[Eos enabled = false] STARTED
org.apache.kafka.streams.TopologyTestDriverTest > shouldReturnCorrectInMemoryStoreTypeOnly[Eos enabled = false] PASSED
org.apache.kafka.streams.TopologyTestDriverTest > shouldThrowForMissingTime[Eos enabled = false] STARTED
org.apache.kafka.streams.TopologyTestDriverTest > shouldThrowForMissingTime[Eos enabled = false] PASSED
org.apache.kafka.streams.TopologyTestDriverTest > shouldPunctuateOnWallClockTimeDeprecated[Eos enabled = false] STARTED
org.apache.kafka.streams.TopologyTestDriverTest > shouldPunctuateOnWallClockTimeDeprecated[Eos enabled = false] PASSED
org.apache.kafka.streams.TopologyTestDriverTest > shouldProcessRecordForTopic[Eos enabled = false] STARTED
org.apache.kafka.streams.TopologyTestDriverTest > shouldProcessRecordForTopic[Eos enabled = false] PASSED
org.apache.kafka.streams.TopologyTestDriverTest > shouldForwardRecordsFromSubtopologyToSubtopology[Eos enabled = false] STARTED
org.apache.kafka.streams.TopologyTestDriverTest > shouldForwardRecordsFromSubtopologyToSubtopology[Eos enabled = false] PASSED
org.apache.kafka.streams.TopologyTestDriverTest > shouldNotUpdateStoreForSmallerValue[Eos enabled = false] STARTED
org.apache.kafka.streams.TopologyTestDriverTest > shouldNotUpdateStoreForSmallerValue[Eos enabled = false] PASSED
org.apache.kafka.streams.TopologyTestDriverTest > shouldCreateStateDirectoryForStatefulTopology[Eos enabled = false] STARTED
org.apache.kafka.streams.TopologyTestDriverTest > shouldCreateStateDirectoryForStatefulTopology[Eos enabled = false] PASSED
org.apache.kafka.streams.TopologyTestDriverTest > shouldPunctuateIfWallClockTimeAdvances[Eos enabled = false] STARTED
org.apache.kafka.streams.TopologyTestDriverTest > shouldPunctuateIfWallClockTimeAdvances[Eos enabled = false] PASSED
> Task :streams:upgrade-system-tests-0101:spotbugsMain NO-SOURCE
> Task :streams:upgrade-system-tests-0101:test
> Task :streams:upgrade-system-tests-0102:compileJava NO-SOURCE
> Task :streams:upgrade-system-tests-0102:processResources NO-SOURCE
> Task :streams:upgrade-system-tests-0102:classes UP-TO-DATE
> Task :streams:upgrade-system-tests-0102:checkstyleMain NO-SOURCE
> Task :streams:upgrade-system-tests-0102:compileTestJava
> Task :streams:upgrade-system-tests-0102:processTestResources NO-SOURCE
> Task :streams:upgrade-system-tests-0102:testClasses
> Task :streams:upgrade-system-tests-0102:checkstyleTest
> Task :streams:upgrade-system-tests-0102:spotbugsMain NO-SOURCE
> Task :streams:upgrade-system-tests-0102:test
> Task :streams:upgrade-system-tests-0110:compileJava NO-SOURCE
> Task :streams:upgrade-system-tests-0110:processResources NO-SOURCE
> Task :streams:upgrade-system-tests-0110:classes UP-TO-DATE
> Task :streams:upgrade-system-tests-0110:checkstyleMain NO-SOURCE
> Task :streams:upgrade-system-tests-0110:compileTestJava
> Task :streams:upgrade-system-tests-0110:processTestResources NO-SOURCE
> Task :streams:upgrade-system-tests-0110:testClasses
> Task :streams:upgrade-system-tests-0110:checkstyleTest
> Task :streams:upgrade-system-tests-0110:spotbugsMain NO-SOURCE
> Task :streams:upgrade-system-tests-0110:test
> Task :streams:upgrade-system-tests-10:compileJava NO-SOURCE
> Task :streams:upgrade-system-tests-10:processResources NO-SOURCE
> Task :streams:upgrade-system-tests-10:classes UP-TO-DATE
> Task :streams:upgrade-system-tests-10:checkstyleMain NO-SOURCE
> Task :streams:upgrade-system-tests-10:compileTestJava
> Task :streams:upgrade-system-tests-10:processTestResources NO-SOURCE
> Task :streams:upgrade-system-tests-10:testClasses
> Task :streams:upgrade-system-tests-10:checkstyleTest
> Task :streams:upgrade-system-tests-10:spotbugsMain NO-SOURCE
> Task :streams:upgrade-system-tests-10:test
> Task :streams:upgrade-system-tests-11:compileJava NO-SOURCE
> Task :streams:upgrade-system-tests-11:processResources NO-SOURCE
> Task :streams:upgrade-system-tests-11:classes UP-TO-DATE
> Task :streams:upgrade-system-tests-11:checkstyleMain NO-SOURCE
> Task :streams:upgrade-system-tests-11:compileTestJava
> Task :streams:upgrade-system-tests-11:processTestResources NO-SOURCE
> Task :streams:upgrade-system-tests-11:testClasses
> Task :streams:upgrade-system-tests-11:checkstyleTest
> Task :streams:upgrade-system-tests-11:spotbugsMain NO-SOURCE
> Task :streams:upgrade-system-tests-11:test
> Task :streams:upgrade-system-tests-20:compileJava NO-SOURCE
> Task :streams:upgrade-system-tests-20:processResources NO-SOURCE
> Task :streams:upgrade-system-tests-20:classes UP-TO-DATE
> Task :streams:upgrade-system-tests-20:checkstyleMain NO-SOURCE
> Task :streams:upgrade-system-tests-20:compileTestJava
> Task :streams:upgrade-system-tests-20:processTestResources NO-SOURCE
> Task :streams:upgrade-system-tests-20:testClasses
> Task :streams:upgrade-system-tests-20:checkstyleTest
> Task :streams:upgrade-system-tests-20:spotbugsMain NO-SOURCE
> Task :streams:upgrade-system-tests-20:test
> Task :streams:upgrade-system-tests-21:compileJava NO-SOURCE
> Task :streams:upgrade-system-tests-21:processResources NO-SOURCE
> Task :streams:upgrade-system-tests-21:classes UP-TO-DATE
> Task :streams:upgrade-system-tests-21:checkstyleMain NO-SOURCE
> Task :streams:upgrade-system-tests-21:compileTestJava
> Task :streams:upgrade-system-tests-21:processTestResources NO-SOURCE
> Task :streams:upgrade-system-tests-21:testClasses
> Task :streams:upgrade-system-tests-21:checkstyleTest
> Task :streams:upgrade-system-tests-21:spotbugsMain NO-SOURCE
> Task :streams:upgrade-system-tests-21:test
> Task :streams:upgrade-system-tests-22:compileJava NO-SOURCE
> Task :streams:upgrade-system-tests-22:processResources NO-SOURCE
> Task :streams:upgrade-system-tests-22:classes UP-TO-DATE
> Task :streams:upgrade-system-tests-22:checkstyleMain NO-SOURCE
> Task :streams:upgrade-system-tests-22:compileTestJava
> Task :streams:upgrade-system-tests-22:processTestResources NO-SOURCE
> Task :streams:upgrade-system-tests-22:testClasses
> Task :streams:upgrade-system-tests-22:checkstyleTest
> Task :streams:upgrade-system-tests-22:spotbugsMain NO-SOURCE
> Task :streams:upgrade-system-tests-22:test
> Task :streams:upgrade-system-tests-23:compileJava NO-SOURCE
> Task :streams:upgrade-system-tests-23:processResources NO-SOURCE
> Task :streams:upgrade-system-tests-23:classes UP-TO-DATE
> Task :streams:upgrade-system-tests-23:checkstyleMain NO-SOURCE
> Task :streams:upgrade-system-tests-23:compileTestJava
> Task :streams:upgrade-system-tests-23:processTestResources NO-SOURCE
> Task :streams:upgrade-system-tests-23:testClasses
> Task :streams:upgrade-system-tests-23:checkstyleTest
> Task :streams:upgrade-system-tests-23:spotbugsMain NO-SOURCE
> Task :streams:upgrade-system-tests-23:test
> Task :streams:upgrade-system-tests-24:compileJava NO-SOURCE
> Task :streams:upgrade-system-tests-24:processResources NO-SOURCE
> Task :streams:upgrade-system-tests-24:classes UP-TO-DATE
> Task :streams:upgrade-system-tests-24:checkstyleMain NO-SOURCE
> Task :streams:upgrade-system-tests-24:compileTestJava
> Task :streams:upgrade-system-tests-24:processTestResources NO-SOURCE
> Task :streams:upgrade-system-tests-24:testClasses
> Task :streams:upgrade-system-tests-24:checkstyleTest
> Task :streams:upgrade-system-tests-24:spotbugsMain NO-SOURCE
> Task :streams:upgrade-system-tests-24:test
FAILURE: Build failed with an exception.
* What went wrong:
Execution failed for task ':core:test'.
> There were failing tests. See the report at: file://<https://builds.apache.org/job/kafka-trunk-jdk11/ws/core/build/reports/tests/test/index.html>
* Try:
Run with --stacktrace option to get the stack trace. Run with --info or --debug option to get more log output. Run with --scan to get full insights.
* Get more help at https://help.gradle.org
Deprecated Gradle features were used in this build, making it incompatible with Gradle 6.0.
Use '--warning-mode all' to show the individual deprecation warnings.
See https://docs.gradle.org/5.6.2/userguide/command_line_interface.html#sec:command_line_warnings
BUILD FAILED in 1h 52m 26s
209 actionable tasks: 204 executed, 5 up-to-date
Build step 'Execute shell' marked build as failure
Recording test results
ERROR: No tool found matching GRADLE_4_10_2_HOME
Setting GRADLE_4_10_3_HOME=/home/jenkins/tools/gradle/4.10.3
ERROR: No tool found matching GRADLE_4_10_2_HOME
Setting GRADLE_4_10_3_HOME=/home/jenkins/tools/gradle/4.10.3
Not sending mail to unregistered user noreply@github.com
Not sending mail to unregistered user wangguoz@gmail.com
Not sending mail to unregistered user manikumar.reddy@gmail.com
Build failed in Jenkins: kafka-trunk-jdk11 #1050
Posted by Apache Jenkins Server <je...@builds.apache.org>.
See <https://builds.apache.org/job/kafka-trunk-jdk11/1050/display/redirect?page=changes>
Changes:
[github] KAFKA-9293; Fix NPE in DumpLogSegments offsets parser and display
------------------------------------------
[...truncated 5.65 MB...]
org.apache.kafka.streams.test.ConsumerRecordFactoryTest > shouldNotAllowToCreateTopicWithNullTopicNameWithNullKey STARTED
org.apache.kafka.streams.test.ConsumerRecordFactoryTest > shouldNotAllowToCreateTopicWithNullTopicNameWithNullKey PASSED
org.apache.kafka.streams.test.ConsumerRecordFactoryTest > shouldCreateNullKeyConsumerRecordWithOtherTopicNameAndTimestampWithTimetamp STARTED
org.apache.kafka.streams.test.ConsumerRecordFactoryTest > shouldCreateNullKeyConsumerRecordWithOtherTopicNameAndTimestampWithTimetamp PASSED
org.apache.kafka.streams.test.ConsumerRecordFactoryTest > shouldCreateConsumerRecordWithTimestamp STARTED
org.apache.kafka.streams.test.ConsumerRecordFactoryTest > shouldCreateConsumerRecordWithTimestamp PASSED
org.apache.kafka.streams.test.ConsumerRecordFactoryTest > shouldNotAllowToCreateTopicWithNullHeaders STARTED
org.apache.kafka.streams.test.ConsumerRecordFactoryTest > shouldNotAllowToCreateTopicWithNullHeaders PASSED
org.apache.kafka.streams.test.ConsumerRecordFactoryTest > shouldNotAllowToCreateTopicWithNullTopicNameWithDefaultTimestamp STARTED
org.apache.kafka.streams.test.ConsumerRecordFactoryTest > shouldNotAllowToCreateTopicWithNullTopicNameWithDefaultTimestamp PASSED
org.apache.kafka.streams.test.ConsumerRecordFactoryTest > shouldRequireCustomTopicNameIfNotDefaultFactoryTopicName STARTED
org.apache.kafka.streams.test.ConsumerRecordFactoryTest > shouldRequireCustomTopicNameIfNotDefaultFactoryTopicName PASSED
org.apache.kafka.streams.test.ConsumerRecordFactoryTest > shouldRequireCustomTopicNameIfNotDefaultFactoryTopicNameWithNullKey STARTED
org.apache.kafka.streams.test.ConsumerRecordFactoryTest > shouldRequireCustomTopicNameIfNotDefaultFactoryTopicNameWithNullKey PASSED
org.apache.kafka.streams.test.ConsumerRecordFactoryTest > shouldCreateConsumerRecord STARTED
org.apache.kafka.streams.test.ConsumerRecordFactoryTest > shouldCreateConsumerRecord PASSED
org.apache.kafka.streams.test.ConsumerRecordFactoryTest > shouldCreateNullKeyConsumerRecord STARTED
org.apache.kafka.streams.test.ConsumerRecordFactoryTest > shouldCreateNullKeyConsumerRecord PASSED
org.apache.kafka.streams.test.ConsumerRecordFactoryTest > shouldCreateConsumerRecordWithOtherTopicName STARTED
org.apache.kafka.streams.test.ConsumerRecordFactoryTest > shouldCreateConsumerRecordWithOtherTopicName PASSED
org.apache.kafka.streams.test.ConsumerRecordFactoryTest > shouldAdvanceTime STARTED
org.apache.kafka.streams.test.ConsumerRecordFactoryTest > shouldAdvanceTime PASSED
org.apache.kafka.streams.test.ConsumerRecordFactoryTest > shouldNotAllowToCreateTopicWithNullTopicNameWithKeyValuePairs STARTED
org.apache.kafka.streams.test.ConsumerRecordFactoryTest > shouldNotAllowToCreateTopicWithNullTopicNameWithKeyValuePairs PASSED
org.apache.kafka.streams.test.ConsumerRecordFactoryTest > shouldRequireCustomTopicNameIfNotDefaultFactoryTopicNameWithKeyValuePairsAndCustomTimestamps STARTED
org.apache.kafka.streams.test.ConsumerRecordFactoryTest > shouldRequireCustomTopicNameIfNotDefaultFactoryTopicNameWithKeyValuePairsAndCustomTimestamps PASSED
org.apache.kafka.streams.test.ConsumerRecordFactoryTest > shouldRequireCustomTopicNameIfNotDefaultFactoryTopicNameWithKeyValuePairs STARTED
org.apache.kafka.streams.test.ConsumerRecordFactoryTest > shouldRequireCustomTopicNameIfNotDefaultFactoryTopicNameWithKeyValuePairs PASSED
org.apache.kafka.streams.test.ConsumerRecordFactoryTest > shouldCreateConsumerRecordWithOtherTopicNameAndTimestamp STARTED
org.apache.kafka.streams.test.ConsumerRecordFactoryTest > shouldCreateConsumerRecordWithOtherTopicNameAndTimestamp PASSED
org.apache.kafka.streams.test.ConsumerRecordFactoryTest > shouldNotAllowToCreateTopicWithNullTopicNameWithKeyValuePairsAndCustomTimestamps STARTED
org.apache.kafka.streams.test.ConsumerRecordFactoryTest > shouldNotAllowToCreateTopicWithNullTopicNameWithKeyValuePairsAndCustomTimestamps PASSED
org.apache.kafka.streams.test.ConsumerRecordFactoryTest > shouldNotAllowToCreateTopicWithNullTopicName STARTED
org.apache.kafka.streams.test.ConsumerRecordFactoryTest > shouldNotAllowToCreateTopicWithNullTopicName PASSED
org.apache.kafka.streams.test.ConsumerRecordFactoryTest > shouldCreateConsumerRecordsFromKeyValuePairsWithCustomTimestampAndIncrementsAndNotAdvanceTime STARTED
org.apache.kafka.streams.test.ConsumerRecordFactoryTest > shouldCreateConsumerRecordsFromKeyValuePairsWithCustomTimestampAndIncrementsAndNotAdvanceTime PASSED
org.apache.kafka.streams.test.ConsumerRecordFactoryTest > shouldCreateNullKeyConsumerRecordWithTimestampWithTimestamp STARTED
org.apache.kafka.streams.test.ConsumerRecordFactoryTest > shouldCreateNullKeyConsumerRecordWithTimestampWithTimestamp PASSED
org.apache.kafka.streams.test.ConsumerRecordFactoryTest > shouldRequireCustomTopicNameIfNotDefaultFactoryTopicNameWithNullKeyAndDefaultTimestamp STARTED
org.apache.kafka.streams.test.ConsumerRecordFactoryTest > shouldRequireCustomTopicNameIfNotDefaultFactoryTopicNameWithNullKeyAndDefaultTimestamp PASSED
org.apache.kafka.streams.test.ConsumerRecordFactoryTest > shouldCreateConsumerRecordsFromKeyValuePairsWithTimestampAndIncrements STARTED
org.apache.kafka.streams.test.ConsumerRecordFactoryTest > shouldCreateConsumerRecordsFromKeyValuePairsWithTimestampAndIncrements PASSED
org.apache.kafka.streams.MockTimeTest > shouldGetNanosAsMillis STARTED
org.apache.kafka.streams.MockTimeTest > shouldGetNanosAsMillis PASSED
org.apache.kafka.streams.MockTimeTest > shouldSetStartTime STARTED
org.apache.kafka.streams.MockTimeTest > shouldSetStartTime PASSED
org.apache.kafka.streams.MockTimeTest > shouldNotAllowNegativeSleep STARTED
org.apache.kafka.streams.MockTimeTest > shouldNotAllowNegativeSleep PASSED
org.apache.kafka.streams.MockTimeTest > shouldAdvanceTimeOnSleep STARTED
org.apache.kafka.streams.MockTimeTest > shouldAdvanceTimeOnSleep PASSED
org.apache.kafka.streams.internals.KeyValueStoreFacadeTest > shouldReturnIsOpen STARTED
org.apache.kafka.streams.internals.KeyValueStoreFacadeTest > shouldReturnIsOpen PASSED
org.apache.kafka.streams.internals.KeyValueStoreFacadeTest > shouldDeleteAndReturnPlainValue STARTED
org.apache.kafka.streams.internals.KeyValueStoreFacadeTest > shouldDeleteAndReturnPlainValue PASSED
org.apache.kafka.streams.internals.KeyValueStoreFacadeTest > shouldReturnName STARTED
org.apache.kafka.streams.internals.KeyValueStoreFacadeTest > shouldReturnName PASSED
org.apache.kafka.streams.internals.KeyValueStoreFacadeTest > shouldPutWithUnknownTimestamp STARTED
org.apache.kafka.streams.internals.KeyValueStoreFacadeTest > shouldPutWithUnknownTimestamp PASSED
org.apache.kafka.streams.internals.KeyValueStoreFacadeTest > shouldPutAllWithUnknownTimestamp STARTED
org.apache.kafka.streams.internals.KeyValueStoreFacadeTest > shouldPutAllWithUnknownTimestamp PASSED
org.apache.kafka.streams.internals.KeyValueStoreFacadeTest > shouldReturnIsPersistent STARTED
org.apache.kafka.streams.internals.KeyValueStoreFacadeTest > shouldReturnIsPersistent PASSED
org.apache.kafka.streams.internals.KeyValueStoreFacadeTest > shouldPutIfAbsentWithUnknownTimestamp STARTED
org.apache.kafka.streams.internals.KeyValueStoreFacadeTest > shouldPutIfAbsentWithUnknownTimestamp PASSED
org.apache.kafka.streams.internals.KeyValueStoreFacadeTest > shouldForwardClose STARTED
org.apache.kafka.streams.internals.KeyValueStoreFacadeTest > shouldForwardClose PASSED
org.apache.kafka.streams.internals.KeyValueStoreFacadeTest > shouldForwardFlush STARTED
org.apache.kafka.streams.internals.KeyValueStoreFacadeTest > shouldForwardFlush PASSED
org.apache.kafka.streams.internals.KeyValueStoreFacadeTest > shouldForwardInit STARTED
org.apache.kafka.streams.internals.KeyValueStoreFacadeTest > shouldForwardInit PASSED
> Task :streams:upgrade-system-tests-0102:spotbugsMain NO-SOURCE
> Task :streams:upgrade-system-tests-0102:test
> Task :streams:upgrade-system-tests-0110:compileJava NO-SOURCE
> Task :streams:upgrade-system-tests-0110:processResources NO-SOURCE
> Task :streams:upgrade-system-tests-0110:classes UP-TO-DATE
> Task :streams:upgrade-system-tests-0110:checkstyleMain NO-SOURCE
> Task :streams:upgrade-system-tests-0110:compileTestJava
> Task :streams:upgrade-system-tests-0110:processTestResources NO-SOURCE
> Task :streams:upgrade-system-tests-0110:testClasses
> Task :streams:upgrade-system-tests-0110:checkstyleTest
> Task :streams:upgrade-system-tests-0110:spotbugsMain NO-SOURCE
> Task :streams:upgrade-system-tests-0110:test
> Task :streams:upgrade-system-tests-10:compileJava NO-SOURCE
> Task :streams:upgrade-system-tests-10:processResources NO-SOURCE
> Task :streams:upgrade-system-tests-10:classes UP-TO-DATE
> Task :streams:upgrade-system-tests-10:checkstyleMain NO-SOURCE
> Task :streams:upgrade-system-tests-10:compileTestJava
> Task :streams:upgrade-system-tests-10:processTestResources NO-SOURCE
> Task :streams:upgrade-system-tests-10:testClasses
> Task :streams:upgrade-system-tests-10:checkstyleTest
> Task :streams:upgrade-system-tests-10:spotbugsMain NO-SOURCE
> Task :streams:upgrade-system-tests-10:test
> Task :streams:upgrade-system-tests-11:compileJava NO-SOURCE
> Task :streams:upgrade-system-tests-11:processResources NO-SOURCE
> Task :streams:upgrade-system-tests-11:classes UP-TO-DATE
> Task :streams:upgrade-system-tests-11:checkstyleMain NO-SOURCE
> Task :streams:upgrade-system-tests-11:compileTestJava
> Task :streams:upgrade-system-tests-11:processTestResources NO-SOURCE
> Task :streams:upgrade-system-tests-11:testClasses
> Task :streams:upgrade-system-tests-11:checkstyleTest
> Task :streams:upgrade-system-tests-11:spotbugsMain NO-SOURCE
> Task :streams:upgrade-system-tests-11:test
> Task :streams:upgrade-system-tests-20:compileJava NO-SOURCE
> Task :streams:upgrade-system-tests-20:processResources NO-SOURCE
> Task :streams:upgrade-system-tests-20:classes UP-TO-DATE
> Task :streams:upgrade-system-tests-20:checkstyleMain NO-SOURCE
> Task :streams:upgrade-system-tests-20:compileTestJava
> Task :streams:upgrade-system-tests-20:processTestResources NO-SOURCE
> Task :streams:upgrade-system-tests-20:testClasses
> Task :streams:upgrade-system-tests-20:checkstyleTest
> Task :streams:upgrade-system-tests-20:spotbugsMain NO-SOURCE
> Task :streams:upgrade-system-tests-20:test
> Task :streams:upgrade-system-tests-21:compileJava NO-SOURCE
> Task :streams:upgrade-system-tests-21:processResources NO-SOURCE
> Task :streams:upgrade-system-tests-21:classes UP-TO-DATE
> Task :streams:upgrade-system-tests-21:checkstyleMain NO-SOURCE
> Task :streams:upgrade-system-tests-21:compileTestJava
> Task :streams:upgrade-system-tests-21:processTestResources NO-SOURCE
> Task :streams:upgrade-system-tests-21:testClasses
> Task :streams:upgrade-system-tests-21:checkstyleTest
> Task :streams:upgrade-system-tests-21:spotbugsMain NO-SOURCE
> Task :streams:upgrade-system-tests-21:test
> Task :streams:upgrade-system-tests-22:compileJava NO-SOURCE
> Task :streams:upgrade-system-tests-22:processResources NO-SOURCE
> Task :streams:upgrade-system-tests-22:classes UP-TO-DATE
> Task :streams:upgrade-system-tests-22:checkstyleMain NO-SOURCE
> Task :streams:upgrade-system-tests-22:compileTestJava
> Task :streams:upgrade-system-tests-22:processTestResources NO-SOURCE
> Task :streams:upgrade-system-tests-22:testClasses
> Task :streams:upgrade-system-tests-22:checkstyleTest
> Task :streams:upgrade-system-tests-22:spotbugsMain NO-SOURCE
> Task :streams:upgrade-system-tests-22:test
> Task :streams:upgrade-system-tests-23:compileJava NO-SOURCE
> Task :streams:upgrade-system-tests-23:processResources NO-SOURCE
> Task :streams:upgrade-system-tests-23:classes UP-TO-DATE
> Task :streams:upgrade-system-tests-23:checkstyleMain NO-SOURCE
> Task :streams:upgrade-system-tests-23:compileTestJava
> Task :streams:upgrade-system-tests-23:processTestResources NO-SOURCE
> Task :streams:upgrade-system-tests-23:testClasses
> Task :streams:upgrade-system-tests-23:checkstyleTest
> Task :streams:upgrade-system-tests-23:spotbugsMain NO-SOURCE
> Task :streams:upgrade-system-tests-23:test
> Task :streams:upgrade-system-tests-24:compileJava NO-SOURCE
> Task :streams:upgrade-system-tests-24:processResources NO-SOURCE
> Task :streams:upgrade-system-tests-24:classes UP-TO-DATE
> Task :streams:upgrade-system-tests-24:checkstyleMain NO-SOURCE
> Task :streams:upgrade-system-tests-24:compileTestJava
> Task :streams:upgrade-system-tests-24:processTestResources NO-SOURCE
> Task :streams:upgrade-system-tests-24:testClasses
> Task :streams:upgrade-system-tests-24:checkstyleTest
> Task :streams:upgrade-system-tests-24:spotbugsMain NO-SOURCE
> Task :streams:upgrade-system-tests-24:test
FAILURE: Build failed with an exception.
* What went wrong:
Execution failed for task ':core:test'.
> There were failing tests. See the report at: file://<https://builds.apache.org/job/kafka-trunk-jdk11/ws/core/build/reports/tests/test/index.html>
* Try:
Run with --stacktrace option to get the stack trace. Run with --info or --debug option to get more log output. Run with --scan to get full insights.
* Get more help at https://help.gradle.org
Deprecated Gradle features were used in this build, making it incompatible with Gradle 6.0.
Use '--warning-mode all' to show the individual deprecation warnings.
See https://docs.gradle.org/5.6.2/userguide/command_line_interface.html#sec:command_line_warnings
BUILD FAILED in 1h 51m 12s
209 actionable tasks: 204 executed, 5 up-to-date
Build step 'Execute shell' marked build as failure
Recording test results
ERROR: No tool found matching GRADLE_4_10_2_HOME
Setting GRADLE_4_10_3_HOME=/home/jenkins/tools/gradle/4.10.3
ERROR: No tool found matching GRADLE_4_10_2_HOME
Setting GRADLE_4_10_3_HOME=/home/jenkins/tools/gradle/4.10.3
Not sending mail to unregistered user noreply@github.com
Not sending mail to unregistered user wangguoz@gmail.com
Build failed in Jenkins: kafka-trunk-jdk11 #1049
Posted by Apache Jenkins Server <je...@builds.apache.org>.
See <https://builds.apache.org/job/kafka-trunk-jdk11/1049/display/redirect>
Changes:
------------------------------------------
Started by an SCM change
Running as SYSTEM
[EnvInject] - Loading node environment variables.
Building remotely on H30 (ubuntu) in workspace <https://builds.apache.org/job/kafka-trunk-jdk11/ws/>
[WS-CLEANUP] Deleting project workspace...
[WS-CLEANUP] Deferred wipeout is used...
[WS-CLEANUP] Done
No credentials specified
Cloning the remote Git repository
Cloning repository https://github.com/apache/kafka.git
> git init <https://builds.apache.org/job/kafka-trunk-jdk11/ws/> # timeout=10
ERROR: Error cloning remote repo 'origin'
hudson.plugins.git.GitException: Could not init <https://builds.apache.org/job/kafka-trunk-jdk11/ws/>
at org.jenkinsci.plugins.gitclient.CliGitAPIImpl$5.execute(CliGitAPIImpl.java:916)
at org.jenkinsci.plugins.gitclient.CliGitAPIImpl$2.execute(CliGitAPIImpl.java:708)
at org.jenkinsci.plugins.gitclient.RemoteGitImpl$CommandInvocationHandler$1.call(RemoteGitImpl.java:153)
at org.jenkinsci.plugins.gitclient.RemoteGitImpl$CommandInvocationHandler$1.call(RemoteGitImpl.java:146)
at hudson.remoting.UserRequest.perform(UserRequest.java:212)
at hudson.remoting.UserRequest.perform(UserRequest.java:54)
at hudson.remoting.Request$2.run(Request.java:369)
at hudson.remoting.InterceptingExecutorService$1.call(InterceptingExecutorService.java:72)
at java.util.concurrent.FutureTask.run(FutureTask.java:266)
at java.util.concurrent.ThreadPoolExecutor.runWorker(ThreadPoolExecutor.java:1149)
at java.util.concurrent.ThreadPoolExecutor$Worker.run(ThreadPoolExecutor.java:624)
at java.lang.Thread.run(Thread.java:748)
Suppressed: hudson.remoting.Channel$CallSiteStackTrace: Remote call to H30
at hudson.remoting.Channel.attachCallSiteStackTrace(Channel.java:1743)
at hudson.remoting.UserRequest$ExceptionResponse.retrieve(UserRequest.java:357)
at hudson.remoting.Channel.call(Channel.java:957)
at org.jenkinsci.plugins.gitclient.RemoteGitImpl$CommandInvocationHandler.execute(RemoteGitImpl.java:146)
at sun.reflect.GeneratedMethodAccessor975.invoke(Unknown Source)
at sun.reflect.DelegatingMethodAccessorImpl.invoke(DelegatingMethodAccessorImpl.java:43)
at java.lang.reflect.Method.invoke(Method.java:498)
at org.jenkinsci.plugins.gitclient.RemoteGitImpl$CommandInvocationHandler.invoke(RemoteGitImpl.java:132)
at com.sun.proxy.$Proxy144.execute(Unknown Source)
at hudson.plugins.git.GitSCM.retrieveChanges(GitSCM.java:1152)
at hudson.plugins.git.GitSCM.checkout(GitSCM.java:1192)
at hudson.scm.SCM.checkout(SCM.java:504)
at hudson.model.AbstractProject.checkout(AbstractProject.java:1208)
at hudson.model.AbstractBuild$AbstractBuildExecution.defaultCheckout(AbstractBuild.java:574)
at jenkins.scm.SCMCheckoutStrategy.checkout(SCMCheckoutStrategy.java:86)
at hudson.model.AbstractBuild$AbstractBuildExecution.run(AbstractBuild.java:499)
at hudson.model.Run.execute(Run.java:1815)
at hudson.model.FreeStyleBuild.run(FreeStyleBuild.java:43)
at hudson.model.ResourceController.execute(ResourceController.java:97)
at hudson.model.Executor.run(Executor.java:429)
Caused by: hudson.plugins.git.GitException: Error performing git command
at org.jenkinsci.plugins.gitclient.CliGitAPIImpl.launchCommandIn(CliGitAPIImpl.java:2181)
at org.jenkinsci.plugins.gitclient.CliGitAPIImpl.launchCommandIn(CliGitAPIImpl.java:2140)
at org.jenkinsci.plugins.gitclient.CliGitAPIImpl.launchCommandIn(CliGitAPIImpl.java:2136)
at org.jenkinsci.plugins.gitclient.CliGitAPIImpl.launchCommand(CliGitAPIImpl.java:1741)
at org.jenkinsci.plugins.gitclient.CliGitAPIImpl$5.execute(CliGitAPIImpl.java:914)
... 11 more
Caused by: java.lang.OutOfMemoryError: unable to create new native thread
at java.lang.Thread.start0(Native Method)
at java.lang.Thread.start(Thread.java:717)
at java.util.concurrent.ThreadPoolExecutor.addWorker(ThreadPoolExecutor.java:957)
at java.util.concurrent.ThreadPoolExecutor.execute(ThreadPoolExecutor.java:1378)
at java.util.concurrent.AbstractExecutorService.submit(AbstractExecutorService.java:112)
at hudson.Proc.joinWithTimeout(Proc.java:158)
at org.jenkinsci.plugins.gitclient.CliGitAPIImpl.launchCommandIn(CliGitAPIImpl.java:2168)
... 15 more
ERROR: Error cloning remote repo 'origin'
Retrying after 10 seconds
No credentials specified
> git rev-parse --is-inside-work-tree # timeout=10
ERROR: Workspace has a .git repository, but it appears to be corrupt.
hudson.plugins.git.GitException: Error performing git command
at org.jenkinsci.plugins.gitclient.CliGitAPIImpl.launchCommandIn(CliGitAPIImpl.java:2181)
at org.jenkinsci.plugins.gitclient.CliGitAPIImpl.launchCommandIn(CliGitAPIImpl.java:2140)
at org.jenkinsci.plugins.gitclient.CliGitAPIImpl.launchCommandIn(CliGitAPIImpl.java:2136)
at org.jenkinsci.plugins.gitclient.CliGitAPIImpl.launchCommand(CliGitAPIImpl.java:1741)
at org.jenkinsci.plugins.gitclient.CliGitAPIImpl.launchCommand(CliGitAPIImpl.java:1753)
at org.jenkinsci.plugins.gitclient.CliGitAPIImpl.hasGitRepo(CliGitAPIImpl.java:329)
at hudson.plugins.git.GitAPI.hasGitRepo(GitAPI.java:232)
at sun.reflect.GeneratedMethodAccessor46.invoke(Unknown Source)
at sun.reflect.DelegatingMethodAccessorImpl.invoke(DelegatingMethodAccessorImpl.java:43)
at java.lang.reflect.Method.invoke(Method.java:498)
at hudson.remoting.RemoteInvocationHandler$RPCRequest.perform(RemoteInvocationHandler.java:929)
at hudson.remoting.RemoteInvocationHandler$RPCRequest.call(RemoteInvocationHandler.java:903)
at hudson.remoting.RemoteInvocationHandler$RPCRequest.call(RemoteInvocationHandler.java:855)
at hudson.remoting.UserRequest.perform(UserRequest.java:212)
at hudson.remoting.UserRequest.perform(UserRequest.java:54)
at hudson.remoting.Request$2.run(Request.java:369)
at hudson.remoting.InterceptingExecutorService$1.call(InterceptingExecutorService.java:72)
at java.util.concurrent.FutureTask.run(FutureTask.java:266)
at java.util.concurrent.ThreadPoolExecutor.runWorker(ThreadPoolExecutor.java:1149)
at java.util.concurrent.ThreadPoolExecutor$Worker.run(ThreadPoolExecutor.java:624)
at java.lang.Thread.run(Thread.java:748)
Caused by: java.lang.OutOfMemoryError: unable to create new native thread
at java.lang.Thread.start0(Native Method)
at java.lang.Thread.start(Thread.java:717)
at hudson.Proc$LocalProc.<init>(Proc.java:282)
at hudson.Proc$LocalProc.<init>(Proc.java:219)
at hudson.Launcher$LocalLauncher.launch(Launcher.java:937)
at hudson.Launcher$ProcStarter.start(Launcher.java:455)
at org.jenkinsci.plugins.gitclient.CliGitAPIImpl.launchCommandIn(CliGitAPIImpl.java:2168)
... 20 more
Cloning the remote Git repository
Cloning repository https://github.com/apache/kafka.git
> git init <https://builds.apache.org/job/kafka-trunk-jdk11/ws/> # timeout=10
ERROR: Error cloning remote repo 'origin'
hudson.plugins.git.GitException: Could not init <https://builds.apache.org/job/kafka-trunk-jdk11/ws/>
at org.jenkinsci.plugins.gitclient.CliGitAPIImpl$5.execute(CliGitAPIImpl.java:916)
at org.jenkinsci.plugins.gitclient.CliGitAPIImpl$2.execute(CliGitAPIImpl.java:708)
at org.jenkinsci.plugins.gitclient.RemoteGitImpl$CommandInvocationHandler$1.call(RemoteGitImpl.java:153)
at org.jenkinsci.plugins.gitclient.RemoteGitImpl$CommandInvocationHandler$1.call(RemoteGitImpl.java:146)
at hudson.remoting.UserRequest.perform(UserRequest.java:212)
at hudson.remoting.UserRequest.perform(UserRequest.java:54)
at hudson.remoting.Request$2.run(Request.java:369)
at hudson.remoting.InterceptingExecutorService$1.call(InterceptingExecutorService.java:72)
at java.util.concurrent.FutureTask.run(FutureTask.java:266)
at java.util.concurrent.ThreadPoolExecutor.runWorker(ThreadPoolExecutor.java:1149)
at java.util.concurrent.ThreadPoolExecutor$Worker.run(ThreadPoolExecutor.java:624)
at java.lang.Thread.run(Thread.java:748)
Suppressed: hudson.remoting.Channel$CallSiteStackTrace: Remote call to H30
at hudson.remoting.Channel.attachCallSiteStackTrace(Channel.java:1743)
at hudson.remoting.UserRequest$ExceptionResponse.retrieve(UserRequest.java:357)
at hudson.remoting.Channel.call(Channel.java:957)
at org.jenkinsci.plugins.gitclient.RemoteGitImpl$CommandInvocationHandler.execute(RemoteGitImpl.java:146)
at sun.reflect.GeneratedMethodAccessor975.invoke(Unknown Source)
at sun.reflect.DelegatingMethodAccessorImpl.invoke(DelegatingMethodAccessorImpl.java:43)
at java.lang.reflect.Method.invoke(Method.java:498)
at org.jenkinsci.plugins.gitclient.RemoteGitImpl$CommandInvocationHandler.invoke(RemoteGitImpl.java:132)
at com.sun.proxy.$Proxy144.execute(Unknown Source)
at hudson.plugins.git.GitSCM.retrieveChanges(GitSCM.java:1152)
at hudson.plugins.git.GitSCM.checkout(GitSCM.java:1192)
at hudson.scm.SCM.checkout(SCM.java:504)
at hudson.model.AbstractProject.checkout(AbstractProject.java:1208)
at hudson.model.AbstractBuild$AbstractBuildExecution.defaultCheckout(AbstractBuild.java:574)
at jenkins.scm.SCMCheckoutStrategy.checkout(SCMCheckoutStrategy.java:86)
at hudson.model.AbstractBuild$AbstractBuildExecution.run(AbstractBuild.java:499)
at hudson.model.Run.execute(Run.java:1815)
at hudson.model.FreeStyleBuild.run(FreeStyleBuild.java:43)
at hudson.model.ResourceController.execute(ResourceController.java:97)
at hudson.model.Executor.run(Executor.java:429)
Caused by: hudson.plugins.git.GitException: Error performing git command
at org.jenkinsci.plugins.gitclient.CliGitAPIImpl.launchCommandIn(CliGitAPIImpl.java:2181)
at org.jenkinsci.plugins.gitclient.CliGitAPIImpl.launchCommandIn(CliGitAPIImpl.java:2140)
at org.jenkinsci.plugins.gitclient.CliGitAPIImpl.launchCommandIn(CliGitAPIImpl.java:2136)
at org.jenkinsci.plugins.gitclient.CliGitAPIImpl.launchCommand(CliGitAPIImpl.java:1741)
at org.jenkinsci.plugins.gitclient.CliGitAPIImpl$5.execute(CliGitAPIImpl.java:914)
... 11 more
Caused by: java.lang.OutOfMemoryError: unable to create new native thread
at java.lang.Thread.start0(Native Method)
at java.lang.Thread.start(Thread.java:717)
at hudson.Proc$LocalProc.<init>(Proc.java:282)
at hudson.Proc$LocalProc.<init>(Proc.java:219)
at hudson.Launcher$LocalLauncher.launch(Launcher.java:937)
at hudson.Launcher$ProcStarter.start(Launcher.java:455)
at org.jenkinsci.plugins.gitclient.CliGitAPIImpl.launchCommandIn(CliGitAPIImpl.java:2168)
... 15 more
ERROR: Error cloning remote repo 'origin'
Retrying after 10 seconds
No credentials specified
> git rev-parse --is-inside-work-tree # timeout=10
ERROR: Workspace has a .git repository, but it appears to be corrupt.
hudson.plugins.git.GitException: Error performing git command
at org.jenkinsci.plugins.gitclient.CliGitAPIImpl.launchCommandIn(CliGitAPIImpl.java:2181)
at org.jenkinsci.plugins.gitclient.CliGitAPIImpl.launchCommandIn(CliGitAPIImpl.java:2140)
at org.jenkinsci.plugins.gitclient.CliGitAPIImpl.launchCommandIn(CliGitAPIImpl.java:2136)
at org.jenkinsci.plugins.gitclient.CliGitAPIImpl.launchCommand(CliGitAPIImpl.java:1741)
at org.jenkinsci.plugins.gitclient.CliGitAPIImpl.launchCommand(CliGitAPIImpl.java:1753)
at org.jenkinsci.plugins.gitclient.CliGitAPIImpl.hasGitRepo(CliGitAPIImpl.java:329)
at hudson.plugins.git.GitAPI.hasGitRepo(GitAPI.java:232)
at sun.reflect.GeneratedMethodAccessor46.invoke(Unknown Source)
at sun.reflect.DelegatingMethodAccessorImpl.invoke(DelegatingMethodAccessorImpl.java:43)
at java.lang.reflect.Method.invoke(Method.java:498)
at hudson.remoting.RemoteInvocationHandler$RPCRequest.perform(RemoteInvocationHandler.java:929)
at hudson.remoting.RemoteInvocationHandler$RPCRequest.call(RemoteInvocationHandler.java:903)
at hudson.remoting.RemoteInvocationHandler$RPCRequest.call(RemoteInvocationHandler.java:855)
at hudson.remoting.UserRequest.perform(UserRequest.java:212)
at hudson.remoting.UserRequest.perform(UserRequest.java:54)
at hudson.remoting.Request$2.run(Request.java:369)
at hudson.remoting.InterceptingExecutorService$1.call(InterceptingExecutorService.java:72)
at java.util.concurrent.FutureTask.run(FutureTask.java:266)
at java.util.concurrent.ThreadPoolExecutor.runWorker(ThreadPoolExecutor.java:1149)
at java.util.concurrent.ThreadPoolExecutor$Worker.run(ThreadPoolExecutor.java:624)
at java.lang.Thread.run(Thread.java:748)
Caused by: java.lang.OutOfMemoryError: unable to create new native thread
at java.lang.Thread.start0(Native Method)
at java.lang.Thread.start(Thread.java:717)
at hudson.Proc$LocalProc.<init>(Proc.java:282)
at hudson.Proc$LocalProc.<init>(Proc.java:219)
at hudson.Launcher$LocalLauncher.launch(Launcher.java:937)
at hudson.Launcher$ProcStarter.start(Launcher.java:455)
at org.jenkinsci.plugins.gitclient.CliGitAPIImpl.launchCommandIn(CliGitAPIImpl.java:2168)
... 20 more
Cloning the remote Git repository
Cloning repository https://github.com/apache/kafka.git
> git init <https://builds.apache.org/job/kafka-trunk-jdk11/ws/> # timeout=10
ERROR: Error cloning remote repo 'origin'
hudson.plugins.git.GitException: Could not init <https://builds.apache.org/job/kafka-trunk-jdk11/ws/>
at org.jenkinsci.plugins.gitclient.CliGitAPIImpl$5.execute(CliGitAPIImpl.java:916)
at org.jenkinsci.plugins.gitclient.CliGitAPIImpl$2.execute(CliGitAPIImpl.java:708)
at org.jenkinsci.plugins.gitclient.RemoteGitImpl$CommandInvocationHandler$1.call(RemoteGitImpl.java:153)
at org.jenkinsci.plugins.gitclient.RemoteGitImpl$CommandInvocationHandler$1.call(RemoteGitImpl.java:146)
at hudson.remoting.UserRequest.perform(UserRequest.java:212)
at hudson.remoting.UserRequest.perform(UserRequest.java:54)
at hudson.remoting.Request$2.run(Request.java:369)
at hudson.remoting.InterceptingExecutorService$1.call(InterceptingExecutorService.java:72)
at java.util.concurrent.FutureTask.run(FutureTask.java:266)
at java.util.concurrent.ThreadPoolExecutor.runWorker(ThreadPoolExecutor.java:1149)
at java.util.concurrent.ThreadPoolExecutor$Worker.run(ThreadPoolExecutor.java:624)
at java.lang.Thread.run(Thread.java:748)
Suppressed: hudson.remoting.Channel$CallSiteStackTrace: Remote call to H30
at hudson.remoting.Channel.attachCallSiteStackTrace(Channel.java:1743)
at hudson.remoting.UserRequest$ExceptionResponse.retrieve(UserRequest.java:357)
at hudson.remoting.Channel.call(Channel.java:957)
at org.jenkinsci.plugins.gitclient.RemoteGitImpl$CommandInvocationHandler.execute(RemoteGitImpl.java:146)
at sun.reflect.GeneratedMethodAccessor975.invoke(Unknown Source)
at sun.reflect.DelegatingMethodAccessorImpl.invoke(DelegatingMethodAccessorImpl.java:43)
at java.lang.reflect.Method.invoke(Method.java:498)
at org.jenkinsci.plugins.gitclient.RemoteGitImpl$CommandInvocationHandler.invoke(RemoteGitImpl.java:132)
at com.sun.proxy.$Proxy144.execute(Unknown Source)
at hudson.plugins.git.GitSCM.retrieveChanges(GitSCM.java:1152)
at hudson.plugins.git.GitSCM.checkout(GitSCM.java:1192)
at hudson.scm.SCM.checkout(SCM.java:504)
at hudson.model.AbstractProject.checkout(AbstractProject.java:1208)
at hudson.model.AbstractBuild$AbstractBuildExecution.defaultCheckout(AbstractBuild.java:574)
at jenkins.scm.SCMCheckoutStrategy.checkout(SCMCheckoutStrategy.java:86)
at hudson.model.AbstractBuild$AbstractBuildExecution.run(AbstractBuild.java:499)
at hudson.model.Run.execute(Run.java:1815)
at hudson.model.FreeStyleBuild.run(FreeStyleBuild.java:43)
at hudson.model.ResourceController.execute(ResourceController.java:97)
at hudson.model.Executor.run(Executor.java:429)
Caused by: hudson.plugins.git.GitException: Error performing git command
at org.jenkinsci.plugins.gitclient.CliGitAPIImpl.launchCommandIn(CliGitAPIImpl.java:2181)
at org.jenkinsci.plugins.gitclient.CliGitAPIImpl.launchCommandIn(CliGitAPIImpl.java:2140)
at org.jenkinsci.plugins.gitclient.CliGitAPIImpl.launchCommandIn(CliGitAPIImpl.java:2136)
at org.jenkinsci.plugins.gitclient.CliGitAPIImpl.launchCommand(CliGitAPIImpl.java:1741)
at org.jenkinsci.plugins.gitclient.CliGitAPIImpl$5.execute(CliGitAPIImpl.java:914)
... 11 more
Caused by: java.lang.OutOfMemoryError: unable to create new native thread
at java.lang.Thread.start0(Native Method)
at java.lang.Thread.start(Thread.java:717)
at hudson.Proc$LocalProc.<init>(Proc.java:282)
at hudson.Proc$LocalProc.<init>(Proc.java:219)
at hudson.Launcher$LocalLauncher.launch(Launcher.java:937)
at hudson.Launcher$ProcStarter.start(Launcher.java:455)
at org.jenkinsci.plugins.gitclient.CliGitAPIImpl.launchCommandIn(CliGitAPIImpl.java:2168)
... 15 more
ERROR: Error cloning remote repo 'origin'
Recording test results
ERROR: Step ?Publish JUnit test result report? failed: No test report files were found. Configuration error?
Not sending mail to unregistered user noreply@github.com
Not sending mail to unregistered user wangguoz@gmail.com