You are viewing a plain text version of this content. The canonical link for it is here.
Posted to dev@lucene.apache.org by Apache Jenkins Server <je...@builds.apache.org> on 2011/09/23 05:51:23 UTC
[JENKINS] Lucene-trunk - Build # 1683 - Still Failing
Build: https://builds.apache.org/job/Lucene-trunk/1683/
3 tests failed.
REGRESSION: org.apache.lucene.index.TestNRTThreads.testNRTThreads
Error Message:
this writer hit an OutOfMemoryError; cannot commit
Stack Trace:
java.lang.IllegalStateException: this writer hit an OutOfMemoryError; cannot commit
at org.apache.lucene.index.IndexWriter.prepareCommit(IndexWriter.java:2754)
at org.apache.lucene.index.IndexWriter.commitInternal(IndexWriter.java:2904)
at org.apache.lucene.index.IndexWriter.commit(IndexWriter.java:2886)
at org.apache.lucene.index.IndexWriter.commit(IndexWriter.java:2870)
at org.apache.lucene.index.TestNRTThreads.testNRTThreads(TestNRTThreads.java:357)
at org.apache.lucene.util.LuceneTestCase$2$1.evaluate(LuceneTestCase.java:611)
at org.apache.lucene.util.LuceneTestCaseRunner.runChild(LuceneTestCaseRunner.java:148)
at org.apache.lucene.util.LuceneTestCaseRunner.runChild(LuceneTestCaseRunner.java:50)
REGRESSION: org.apache.lucene.util.fst.TestFSTs.testRealTerms
Error Message:
Java heap space
Stack Trace:
java.lang.OutOfMemoryError: Java heap space
at org.apache.lucene.util.ArrayUtil.grow(ArrayUtil.java:338)
at org.apache.lucene.util.fst.FST$BytesWriter.writeBytes(FST.java:927)
at org.apache.lucene.util.fst.ByteSequenceOutputs.write(ByteSequenceOutputs.java:113)
at org.apache.lucene.util.fst.ByteSequenceOutputs.write(ByteSequenceOutputs.java:32)
at org.apache.lucene.util.fst.FST.addNode(FST.java:451)
at org.apache.lucene.util.fst.NodeHash.add(NodeHash.java:122)
at org.apache.lucene.util.fst.Builder.compileNode(Builder.java:180)
at org.apache.lucene.util.fst.Builder.finish(Builder.java:495)
at org.apache.lucene.index.codecs.memory.MemoryCodec$TermsWriter.finish(MemoryCodec.java:232)
at org.apache.lucene.index.FreqProxTermsWriterPerField.flush(FreqProxTermsWriterPerField.java:414)
at org.apache.lucene.index.FreqProxTermsWriter.flush(FreqProxTermsWriter.java:92)
at org.apache.lucene.index.TermsHash.flush(TermsHash.java:117)
at org.apache.lucene.index.DocInverter.flush(DocInverter.java:80)
at org.apache.lucene.index.DocFieldProcessor.flush(DocFieldProcessor.java:78)
at org.apache.lucene.index.DocumentsWriterPerThread.flush(DocumentsWriterPerThread.java:472)
at org.apache.lucene.index.DocumentsWriter.doFlush(DocumentsWriter.java:420)
at org.apache.lucene.index.DocumentsWriter.flushAllThreads(DocumentsWriter.java:568)
at org.apache.lucene.index.IndexWriter.getReader(IndexWriter.java:366)
at org.apache.lucene.index.IndexReader.open(IndexReader.java:317)
at org.apache.lucene.util.fst.TestFSTs.testRealTerms(TestFSTs.java:1034)
at org.apache.lucene.util.LuceneTestCase$2$1.evaluate(LuceneTestCase.java:611)
FAILED: org.apache.lucene.index.TestTermsEnum.testIntersectRandom
Error Message:
Java heap space
Stack Trace:
java.lang.OutOfMemoryError: Java heap space
at org.apache.lucene.util.automaton.RunAutomaton.<init>(RunAutomaton.java:128)
at org.apache.lucene.util.automaton.ByteRunAutomaton.<init>(ByteRunAutomaton.java:28)
at org.apache.lucene.util.automaton.CompiledAutomaton.<init>(CompiledAutomaton.java:134)
at org.apache.lucene.index.TestTermsEnum.testIntersectRandom(TestTermsEnum.java:266)
at org.apache.lucene.util.LuceneTestCase$2$1.evaluate(LuceneTestCase.java:611)
at org.apache.lucene.util.LuceneTestCaseRunner.runChild(LuceneTestCaseRunner.java:148)
at org.apache.lucene.util.LuceneTestCaseRunner.runChild(LuceneTestCaseRunner.java:50)
Build Log (for compile errors):
[...truncated 13139 lines...]
---------------------------------------------------------------------
To unsubscribe, e-mail: dev-unsubscribe@lucene.apache.org
For additional commands, e-mail: dev-help@lucene.apache.org
[JENKINS] Lucene-trunk - Build # 1685 - Still Failing
Posted by Apache Jenkins Server <je...@builds.apache.org>.
Build: https://builds.apache.org/job/Lucene-trunk/1685/
1 tests failed.
REGRESSION: org.apache.lucene.util.automaton.TestCompiledAutomaton.testRandom
Error Message:
Java heap space
Stack Trace:
java.lang.OutOfMemoryError: Java heap space
at org.apache.lucene.util.automaton.RunAutomaton.<init>(RunAutomaton.java:128)
at org.apache.lucene.util.automaton.ByteRunAutomaton.<init>(ByteRunAutomaton.java:28)
at org.apache.lucene.util.automaton.CompiledAutomaton.<init>(CompiledAutomaton.java:134)
at org.apache.lucene.util.automaton.TestCompiledAutomaton.build(TestCompiledAutomaton.java:39)
at org.apache.lucene.util.automaton.TestCompiledAutomaton.testTerms(TestCompiledAutomaton.java:55)
at org.apache.lucene.util.automaton.TestCompiledAutomaton.testRandom(TestCompiledAutomaton.java:101)
at org.apache.lucene.util.LuceneTestCase$2$1.evaluate(LuceneTestCase.java:611)
at org.apache.lucene.util.LuceneTestCaseRunner.runChild(LuceneTestCaseRunner.java:148)
at org.apache.lucene.util.LuceneTestCaseRunner.runChild(LuceneTestCaseRunner.java:50)
Build Log (for compile errors):
[...truncated 12907 lines...]
---------------------------------------------------------------------
To unsubscribe, e-mail: dev-unsubscribe@lucene.apache.org
For additional commands, e-mail: dev-help@lucene.apache.org
[JENKINS] Lucene-trunk - Build # 1684 - Still Failing
Posted by Apache Jenkins Server <je...@builds.apache.org>.
Build: https://builds.apache.org/job/Lucene-trunk/1684/
1 tests failed.
FAILED: org.apache.lucene.index.TestTermsEnum.testIntersectRandom
Error Message:
Java heap space
Stack Trace:
java.lang.OutOfMemoryError: Java heap space
at org.apache.lucene.util.automaton.RunAutomaton.<init>(RunAutomaton.java:128)
at org.apache.lucene.util.automaton.ByteRunAutomaton.<init>(ByteRunAutomaton.java:28)
at org.apache.lucene.util.automaton.CompiledAutomaton.<init>(CompiledAutomaton.java:134)
at org.apache.lucene.index.TestTermsEnum.testIntersectRandom(TestTermsEnum.java:266)
at org.apache.lucene.util.LuceneTestCase$2$1.evaluate(LuceneTestCase.java:611)
at org.apache.lucene.util.LuceneTestCaseRunner.runChild(LuceneTestCaseRunner.java:148)
at org.apache.lucene.util.LuceneTestCaseRunner.runChild(LuceneTestCaseRunner.java:50)
Build Log (for compile errors):
[...truncated 12889 lines...]
---------------------------------------------------------------------
To unsubscribe, e-mail: dev-unsubscribe@lucene.apache.org
For additional commands, e-mail: dev-help@lucene.apache.org
RE: [JENKINS] Lucene-trunk - Build # 1683 - Still Failing
Posted by Uwe Schindler <uw...@thetaphi.de>.
The Lucene-trunk nightly build fails almost every night with an OOM in different test methods, but always related to FST or automaton. Maybe we need a little bit more heap space when nightly=true/clover enabled?
-----
Uwe Schindler
H.-H.-Meier-Allee 63, D-28213 Bremen
http://www.thetaphi.de
eMail: uwe@thetaphi.de
> -----Original Message-----
> From: Apache Jenkins Server [mailto:jenkins@builds.apache.org]
> Sent: Friday, September 23, 2011 5:51 AM
> To: dev@lucene.apache.org
> Subject: [JENKINS] Lucene-trunk - Build # 1683 - Still Failing
>
> Build: https://builds.apache.org/job/Lucene-trunk/1683/
>
> 3 tests failed.
> REGRESSION: org.apache.lucene.index.TestNRTThreads.testNRTThreads
>
> Error Message:
> this writer hit an OutOfMemoryError; cannot commit
>
> Stack Trace:
> java.lang.IllegalStateException: this writer hit an OutOfMemoryError; cannot
> commit
> at
> org.apache.lucene.index.IndexWriter.prepareCommit(IndexWriter.java:2754)
> at
> org.apache.lucene.index.IndexWriter.commitInternal(IndexWriter.java:2904)
> at org.apache.lucene.index.IndexWriter.commit(IndexWriter.java:2886)
> at org.apache.lucene.index.IndexWriter.commit(IndexWriter.java:2870)
> at
> org.apache.lucene.index.TestNRTThreads.testNRTThreads(TestNRTThreads.java
> :357)
> at
> org.apache.lucene.util.LuceneTestCase$2$1.evaluate(LuceneTestCase.java:611)
> at
> org.apache.lucene.util.LuceneTestCaseRunner.runChild(LuceneTestCaseRunner.
> java:148)
> at
> org.apache.lucene.util.LuceneTestCaseRunner.runChild(LuceneTestCaseRunner.
> java:50)
>
>
> REGRESSION: org.apache.lucene.util.fst.TestFSTs.testRealTerms
>
> Error Message:
> Java heap space
>
> Stack Trace:
> java.lang.OutOfMemoryError: Java heap space
> at org.apache.lucene.util.ArrayUtil.grow(ArrayUtil.java:338)
> at org.apache.lucene.util.fst.FST$BytesWriter.writeBytes(FST.java:927)
> at
> org.apache.lucene.util.fst.ByteSequenceOutputs.write(ByteSequenceOutputs.jav
> a:113)
> at
> org.apache.lucene.util.fst.ByteSequenceOutputs.write(ByteSequenceOutputs.jav
> a:32)
> at org.apache.lucene.util.fst.FST.addNode(FST.java:451)
> at org.apache.lucene.util.fst.NodeHash.add(NodeHash.java:122)
> at org.apache.lucene.util.fst.Builder.compileNode(Builder.java:180)
> at org.apache.lucene.util.fst.Builder.finish(Builder.java:495)
> at
> org.apache.lucene.index.codecs.memory.MemoryCodec$TermsWriter.finish(M
> emoryCodec.java:232)
> at
> org.apache.lucene.index.FreqProxTermsWriterPerField.flush(FreqProxTermsWr
> iterPerField.java:414)
> at
> org.apache.lucene.index.FreqProxTermsWriter.flush(FreqProxTermsWriter.java
> :92)
> at org.apache.lucene.index.TermsHash.flush(TermsHash.java:117)
> at org.apache.lucene.index.DocInverter.flush(DocInverter.java:80)
> at
> org.apache.lucene.index.DocFieldProcessor.flush(DocFieldProcessor.java:78)
> at
> org.apache.lucene.index.DocumentsWriterPerThread.flush(DocumentsWriterPe
> rThread.java:472)
> at
> org.apache.lucene.index.DocumentsWriter.doFlush(DocumentsWriter.java:420)
> at
> org.apache.lucene.index.DocumentsWriter.flushAllThreads(DocumentsWriter.j
> ava:568)
> at
> org.apache.lucene.index.IndexWriter.getReader(IndexWriter.java:366)
> at org.apache.lucene.index.IndexReader.open(IndexReader.java:317)
> at
> org.apache.lucene.util.fst.TestFSTs.testRealTerms(TestFSTs.java:1034)
> at
> org.apache.lucene.util.LuceneTestCase$2$1.evaluate(LuceneTestCase.java:611)
>
>
> FAILED: org.apache.lucene.index.TestTermsEnum.testIntersectRandom
>
> Error Message:
> Java heap space
>
> Stack Trace:
> java.lang.OutOfMemoryError: Java heap space
> at
> org.apache.lucene.util.automaton.RunAutomaton.<init>(RunAutomaton.java:12
> 8)
> at
> org.apache.lucene.util.automaton.ByteRunAutomaton.<init>(ByteRunAutomato
> n.java:28)
> at
> org.apache.lucene.util.automaton.CompiledAutomaton.<init>(CompiledAutoma
> ton.java:134)
> at
> org.apache.lucene.index.TestTermsEnum.testIntersectRandom(TestTermsEnum
> .java:266)
> at
> org.apache.lucene.util.LuceneTestCase$2$1.evaluate(LuceneTestCase.java:611)
> at
> org.apache.lucene.util.LuceneTestCaseRunner.runChild(LuceneTestCaseRunner.
> java:148)
> at
> org.apache.lucene.util.LuceneTestCaseRunner.runChild(LuceneTestCaseRunner.
> java:50)
>
>
>
>
> Build Log (for compile errors):
> [...truncated 13139 lines...]
>
>
>
> ---------------------------------------------------------------------
> To unsubscribe, e-mail: dev-unsubscribe@lucene.apache.org For additional
> commands, e-mail: dev-help@lucene.apache.org
---------------------------------------------------------------------
To unsubscribe, e-mail: dev-unsubscribe@lucene.apache.org
For additional commands, e-mail: dev-help@lucene.apache.org