You are viewing a plain text version of this content. The canonical link for it is here.
Posted to builds@beam.apache.org by Apache Jenkins Server <je...@builds.apache.org> on 2020/03/06 18:45:28 UTC
Build failed in Jenkins: beam_PostCommit_Py_VR_Dataflow #5953
See <https://builds.apache.org/job/beam_PostCommit_Py_VR_Dataflow/5953/display/redirect?page=changes>
Changes:
[suztomo] Google-cloud-bigquery 1.108.0
------------------------------------------
[...truncated 20.40 MB...]
INFO:apache_beam.runners.dataflow.dataflow_runner:2020-03-06T18:42:33.183Z: JOB_MESSAGE_DEBUG: Starting worker pool teardown.
INFO:apache_beam.runners.dataflow.dataflow_runner:2020-03-06T18:42:33.187Z: JOB_MESSAGE_BASIC: Stopping worker pool...
INFO:apache_beam.runners.dataflow.dataflow_runner:2020-03-06T18:43:21.289Z: JOB_MESSAGE_DETAILED: Checking permissions granted to controller Service Account.
> Task :sdks:python:test-suites:dataflow:py37:validatesRunnerStreamingTests
INFO:apache_beam.runners.dataflow.dataflow_runner:2020-03-06T18:43:35.529Z: JOB_MESSAGE_BASIC: Finished operation Create/Impulse+Create/FlatMap(<lambda at core.py:2643>)+Create/MaybeReshuffle/Reshuffle/AddRandomKeys+Create/MaybeReshuffle/Reshuffle/ReshufflePerKey/Map(reify_timestamps)+Create/MaybeReshuffle/Reshuffle/ReshufflePerKey/GroupByKey/WriteStream
INFO:apache_beam.runners.dataflow.dataflow_runner:2020-03-06T18:43:35.529Z: JOB_MESSAGE_BASIC: Finished operation Create/MaybeReshuffle/Reshuffle/ReshufflePerKey/GroupByKey/ReadStream+Create/MaybeReshuffle/Reshuffle/ReshufflePerKey/GroupByKey/MergeBuckets+Create/MaybeReshuffle/Reshuffle/ReshufflePerKey/FlatMap(restore_timestamps)+Create/MaybeReshuffle/Reshuffle/RemoveRandomKeys+Create/Map(decode)+Key param+assert_that/WindowInto(WindowIntoFn)+assert_that/ToVoidKey+assert_that/Group/pair_with_1+assert_that/Group/GroupByKey/WriteStream
INFO:apache_beam.runners.dataflow.dataflow_runner:2020-03-06T18:43:35.529Z: JOB_MESSAGE_BASIC: Finished operation assert_that/Create/Impulse+assert_that/Create/FlatMap(<lambda at core.py:2643>)+assert_that/Create/Map(decode)+assert_that/Group/pair_with_0+assert_that/Group/GroupByKey/WriteStream
INFO:apache_beam.runners.dataflow.dataflow_runner:2020-03-06T18:43:35.529Z: JOB_MESSAGE_BASIC: Finished operation assert_that/Group/GroupByKey/ReadStream+assert_that/Group/GroupByKey/MergeBuckets+assert_that/Group/Map(_merge_tagged_vals_under_key)+assert_that/Unkey+assert_that/Match
INFO:apache_beam.runners.dataflow.dataflow_runner:2020-03-06T18:43:35.671Z: JOB_MESSAGE_DETAILED: Cleaning up.
INFO:apache_beam.runners.dataflow.dataflow_runner:2020-03-06T18:43:35.701Z: JOB_MESSAGE_BASIC: Worker pool stopped.
INFO:apache_beam.runners.dataflow.dataflow_runner:2020-03-06T18:43:35.707Z: JOB_MESSAGE_DEBUG: Tearing down pending resources...
INFO:apache_beam.runners.dataflow.dataflow_runner:2020-03-06T18:43:35.711Z: JOB_MESSAGE_DEBUG: Starting worker pool teardown.
INFO:apache_beam.runners.dataflow.dataflow_runner:2020-03-06T18:43:35.728Z: JOB_MESSAGE_BASIC: Stopping worker pool...
INFO:apache_beam.runners.dataflow.dataflow_runner:2020-03-06T18:43:45.901Z: JOB_MESSAGE_DETAILED: Checking permissions granted to controller Service Account.
> Task :sdks:python:test-suites:dataflow:py35:validatesRunnerStreamingTests
INFO:apache_beam.runners.dataflow.dataflow_runner:2020-03-06T18:43:41.584Z: JOB_MESSAGE_BASIC: Worker pool stopped.
INFO:apache_beam.runners.dataflow.dataflow_runner:Job 2020-03-06_10_36_19-3073529540933380930 is in state JOB_STATE_DONE
Worker logs: https://console.cloud.google.com/dataflow/jobs/us-central1/2020-03-06_10_12_05-12211637769126108720?project=apache-beam-testing
Worker logs: https://console.cloud.google.com/dataflow/jobs/us-central1/2020-03-06_10_21_00-14778655110796310300?project=apache-beam-testing
Worker logs: https://console.cloud.google.com/dataflow/jobs/us-central1/2020-03-06_10_28_48-1640796030267733158?project=apache-beam-testing
Worker logs: https://console.cloud.google.com/dataflow/jobs/us-central1/2020-03-06_10_36_19-3073529540933380930?project=apache-beam-testing
Worker logs: https://console.cloud.google.com/dataflow/jobs/us-central1/2020-03-06_10_12_06-14535744931049285588?project=apache-beam-testing
Worker logs: https://console.cloud.google.com/dataflow/jobs/us-central1/2020-03-06_10_19_45-17490991996158740681?project=apache-beam-testing
Worker logs: https://console.cloud.google.com/dataflow/jobs/us-central1/2020-03-06_10_28_08-550756113467931810?project=apache-beam-testing
Worker logs: https://console.cloud.google.com/dataflow/jobs/us-central1/2020-03-06_10_12_11-2451182699939477902?project=apache-beam-testing
Worker logs: https://console.cloud.google.com/dataflow/jobs/us-central1/2020-03-06_10_21_03-13360817610146671070?project=apache-beam-testing
Worker logs: https://console.cloud.google.com/dataflow/jobs/us-central1/2020-03-06_10_28_49-9959078894677374060?project=apache-beam-testing
Worker logs: https://console.cloud.google.com/dataflow/jobs/us-central1/2020-03-06_10_12_09-1185465500867842691?project=apache-beam-testing
Worker logs: https://console.cloud.google.com/dataflow/jobs/us-central1/2020-03-06_10_20_22-14521123876514097832?project=apache-beam-testing
Worker logs: https://console.cloud.google.com/dataflow/jobs/us-central1/2020-03-06_10_28_36-1489021387354971542?project=apache-beam-testing
Worker logs: https://console.cloud.google.com/dataflow/jobs/us-central1/2020-03-06_10_12_05-6348948899164866869?project=apache-beam-testing
Worker logs: https://console.cloud.google.com/dataflow/jobs/us-central1/2020-03-06_10_19_56-7990699051995782246?project=apache-beam-testing
Worker logs: https://console.cloud.google.com/dataflow/jobs/us-central1/2020-03-06_10_28_17-8785578423619454798?project=apache-beam-testing
Worker logs: https://console.cloud.google.com/dataflow/jobs/us-central1/2020-03-06_10_12_11-4974745051570945336?project=apache-beam-testing
Worker logs: https://console.cloud.google.com/dataflow/jobs/us-central1/2020-03-06_10_20_17-5240234899167009069?project=apache-beam-testing
Worker logs: https://console.cloud.google.com/dataflow/jobs/us-central1/2020-03-06_10_28_41-1507627275318400539?project=apache-beam-testing
Worker logs: https://console.cloud.google.com/dataflow/jobs/us-central1/2020-03-06_10_12_12-11747163445607970507?project=apache-beam-testing
Worker logs: https://console.cloud.google.com/dataflow/jobs/us-central1/2020-03-06_10_20_52-2707151142784141215?project=apache-beam-testing
Worker logs: https://console.cloud.google.com/dataflow/jobs/us-central1/2020-03-06_10_12_06-8670248369463996058?project=apache-beam-testing
Worker logs: https://console.cloud.google.com/dataflow/jobs/us-central1/2020-03-06_10_20_02-11967608382912742361?project=apache-beam-testing
Worker logs: https://console.cloud.google.com/dataflow/jobs/us-central1/2020-03-06_10_28_02-16408579082340172024?project=apache-beam-testing
test_gbk_many_values (apache_beam.runners.portability.fn_api_runner_test.FnApiBasedStateBackedCoderTest) ... ok
Test TimestampCombiner with EARLIEST. ... ok
Test TimestampCombiner with LATEST. ... ok
Runs streaming Dataflow job and verifies that user metrics are reported ... ok
test_dofn_lifecycle (apache_beam.transforms.dofn_lifecycle_test.DoFnLifecycleTest) ... ok
test_flatten_one_single_pcollection (apache_beam.transforms.ptransform_test.PTransformTest) ... ok
test_impulse (apache_beam.transforms.ptransform_test.PTransformTest) ... ok
test_flatten_a_flattened_pcollection (apache_beam.transforms.ptransform_test.PTransformTest) ... ok
test_flatten_multiple_pcollections_having_multiple_consumers (apache_beam.transforms.ptransform_test.PTransformTest) ... ok
test_user_counter_using_pardo (apache_beam.metrics.metric_test.MetricsTest) ... ok
test_flatten_pcollections (apache_beam.transforms.ptransform_test.PTransformTest) ... ok
test_par_do_with_multiple_outputs_and_using_yield (apache_beam.transforms.ptransform_test.PTransformTest) ... ok
test_multiple_empty_outputs (apache_beam.transforms.ptransform_test.PTransformTest) ... ok
test_par_do_with_multiple_outputs_and_using_return (apache_beam.transforms.ptransform_test.PTransformTest) ... ok
test_undeclared_outputs (apache_beam.transforms.ptransform_test.PTransformTest) ... ok
test_as_dict_twice (apache_beam.transforms.sideinputs_test.SideInputsTest) ... ok
test_as_singleton_with_different_defaults (apache_beam.transforms.sideinputs_test.SideInputsTest) ... ok
Test a GBK sideinput, with multiple triggering. ... ok
test_as_list_twice (apache_beam.transforms.sideinputs_test.SideInputsTest) ... ok
test_as_list_and_as_dict_side_inputs (apache_beam.transforms.sideinputs_test.SideInputsTest) ... ok
test_as_singleton_without_unique_labels (apache_beam.transforms.sideinputs_test.SideInputsTest) ... ok
test_default_value_singleton_side_input (apache_beam.transforms.sideinputs_test.SideInputsTest) ... ok
test_iterable_side_input (apache_beam.transforms.sideinputs_test.SideInputsTest) ... ok
test_flattened_side_input (apache_beam.transforms.sideinputs_test.SideInputsTest) ... ok
test_reshuffle_preserves_timestamps (apache_beam.transforms.util_test.ReshuffleTest) ... ok
test_empty_singleton_side_input (apache_beam.transforms.sideinputs_test.SideInputsTest) ... ok
test_element_param (apache_beam.pipeline_test.DoFnTest) ... ok
test_key_param (apache_beam.pipeline_test.DoFnTest) ... ok
----------------------------------------------------------------------
XML: nosetests-validatesRunnerStreamingTests-df-py35.xml
----------------------------------------------------------------------
XML: <https://builds.apache.org/job/beam_PostCommit_Py_VR_Dataflow/ws/src/sdks/python/nosetests.xml>
----------------------------------------------------------------------
Ran 28 tests in 1962.143s
OK
> Task :sdks:python:test-suites:dataflow:py36:validatesRunnerStreamingTests
INFO:apache_beam.runners.dataflow.dataflow_runner:2020-03-06T18:44:04.495Z: JOB_MESSAGE_BASIC: Finished operation assert_that/Group/GroupByKey/ReadStream+assert_that/Group/GroupByKey/MergeBuckets+assert_that/Group/Map(_merge_tagged_vals_under_key)+assert_that/Unkey+assert_that/Match
INFO:apache_beam.runners.dataflow.dataflow_runner:2020-03-06T18:44:04.495Z: JOB_MESSAGE_BASIC: Finished operation assert_that/Create/Impulse+assert_that/Create/FlatMap(<lambda at core.py:2643>)+assert_that/Create/Map(decode)+assert_that/Group/pair_with_0+assert_that/Group/GroupByKey/WriteStream
INFO:apache_beam.runners.dataflow.dataflow_runner:2020-03-06T18:44:04.495Z: JOB_MESSAGE_BASIC: Finished operation Create/Impulse+Create/FlatMap(<lambda at core.py:2643>)+Create/MaybeReshuffle/Reshuffle/AddRandomKeys+Create/MaybeReshuffle/Reshuffle/ReshufflePerKey/Map(reify_timestamps)+Create/MaybeReshuffle/Reshuffle/ReshufflePerKey/GroupByKey/WriteStream
INFO:apache_beam.runners.dataflow.dataflow_runner:2020-03-06T18:44:04.495Z: JOB_MESSAGE_BASIC: Finished operation Create/MaybeReshuffle/Reshuffle/ReshufflePerKey/GroupByKey/ReadStream+Create/MaybeReshuffle/Reshuffle/ReshufflePerKey/GroupByKey/MergeBuckets+Create/MaybeReshuffle/Reshuffle/ReshufflePerKey/FlatMap(restore_timestamps)+Create/MaybeReshuffle/Reshuffle/RemoveRandomKeys+Create/Map(decode)+Key param+assert_that/WindowInto(WindowIntoFn)+assert_that/ToVoidKey+assert_that/Group/pair_with_1+assert_that/Group/GroupByKey/WriteStream
INFO:apache_beam.runners.dataflow.dataflow_runner:2020-03-06T18:44:04.685Z: JOB_MESSAGE_DETAILED: Cleaning up.
INFO:apache_beam.runners.dataflow.dataflow_runner:2020-03-06T18:44:04.705Z: JOB_MESSAGE_BASIC: Worker pool stopped.
INFO:apache_beam.runners.dataflow.dataflow_runner:2020-03-06T18:44:04.709Z: JOB_MESSAGE_DEBUG: Tearing down pending resources...
INFO:apache_beam.runners.dataflow.dataflow_runner:2020-03-06T18:44:04.711Z: JOB_MESSAGE_DEBUG: Starting worker pool teardown.
INFO:apache_beam.runners.dataflow.dataflow_runner:2020-03-06T18:44:04.715Z: JOB_MESSAGE_BASIC: Stopping worker pool...
INFO:apache_beam.runners.dataflow.dataflow_runner:2020-03-06T18:44:27.549Z: JOB_MESSAGE_DETAILED: Checking permissions granted to controller Service Account.
> Task :sdks:python:test-suites:dataflow:py37:validatesRunnerStreamingTests
INFO:apache_beam.runners.dataflow.dataflow_runner:2020-03-06T18:44:51.486Z: JOB_MESSAGE_BASIC: Worker pool stopped.
INFO:apache_beam.runners.dataflow.dataflow_runner:Job 2020-03-06_10_37_11-677189788914939798 is in state JOB_STATE_DONE
Worker logs: https://console.cloud.google.com/dataflow/jobs/us-central1/2020-03-06_10_12_31-11304681708653213903?project=apache-beam-testing
Worker logs: https://console.cloud.google.com/dataflow/jobs/us-central1/2020-03-06_10_21_05-2909507932445672125?project=apache-beam-testing
Worker logs: https://console.cloud.google.com/dataflow/jobs/us-central1/2020-03-06_10_29_01-15742324982024131609?project=apache-beam-testing
Worker logs: https://console.cloud.google.com/dataflow/jobs/us-central1/2020-03-06_10_12_31-2791666514813090933?project=apache-beam-testing
Worker logs: https://console.cloud.google.com/dataflow/jobs/us-central1/2020-03-06_10_20_37-2886302298075075163?project=apache-beam-testing
Worker logs: https://console.cloud.google.com/dataflow/jobs/us-central1/2020-03-06_10_28_48-8623493499219688671?project=apache-beam-testing
Worker logs: https://console.cloud.google.com/dataflow/jobs/us-central1/2020-03-06_10_12_32-10848991531610877853?project=apache-beam-testing
Worker logs: https://console.cloud.google.com/dataflow/jobs/us-central1/2020-03-06_10_21_05-14906787936966486686?project=apache-beam-testing
Worker logs: https://console.cloud.google.com/dataflow/jobs/us-central1/2020-03-06_10_28_54-2181663303626475970?project=apache-beam-testing
Worker logs: https://console.cloud.google.com/dataflow/jobs/us-central1/2020-03-06_10_12_30-14548318026229497224?project=apache-beam-testing
Worker logs: https://console.cloud.google.com/dataflow/jobs/us-central1/2020-03-06_10_20_57-10013593740636210237?project=apache-beam-testing
Worker logs: https://console.cloud.google.com/dataflow/jobs/us-central1/2020-03-06_10_28_38-17621929609628852505?project=apache-beam-testing
Worker logs: https://console.cloud.google.com/dataflow/jobs/us-central1/2020-03-06_10_12_27-3487530656954561116?project=apache-beam-testing
Worker logs: https://console.cloud.google.com/dataflow/jobs/us-central1/2020-03-06_10_21_01-3180931452222362302?project=apache-beam-testing
Worker logs: https://console.cloud.google.com/dataflow/jobs/us-central1/2020-03-06_10_29_04-484684799454646818?project=apache-beam-testing
Worker logs: https://console.cloud.google.com/dataflow/jobs/us-central1/2020-03-06_10_37_11-677189788914939798?project=apache-beam-testing
Worker logs: https://console.cloud.google.com/dataflow/jobs/us-central1/2020-03-06_10_12_37-18209523347988732190?project=apache-beam-testing
Worker logs: https://console.cloud.google.com/dataflow/jobs/us-central1/2020-03-06_10_20_59-10932180524114588072?project=apache-beam-testing
Worker logs: https://console.cloud.google.com/dataflow/jobs/us-central1/2020-03-06_10_12_33-13089746237824534755?project=apache-beam-testing
Worker logs: https://console.cloud.google.com/dataflow/jobs/us-central1/2020-03-06_10_21_00-12299566520389749768?project=apache-beam-testing
Worker logs: https://console.cloud.google.com/dataflow/jobs/us-central1/2020-03-06_10_28_55-3691678032423436687?project=apache-beam-testing
Worker logs: https://console.cloud.google.com/dataflow/jobs/us-central1/2020-03-06_10_12_31-15224475903912223652?project=apache-beam-testing
Worker logs: https://console.cloud.google.com/dataflow/jobs/us-central1/2020-03-06_10_20_39-2543181147254206936?project=apache-beam-testing
Worker logs: https://console.cloud.google.com/dataflow/jobs/us-central1/2020-03-06_10_28_56-10389092624140950414?project=apache-beam-testing
test_gbk_many_values (apache_beam.runners.portability.fn_api_runner_test.FnApiBasedStateBackedCoderTest) ... ok
Test TimestampCombiner with EARLIEST. ... ok
Test TimestampCombiner with LATEST. ... ok
Runs streaming Dataflow job and verifies that user metrics are reported ... ok
test_flatten_one_single_pcollection (apache_beam.transforms.ptransform_test.PTransformTest) ... ok
test_flatten_multiple_pcollections_having_multiple_consumers (apache_beam.transforms.ptransform_test.PTransformTest) ... ok
test_impulse (apache_beam.transforms.ptransform_test.PTransformTest) ... ok
test_flatten_a_flattened_pcollection (apache_beam.transforms.ptransform_test.PTransformTest) ... ok
test_user_counter_using_pardo (apache_beam.metrics.metric_test.MetricsTest) ... ok
test_dofn_lifecycle (apache_beam.transforms.dofn_lifecycle_test.DoFnLifecycleTest) ... ok
test_flatten_pcollections (apache_beam.transforms.ptransform_test.PTransformTest) ... ok
test_undeclared_outputs (apache_beam.transforms.ptransform_test.PTransformTest) ... ok
test_multiple_empty_outputs (apache_beam.transforms.ptransform_test.PTransformTest) ... ok
test_par_do_with_multiple_outputs_and_using_return (apache_beam.transforms.ptransform_test.PTransformTest) ... ok
test_as_singleton_with_different_defaults (apache_beam.transforms.sideinputs_test.SideInputsTest) ... ok
test_as_dict_twice (apache_beam.transforms.sideinputs_test.SideInputsTest) ... ok
test_as_list_and_as_dict_side_inputs (apache_beam.transforms.sideinputs_test.SideInputsTest) ... ok
Test a GBK sideinput, with multiple triggering. ... ok
test_as_list_twice (apache_beam.transforms.sideinputs_test.SideInputsTest) ... ok
test_par_do_with_multiple_outputs_and_using_yield (apache_beam.transforms.ptransform_test.PTransformTest) ... ok
test_iterable_side_input (apache_beam.transforms.sideinputs_test.SideInputsTest) ... ok
test_flattened_side_input (apache_beam.transforms.sideinputs_test.SideInputsTest) ... ok
test_reshuffle_preserves_timestamps (apache_beam.transforms.util_test.ReshuffleTest) ... ok
test_as_singleton_without_unique_labels (apache_beam.transforms.sideinputs_test.SideInputsTest) ... ok
test_empty_singleton_side_input (apache_beam.transforms.sideinputs_test.SideInputsTest) ... ok
test_default_value_singleton_side_input (apache_beam.transforms.sideinputs_test.SideInputsTest) ... ok
test_element_param (apache_beam.pipeline_test.DoFnTest) ... ok
test_key_param (apache_beam.pipeline_test.DoFnTest) ... ok
----------------------------------------------------------------------
XML: nosetests-validatesRunnerStreamingTests-df-py37.xml
----------------------------------------------------------------------
XML: <https://builds.apache.org/job/beam_PostCommit_Py_VR_Dataflow/ws/src/sdks/python/nosetests.xml>
----------------------------------------------------------------------
Ran 28 tests in 2003.183s
OK
> Task :sdks:python:test-suites:dataflow:py36:validatesRunnerStreamingTests
INFO:apache_beam.runners.dataflow.dataflow_runner:2020-03-06T18:45:09.791Z: JOB_MESSAGE_BASIC: Worker pool stopped.
INFO:apache_beam.runners.dataflow.dataflow_runner:Job 2020-03-06_10_37_51-16399932836956824955 is in state JOB_STATE_DONE
Worker logs: https://console.cloud.google.com/dataflow/jobs/us-central1/2020-03-06_10_13_13-6353196334277644332?project=apache-beam-testing
Worker logs: https://console.cloud.google.com/dataflow/jobs/us-central1/2020-03-06_10_21_33-15704988359757207677?project=apache-beam-testing
Worker logs: https://console.cloud.google.com/dataflow/jobs/us-central1/2020-03-06_10_29_22-9387276595811666841?project=apache-beam-testing
Worker logs: https://console.cloud.google.com/dataflow/jobs/us-central1/2020-03-06_10_13_17-17629355653071361413?project=apache-beam-testing
Worker logs: https://console.cloud.google.com/dataflow/jobs/us-central1/2020-03-06_10_21_31-10199872680319524942?project=apache-beam-testing
Worker logs: https://console.cloud.google.com/dataflow/jobs/us-central1/2020-03-06_10_29_44-6745168045563350880?project=apache-beam-testing
Worker logs: https://console.cloud.google.com/dataflow/jobs/us-central1/2020-03-06_10_37_51-16399932836956824955?project=apache-beam-testing
Worker logs: https://console.cloud.google.com/dataflow/jobs/us-central1/2020-03-06_10_13_14-1316777068645245050?project=apache-beam-testing
Worker logs: https://console.cloud.google.com/dataflow/jobs/us-central1/2020-03-06_10_21_44-17235552276628066528?project=apache-beam-testing
Worker logs: https://console.cloud.google.com/dataflow/jobs/us-central1/2020-03-06_10_29_43-3410911679411919817?project=apache-beam-testing
Worker logs: https://console.cloud.google.com/dataflow/jobs/us-central1/2020-03-06_10_13_20-17818071660976684774?project=apache-beam-testing
Worker logs: https://console.cloud.google.com/dataflow/jobs/us-central1/2020-03-06_10_21_08-6239855792835632182?project=apache-beam-testing
Worker logs: https://console.cloud.google.com/dataflow/jobs/us-central1/2020-03-06_10_29_32-13096364665013213662?project=apache-beam-testing
Worker logs: https://console.cloud.google.com/dataflow/jobs/us-central1/2020-03-06_10_13_14-1994205262763142267?project=apache-beam-testing
Worker logs: https://console.cloud.google.com/dataflow/jobs/us-central1/2020-03-06_10_21_26-15447517633976126406?project=apache-beam-testing
Worker logs: https://console.cloud.google.com/dataflow/jobs/us-central1/2020-03-06_10_29_36-5901457174563286159?project=apache-beam-testing
Worker logs: https://console.cloud.google.com/dataflow/jobs/us-central1/2020-03-06_10_13_19-6129081548301508824?project=apache-beam-testing
Worker logs: https://console.cloud.google.com/dataflow/jobs/us-central1/2020-03-06_10_21_16-2418738394457881693?project=apache-beam-testing
Worker logs: https://console.cloud.google.com/dataflow/jobs/us-central1/2020-03-06_10_29_03-7120537137873901703?project=apache-beam-testing
Worker logs: https://console.cloud.google.com/dataflow/jobs/us-central1/2020-03-06_10_13_17-17942462820085768915?project=apache-beam-testing
Worker logs: https://console.cloud.google.com/dataflow/jobs/us-central1/2020-03-06_10_21_45-5428256307755357416?project=apache-beam-testing
Worker logs: https://console.cloud.google.com/dataflow/jobs/us-central1/2020-03-06_10_13_20-401878402234430839?project=apache-beam-testing
Worker logs: https://console.cloud.google.com/dataflow/jobs/us-central1/2020-03-06_10_21_41-4331693137032199148?project=apache-beam-testing
Worker logs: https://console.cloud.google.com/dataflow/jobs/us-central1/2020-03-06_10_29_23-13254717576890394799?project=apache-beam-testing
test_gbk_many_values (apache_beam.runners.portability.fn_api_runner_test.FnApiBasedStateBackedCoderTest) ... ok
Test TimestampCombiner with EARLIEST. ... ok
Test TimestampCombiner with LATEST. ... ok
test_flatten_pcollections (apache_beam.transforms.ptransform_test.PTransformTest) ... ok
test_flatten_a_flattened_pcollection (apache_beam.transforms.ptransform_test.PTransformTest) ... ok
test_dofn_lifecycle (apache_beam.transforms.dofn_lifecycle_test.DoFnLifecycleTest) ... ok
Runs streaming Dataflow job and verifies that user metrics are reported ... ok
test_user_counter_using_pardo (apache_beam.metrics.metric_test.MetricsTest) ... ok
test_flatten_multiple_pcollections_having_multiple_consumers (apache_beam.transforms.ptransform_test.PTransformTest) ... ok
test_flatten_one_single_pcollection (apache_beam.transforms.ptransform_test.PTransformTest) ... ok
test_impulse (apache_beam.transforms.ptransform_test.PTransformTest) ... ok
test_par_do_with_multiple_outputs_and_using_return (apache_beam.transforms.ptransform_test.PTransformTest) ... ok
test_as_dict_twice (apache_beam.transforms.sideinputs_test.SideInputsTest) ... ok
test_as_list_and_as_dict_side_inputs (apache_beam.transforms.sideinputs_test.SideInputsTest) ... ok
test_multiple_empty_outputs (apache_beam.transforms.ptransform_test.PTransformTest) ... ok
test_par_do_with_multiple_outputs_and_using_yield (apache_beam.transforms.ptransform_test.PTransformTest) ... ok
test_as_singleton_with_different_defaults (apache_beam.transforms.sideinputs_test.SideInputsTest) ... ok
Test a GBK sideinput, with multiple triggering. ... ok
test_undeclared_outputs (apache_beam.transforms.ptransform_test.PTransformTest) ... ok
test_as_list_twice (apache_beam.transforms.sideinputs_test.SideInputsTest) ... ok
test_empty_singleton_side_input (apache_beam.transforms.sideinputs_test.SideInputsTest) ... ok
test_reshuffle_preserves_timestamps (apache_beam.transforms.util_test.ReshuffleTest) ... ok
test_iterable_side_input (apache_beam.transforms.sideinputs_test.SideInputsTest) ... ok
test_flattened_side_input (apache_beam.transforms.sideinputs_test.SideInputsTest) ... ok
test_default_value_singleton_side_input (apache_beam.transforms.sideinputs_test.SideInputsTest) ... ok
test_as_singleton_without_unique_labels (apache_beam.transforms.sideinputs_test.SideInputsTest) ... ok
test_element_param (apache_beam.pipeline_test.DoFnTest) ... ok
test_key_param (apache_beam.pipeline_test.DoFnTest) ... ok
----------------------------------------------------------------------
XML: nosetests-validatesRunnerStreamingTests-df-py36.xml
----------------------------------------------------------------------
XML: <https://builds.apache.org/job/beam_PostCommit_Py_VR_Dataflow/ws/src/sdks/python/nosetests.xml>
----------------------------------------------------------------------
Ran 28 tests in 1980.870s
OK
FAILURE: Build failed with an exception.
* Where:
Build file '<https://builds.apache.org/job/beam_PostCommit_Py_VR_Dataflow/ws/src/sdks/python/test-suites/dataflow/py35/build.gradle'> line: 84
* What went wrong:
Execution failed for task ':sdks:python:test-suites:dataflow:py35:validatesRunnerBatchTests'.
> Process 'command 'sh'' finished with non-zero exit value 1
* Try:
Run with --stacktrace option to get the stack trace. Run with --info or --debug option to get more log output. Run with --scan to get full insights.
* Get more help at https://help.gradle.org
Deprecated Gradle features were used in this build, making it incompatible with Gradle 6.0.
Use '--warning-mode all' to show the individual deprecation warnings.
See https://docs.gradle.org/5.2.1/userguide/command_line_interface.html#sec:command_line_warnings
BUILD FAILED in 1h 17m 57s
76 actionable tasks: 71 executed, 5 from cache
Publishing build scan...
https://gradle.com/s/znxqupn2x6sde
Build step 'Invoke Gradle script' changed build result to FAILURE
Build step 'Invoke Gradle script' marked build as failure
---------------------------------------------------------------------
To unsubscribe, e-mail: builds-unsubscribe@beam.apache.org
For additional commands, e-mail: builds-help@beam.apache.org
Jenkins build is back to normal : beam_PostCommit_Py_VR_Dataflow
#5954
Posted by Apache Jenkins Server <je...@builds.apache.org>.
See <https://builds.apache.org/job/beam_PostCommit_Py_VR_Dataflow/5954/display/redirect>
---------------------------------------------------------------------
To unsubscribe, e-mail: builds-unsubscribe@beam.apache.org
For additional commands, e-mail: builds-help@beam.apache.org