You are viewing a plain text version of this content. The canonical link for it is here.
Posted to builds@lucene.apache.org by Apache Jenkins Server <je...@builds.apache.org> on 2021/02/08 15:55:50 UTC

[JENKINS] Lucene » Lucene-Solr-BadApples-Tests-8.x - Build # 184 - Still Unstable!

Build: https://ci-builds.apache.org/job/Lucene/job/Lucene-Solr-BadApples-Tests-8.x/184/

1 tests failed.
FAILED:  org.apache.solr.metrics.reporters.solr.SolrCloudReportersTest.testExplicitConfiguration

Error Message:
Timeout occurred while waiting response from server at: http://127.0.0.1:37357/solr

Stack Trace:
org.apache.solr.client.solrj.SolrServerException: Timeout occurred while waiting response from server at: http://127.0.0.1:37357/solr
	at __randomizedtesting.SeedInfo.seed([7A605020B013D9FA:3EAC70DBDE290F90]:0)
	at org.apache.solr.client.solrj.impl.HttpSolrClient.executeMethod(HttpSolrClient.java:692)
	at org.apache.solr.client.solrj.impl.HttpSolrClient.request(HttpSolrClient.java:266)
	at org.apache.solr.client.solrj.impl.HttpSolrClient.request(HttpSolrClient.java:248)
	at org.apache.solr.client.solrj.impl.LBSolrClient.doRequest(LBSolrClient.java:369)
	at org.apache.solr.client.solrj.impl.LBSolrClient.request(LBSolrClient.java:297)
	at org.apache.solr.client.solrj.impl.BaseCloudSolrClient.sendRequest(BaseCloudSolrClient.java:1171)
	at org.apache.solr.client.solrj.impl.BaseCloudSolrClient.requestWithRetryOnStaleState(BaseCloudSolrClient.java:934)
	at org.apache.solr.client.solrj.impl.BaseCloudSolrClient.request(BaseCloudSolrClient.java:866)
	at org.apache.solr.client.solrj.SolrRequest.process(SolrRequest.java:214)
	at org.apache.solr.client.solrj.SolrRequest.process(SolrRequest.java:231)
	at org.apache.solr.metrics.reporters.solr.SolrCloudReportersTest.testExplicitConfiguration(SolrCloudReportersTest.java:73)
	at sun.reflect.NativeMethodAccessorImpl.invoke0(Native Method)
	at sun.reflect.NativeMethodAccessorImpl.invoke(NativeMethodAccessorImpl.java:62)
	at sun.reflect.DelegatingMethodAccessorImpl.invoke(DelegatingMethodAccessorImpl.java:43)
	at java.lang.reflect.Method.invoke(Method.java:498)
	at com.carrotsearch.randomizedtesting.RandomizedRunner.invoke(RandomizedRunner.java:1750)
	at com.carrotsearch.randomizedtesting.RandomizedRunner$8.evaluate(RandomizedRunner.java:938)
	at com.carrotsearch.randomizedtesting.RandomizedRunner$9.evaluate(RandomizedRunner.java:974)
	at com.carrotsearch.randomizedtesting.RandomizedRunner$10.evaluate(RandomizedRunner.java:988)
	at com.carrotsearch.randomizedtesting.rules.SystemPropertiesRestoreRule$1.evaluate(SystemPropertiesRestoreRule.java:57)
	at org.junit.rules.RunRules.evaluate(RunRules.java:20)
	at org.apache.lucene.util.TestRuleSetupTeardownChained$1.evaluate(TestRuleSetupTeardownChained.java:49)
	at org.apache.lucene.util.AbstractBeforeAfterRule$1.evaluate(AbstractBeforeAfterRule.java:45)
	at org.apache.lucene.util.TestRuleThreadAndTestName$1.evaluate(TestRuleThreadAndTestName.java:48)
	at org.apache.lucene.util.TestRuleIgnoreAfterMaxFailures$1.evaluate(TestRuleIgnoreAfterMaxFailures.java:64)
	at org.apache.lucene.util.TestRuleMarkFailure$1.evaluate(TestRuleMarkFailure.java:47)
	at org.junit.rules.RunRules.evaluate(RunRules.java:20)
	at com.carrotsearch.randomizedtesting.rules.StatementAdapter.evaluate(StatementAdapter.java:36)
	at com.carrotsearch.randomizedtesting.ThreadLeakControl$StatementRunner.run(ThreadLeakControl.java:368)
	at com.carrotsearch.randomizedtesting.ThreadLeakControl.forkTimeoutingTask(ThreadLeakControl.java:817)
	at com.carrotsearch.randomizedtesting.ThreadLeakControl$3.evaluate(ThreadLeakControl.java:468)
	at com.carrotsearch.randomizedtesting.RandomizedRunner.runSingleTest(RandomizedRunner.java:947)
	at com.carrotsearch.randomizedtesting.RandomizedRunner$5.evaluate(RandomizedRunner.java:832)
	at com.carrotsearch.randomizedtesting.RandomizedRunner$6.evaluate(RandomizedRunner.java:883)
	at com.carrotsearch.randomizedtesting.RandomizedRunner$7.evaluate(RandomizedRunner.java:894)
	at com.carrotsearch.randomizedtesting.rules.StatementAdapter.evaluate(StatementAdapter.java:36)
	at com.carrotsearch.randomizedtesting.rules.SystemPropertiesRestoreRule$1.evaluate(SystemPropertiesRestoreRule.java:57)
	at org.junit.rules.RunRules.evaluate(RunRules.java:20)
	at org.apache.lucene.util.AbstractBeforeAfterRule$1.evaluate(AbstractBeforeAfterRule.java:45)
	at com.carrotsearch.randomizedtesting.rules.StatementAdapter.evaluate(StatementAdapter.java:36)
	at org.apache.lucene.util.TestRuleStoreClassName$1.evaluate(TestRuleStoreClassName.java:41)
	at com.carrotsearch.randomizedtesting.rules.NoShadowingOrOverridesOnMethodsRule$1.evaluate(NoShadowingOrOverridesOnMethodsRule.java:40)
	at com.carrotsearch.randomizedtesting.rules.NoShadowingOrOverridesOnMethodsRule$1.evaluate(NoShadowingOrOverridesOnMethodsRule.java:40)
	at com.carrotsearch.randomizedtesting.rules.StatementAdapter.evaluate(StatementAdapter.java:36)
	at com.carrotsearch.randomizedtesting.rules.StatementAdapter.evaluate(StatementAdapter.java:36)
	at com.carrotsearch.randomizedtesting.rules.StatementAdapter.evaluate(StatementAdapter.java:36)
	at org.apache.lucene.util.TestRuleAssertionsRequired$1.evaluate(TestRuleAssertionsRequired.java:53)
	at org.apache.lucene.util.TestRuleMarkFailure$1.evaluate(TestRuleMarkFailure.java:47)
	at org.apache.lucene.util.TestRuleIgnoreAfterMaxFailures$1.evaluate(TestRuleIgnoreAfterMaxFailures.java:64)
	at org.apache.lucene.util.TestRuleIgnoreTestSuites$1.evaluate(TestRuleIgnoreTestSuites.java:54)
	at org.junit.rules.RunRules.evaluate(RunRules.java:20)
	at com.carrotsearch.randomizedtesting.rules.StatementAdapter.evaluate(StatementAdapter.java:36)
	at com.carrotsearch.randomizedtesting.ThreadLeakControl$StatementRunner.run(ThreadLeakControl.java:368)
	at java.lang.Thread.run(Thread.java:748)
Caused by: java.net.SocketTimeoutException: Read timed out
	at java.net.SocketInputStream.socketRead0(Native Method)
	at java.net.SocketInputStream.socketRead(SocketInputStream.java:116)
	at java.net.SocketInputStream.read(SocketInputStream.java:171)
	at java.net.SocketInputStream.read(SocketInputStream.java:141)
	at org.apache.http.impl.io.SessionInputBufferImpl.streamRead(SessionInputBufferImpl.java:137)
	at org.apache.http.impl.io.SessionInputBufferImpl.fillBuffer(SessionInputBufferImpl.java:153)
	at org.apache.http.impl.io.SessionInputBufferImpl.readLine(SessionInputBufferImpl.java:280)
	at org.apache.http.impl.conn.DefaultHttpResponseParser.parseHead(DefaultHttpResponseParser.java:138)
	at org.apache.http.impl.conn.DefaultHttpResponseParser.parseHead(DefaultHttpResponseParser.java:56)
	at org.apache.http.impl.io.AbstractMessageParser.parse(AbstractMessageParser.java:259)
	at org.apache.http.impl.DefaultBHttpClientConnection.receiveResponseHeader(DefaultBHttpClientConnection.java:163)
	at org.apache.http.impl.conn.CPoolProxy.receiveResponseHeader(CPoolProxy.java:157)
	at org.apache.http.protocol.HttpRequestExecutor.doReceiveResponse(HttpRequestExecutor.java:273)
	at org.apache.http.protocol.HttpRequestExecutor.execute(HttpRequestExecutor.java:125)
	at org.apache.http.impl.execchain.MainClientExec.execute(MainClientExec.java:272)
	at org.apache.http.impl.execchain.ProtocolExec.execute(ProtocolExec.java:186)
	at org.apache.http.impl.execchain.RetryExec.execute(RetryExec.java:89)
	at org.apache.http.impl.execchain.RedirectExec.execute(RedirectExec.java:110)
	at org.apache.http.impl.client.InternalHttpClient.doExecute(InternalHttpClient.java:185)
	at org.apache.http.impl.client.CloseableHttpClient.execute(CloseableHttpClient.java:83)
	at org.apache.http.impl.client.CloseableHttpClient.execute(CloseableHttpClient.java:56)
	at org.apache.solr.client.solrj.impl.HttpSolrClient.executeMethod(HttpSolrClient.java:571)
	... 53 more




Build Log:
[...truncated 15949 lines...]
   [junit4] Suite: org.apache.solr.metrics.reporters.solr.SolrCloudReportersTest
   [junit4]   2> 1911792 INFO  (SUITE-SolrCloudReportersTest-seed#[7A605020B013D9FA]-worker) [     ] o.a.s.SolrTestCase Setting 'solr.default.confdir' system property to test-framework derived value of '/home/jenkins/jenkins-slave/workspace/Lucene/Lucene-Solr-BadApples-Tests-8.x/solr/server/solr/configsets/_default/conf'
   [junit4]   2> 1911793 INFO  (SUITE-SolrCloudReportersTest-seed#[7A605020B013D9FA]-worker) [     ] o.a.s.SolrTestCaseJ4 Created dataDir: /home/jenkins/jenkins-slave/workspace/Lucene/Lucene-Solr-BadApples-Tests-8.x/solr/build/solr-core/test/J0/temp/solr.metrics.reporters.solr.SolrCloudReportersTest_7A605020B013D9FA-001/data-dir-172-001
   [junit4]   2> 1911793 WARN  (SUITE-SolrCloudReportersTest-seed#[7A605020B013D9FA]-worker) [     ] o.a.s.SolrTestCaseJ4 startTrackingSearchers: numOpens=8 numCloses=8
   [junit4]   2> 1911793 INFO  (SUITE-SolrCloudReportersTest-seed#[7A605020B013D9FA]-worker) [     ] o.a.s.SolrTestCaseJ4 Using PointFields (NUMERIC_POINTS_SYSPROP=true) w/NUMERIC_DOCVALUES_SYSPROP=false
   [junit4]   2> 1911795 INFO  (SUITE-SolrCloudReportersTest-seed#[7A605020B013D9FA]-worker) [     ] o.a.s.SolrTestCaseJ4 Randomized ssl (false) and clientAuth (true) via: @org.apache.solr.util.RandomizeSSL(reason=, ssl=NaN, value=NaN, clientAuth=NaN)
   [junit4]   2> 1911795 INFO  (SUITE-SolrCloudReportersTest-seed#[7A605020B013D9FA]-worker) [     ] o.a.s.SolrTestCaseJ4 SecureRandom sanity checks: test.solr.allowed.securerandom=null & java.security.egd=file:/dev/./urandom
   [junit4]   2> 1911795 INFO  (SUITE-SolrCloudReportersTest-seed#[7A605020B013D9FA]-worker) [     ] o.a.s.c.SolrCloudTestCase Using per-replica state
   [junit4]   2> 1911795 INFO  (SUITE-SolrCloudReportersTest-seed#[7A605020B013D9FA]-worker) [     ] o.a.s.c.MiniSolrCloudCluster Starting cluster of 0 servers in /home/jenkins/jenkins-slave/workspace/Lucene/Lucene-Solr-BadApples-Tests-8.x/solr/build/solr-core/test/J0/temp/solr.metrics.reporters.solr.SolrCloudReportersTest_7A605020B013D9FA-001/tempDir-001
   [junit4]   2> 1911795 INFO  (SUITE-SolrCloudReportersTest-seed#[7A605020B013D9FA]-worker) [     ] o.a.s.c.ZkTestServer STARTING ZK TEST SERVER
   [junit4]   2> 1911795 INFO  (ZkTestServer Run Thread) [     ] o.a.s.c.ZkTestServer client port: 0.0.0.0/0.0.0.0:0
   [junit4]   2> 1911795 INFO  (ZkTestServer Run Thread) [     ] o.a.s.c.ZkTestServer Starting server
   [junit4]   2> 1911796 WARN  (ZkTestServer Run Thread) [     ] o.a.z.s.ServerCnxnFactory maxCnxns is not configured, using default value 0.
   [junit4]   2> 1911895 INFO  (SUITE-SolrCloudReportersTest-seed#[7A605020B013D9FA]-worker) [     ] o.a.s.c.ZkTestServer start zk server on port: 36441
   [junit4]   2> 1911895 INFO  (SUITE-SolrCloudReportersTest-seed#[7A605020B013D9FA]-worker) [     ] o.a.s.c.ZkTestServer waitForServerUp: 127.0.0.1:36441
   [junit4]   2> 1911895 INFO  (SUITE-SolrCloudReportersTest-seed#[7A605020B013D9FA]-worker) [     ] o.a.s.c.ZkTestServer parse host and port list: 127.0.0.1:36441
   [junit4]   2> 1911895 INFO  (SUITE-SolrCloudReportersTest-seed#[7A605020B013D9FA]-worker) [     ] o.a.s.c.ZkTestServer connecting to 127.0.0.1 36441
   [junit4]   2> 1911897 INFO  (SUITE-SolrCloudReportersTest-seed#[7A605020B013D9FA]-worker) [     ] o.a.s.c.c.ConnectionManager Waiting for client to connect to ZooKeeper
   [junit4]   2> 1911903 INFO  (zkConnectionManagerCallback-19074-thread-1) [     ] o.a.s.c.c.ConnectionManager zkClient has connected
   [junit4]   2> 1911903 INFO  (SUITE-SolrCloudReportersTest-seed#[7A605020B013D9FA]-worker) [     ] o.a.s.c.c.ConnectionManager Client is connected to ZooKeeper
   [junit4]   2> 1911906 INFO  (SUITE-SolrCloudReportersTest-seed#[7A605020B013D9FA]-worker) [     ] o.a.s.c.c.ConnectionManager Waiting for client to connect to ZooKeeper
   [junit4]   2> 1911910 INFO  (zkConnectionManagerCallback-19076-thread-1) [     ] o.a.s.c.c.ConnectionManager zkClient has connected
   [junit4]   2> 1911910 INFO  (SUITE-SolrCloudReportersTest-seed#[7A605020B013D9FA]-worker) [     ] o.a.s.c.c.ConnectionManager Client is connected to ZooKeeper
   [junit4]   2> 1911910 INFO  (SUITE-SolrCloudReportersTest-seed#[7A605020B013D9FA]-worker) [     ] o.a.s.c.c.ConnectionManager Waiting for client to connect to ZooKeeper
   [junit4]   2> 1911913 INFO  (zkConnectionManagerCallback-19078-thread-1) [     ] o.a.s.c.c.ConnectionManager zkClient has connected
   [junit4]   2> 1911913 INFO  (SUITE-SolrCloudReportersTest-seed#[7A605020B013D9FA]-worker) [     ] o.a.s.c.c.ConnectionManager Client is connected to ZooKeeper
   [junit4]   2> 1911915 WARN  (SUITE-SolrCloudReportersTest-seed#[7A605020B013D9FA]-worker-SendThread(127.0.0.1:36441)) [     ] o.a.z.ClientCnxn An exception was thrown while closing send thread for session 0x103392da7d90002.
   [junit4]   2>           => EndOfStreamException: Unable to read additional data from server sessionid 0x103392da7d90002, likely server has closed socket
   [junit4]   2> 	at org.apache.zookeeper.ClientCnxnSocketNIO.doIO(ClientCnxnSocketNIO.java:77)
   [junit4]   2> org.apache.zookeeper.ClientCnxn$EndOfStreamException: Unable to read additional data from server sessionid 0x103392da7d90002, likely server has closed socket
   [junit4]   2> 	at org.apache.zookeeper.ClientCnxnSocketNIO.doIO(ClientCnxnSocketNIO.java:77) ~[zookeeper-3.6.2.jar:3.6.2]
   [junit4]   2> 	at org.apache.zookeeper.ClientCnxnSocketNIO.doTransport(ClientCnxnSocketNIO.java:350) ~[zookeeper-3.6.2.jar:3.6.2]
   [junit4]   2> 	at org.apache.zookeeper.ClientCnxn$SendThread.run(ClientCnxn.java:1275) [zookeeper-3.6.2.jar:3.6.2]
   [junit4]   2> 1912023 INFO  (TEST-SolrCloudReportersTest.testDefaultPlugins-seed#[7A605020B013D9FA]) [     ] o.a.s.SolrTestCaseJ4 ###Starting testDefaultPlugins
   [junit4]   2> 1912024 INFO  (TEST-SolrCloudReportersTest.testDefaultPlugins-seed#[7A605020B013D9FA]) [     ] o.a.s.c.ZkTestServer Shutting down ZkTestServer.
   [junit4]   2> 1912125 WARN  (SUITE-SolrCloudReportersTest-seed#[7A605020B013D9FA]-worker-SendThread(127.0.0.1:36441)) [     ] o.a.z.ClientCnxn An exception was thrown while closing send thread for session 0x103392da7d90001.
   [junit4]   2>           => EndOfStreamException: Unable to read additional data from server sessionid 0x103392da7d90001, likely server has closed socket
   [junit4]   2> 	at org.apache.zookeeper.ClientCnxnSocketNIO.doIO(ClientCnxnSocketNIO.java:77)
   [junit4]   2> org.apache.zookeeper.ClientCnxn$EndOfStreamException: Unable to read additional data from server sessionid 0x103392da7d90001, likely server has closed socket
   [junit4]   2> 	at org.apache.zookeeper.ClientCnxnSocketNIO.doIO(ClientCnxnSocketNIO.java:77) ~[zookeeper-3.6.2.jar:3.6.2]
   [junit4]   2> 	at org.apache.zookeeper.ClientCnxnSocketNIO.doTransport(ClientCnxnSocketNIO.java:350) ~[zookeeper-3.6.2.jar:3.6.2]
   [junit4]   2> 	at org.apache.zookeeper.ClientCnxn$SendThread.run(ClientCnxn.java:1275) [zookeeper-3.6.2.jar:3.6.2]
   [junit4]   2> 1912227 INFO  (TEST-SolrCloudReportersTest.testDefaultPlugins-seed#[7A605020B013D9FA]) [     ] o.a.s.c.ZkTestServer waitForServerDown: 127.0.0.1:36441
   [junit4]   2> 1912227 INFO  (TEST-SolrCloudReportersTest.testDefaultPlugins-seed#[7A605020B013D9FA]) [     ] o.a.s.c.ZkTestServer parse host and port list: 127.0.0.1:36441
   [junit4]   2> 1912227 INFO  (TEST-SolrCloudReportersTest.testDefaultPlugins-seed#[7A605020B013D9FA]) [     ] o.a.s.c.ZkTestServer connecting to 127.0.0.1 36441
   [junit4]   2> 1912228 INFO  (TEST-SolrCloudReportersTest.testDefaultPlugins-seed#[7A605020B013D9FA]) [     ] o.a.s.c.MiniSolrCloudCluster Starting cluster of 2 servers in /home/jenkins/jenkins-slave/workspace/Lucene/Lucene-Solr-BadApples-Tests-8.x/solr/build/solr-core/test/J0/temp/solr.metrics.reporters.solr.SolrCloudReportersTest_7A605020B013D9FA-001/tempDir-002
   [junit4]   2> 1912229 INFO  (TEST-SolrCloudReportersTest.testDefaultPlugins-seed#[7A605020B013D9FA]) [     ] o.a.s.c.ZkTestServer STARTING ZK TEST SERVER
   [junit4]   2> 1912229 INFO  (ZkTestServer Run Thread) [     ] o.a.s.c.ZkTestServer client port: 0.0.0.0/0.0.0.0:0
   [junit4]   2> 1912229 INFO  (ZkTestServer Run Thread) [     ] o.a.s.c.ZkTestServer Starting server
   [junit4]   2> 1912230 WARN  (ZkTestServer Run Thread) [     ] o.a.z.s.ServerCnxnFactory maxCnxns is not configured, using default value 0.
   [junit4]   2> 1912329 INFO  (TEST-SolrCloudReportersTest.testDefaultPlugins-seed#[7A605020B013D9FA]) [     ] o.a.s.c.ZkTestServer start zk server on port: 36165
   [junit4]   2> 1912329 INFO  (TEST-SolrCloudReportersTest.testDefaultPlugins-seed#[7A605020B013D9FA]) [     ] o.a.s.c.ZkTestServer waitForServerUp: 127.0.0.1:36165
   [junit4]   2> 1912329 INFO  (TEST-SolrCloudReportersTest.testDefaultPlugins-seed#[7A605020B013D9FA]) [     ] o.a.s.c.ZkTestServer parse host and port list: 127.0.0.1:36165
   [junit4]   2> 1912329 INFO  (TEST-SolrCloudReportersTest.testDefaultPlugins-seed#[7A605020B013D9FA]) [     ] o.a.s.c.ZkTestServer connecting to 127.0.0.1 36165
   [junit4]   2> 1912330 INFO  (TEST-SolrCloudReportersTest.testDefaultPlugins-seed#[7A605020B013D9FA]) [     ] o.a.s.c.c.ConnectionManager Waiting for client to connect to ZooKeeper
   [junit4]   2> 1912332 INFO  (zkConnectionManagerCallback-19083-thread-1) [     ] o.a.s.c.c.ConnectionManager zkClient has connected
   [junit4]   2> 1912332 INFO  (TEST-SolrCloudReportersTest.testDefaultPlugins-seed#[7A605020B013D9FA]) [     ] o.a.s.c.c.ConnectionManager Client is connected to ZooKeeper
   [junit4]   2> 1912338 INFO  (TEST-SolrCloudReportersTest.testDefaultPlugins-seed#[7A605020B013D9FA]) [     ] o.a.s.c.c.ConnectionManager Waiting for client to connect to ZooKeeper
   [junit4]   2> 1912340 INFO  (zkConnectionManagerCallback-19085-thread-1) [     ] o.a.s.c.c.ConnectionManager zkClient has connected
   [junit4]   2> 1912341 INFO  (TEST-SolrCloudReportersTest.testDefaultPlugins-seed#[7A605020B013D9FA]) [     ] o.a.s.c.c.ConnectionManager Client is connected to ZooKeeper
   [junit4]   2> 1912344 INFO  (TEST-SolrCloudReportersTest.testDefaultPlugins-seed#[7A605020B013D9FA]) [     ] o.a.s.c.c.ConnectionManager Waiting for client to connect to ZooKeeper
   [junit4]   2> 1912348 INFO  (zkConnectionManagerCallback-19087-thread-1) [     ] o.a.s.c.c.ConnectionManager zkClient has connected
   [junit4]   2> 1912348 INFO  (TEST-SolrCloudReportersTest.testDefaultPlugins-seed#[7A605020B013D9FA]) [     ] o.a.s.c.c.ConnectionManager Client is connected to ZooKeeper
   [junit4]   2> 1912450 INFO  (jetty-launcher-19088-thread-2) [     ] o.a.s.c.s.e.JettySolrRunner Start Jetty (configured port=0, binding port=0)
   [junit4]   2> 1912450 INFO  (jetty-launcher-19088-thread-1) [     ] o.a.s.c.s.e.JettySolrRunner Start Jetty (configured port=0, binding port=0)
   [junit4]   2> 1912450 INFO  (jetty-launcher-19088-thread-2) [     ] o.a.s.c.s.e.JettySolrRunner Trying to start Jetty on port 0 try number 2 ...
   [junit4]   2> 1912450 INFO  (jetty-launcher-19088-thread-1) [     ] o.a.s.c.s.e.JettySolrRunner Trying to start Jetty on port 0 try number 2 ...
   [junit4]   2> 1912451 INFO  (jetty-launcher-19088-thread-2) [     ] o.e.j.s.Server jetty-9.4.34.v20201102; built: 2020-11-02T14:15:39.302Z; git: e46af88704a893fc12cb0e3bf46e2c7b48a009e7; jvm 1.8.0_281-b09
   [junit4]   2> 1912451 INFO  (jetty-launcher-19088-thread-1) [     ] o.e.j.s.Server jetty-9.4.34.v20201102; built: 2020-11-02T14:15:39.302Z; git: e46af88704a893fc12cb0e3bf46e2c7b48a009e7; jvm 1.8.0_281-b09
   [junit4]   2> 1912457 INFO  (jetty-launcher-19088-thread-2) [     ] o.e.j.s.session DefaultSessionIdManager workerName=node0
   [junit4]   2> 1912457 INFO  (jetty-launcher-19088-thread-2) [     ] o.e.j.s.session No SessionScavenger set, using defaults
   [junit4]   2> 1912457 INFO  (jetty-launcher-19088-thread-1) [     ] o.e.j.s.session DefaultSessionIdManager workerName=node0
   [junit4]   2> 1912457 INFO  (jetty-launcher-19088-thread-1) [     ] o.e.j.s.session No SessionScavenger set, using defaults
   [junit4]   2> 1912457 INFO  (jetty-launcher-19088-thread-2) [     ] o.e.j.s.session node0 Scavenging every 600000ms
   [junit4]   2> 1912457 INFO  (jetty-launcher-19088-thread-1) [     ] o.e.j.s.session node0 Scavenging every 600000ms
   [junit4]   2> 1912457 INFO  (jetty-launcher-19088-thread-1) [     ] o.e.j.s.h.ContextHandler Started o.e.j.s.ServletContextHandler@50c12447{/solr,null,AVAILABLE}
   [junit4]   2> 1912457 INFO  (jetty-launcher-19088-thread-2) [     ] o.e.j.s.h.ContextHandler Started o.e.j.s.ServletContextHandler@75672296{/solr,null,AVAILABLE}
   [junit4]   2> 1912457 INFO  (jetty-launcher-19088-thread-1) [     ] o.e.j.s.AbstractConnector Started ServerConnector@5d80dcab{HTTP/1.1, (http/1.1, h2c)}{127.0.0.1:38221}
   [junit4]   2> 1912457 INFO  (jetty-launcher-19088-thread-1) [     ] o.e.j.s.Server Started @1912488ms
   [junit4]   2> 1912458 INFO  (jetty-launcher-19088-thread-1) [     ] o.a.s.c.s.e.JettySolrRunner Jetty properties: {hostContext=/solr, zkHost=127.0.0.1:36165/solr, hostPort=38221}
   [junit4]   2> 1912458 INFO  (jetty-launcher-19088-thread-2) [     ] o.e.j.s.AbstractConnector Started ServerConnector@62ad5bc9{HTTP/1.1, (http/1.1, h2c)}{127.0.0.1:39779}
   [junit4]   2> 1912458 ERROR (jetty-launcher-19088-thread-1) [     ] o.a.s.u.StartupLoggingUtils Missing Java Option solr.log.dir. Logging may be missing or incomplete.
   [junit4]   2> 1912458 INFO  (jetty-launcher-19088-thread-2) [     ] o.e.j.s.Server Started @1912489ms
   [junit4]   2> 1912458 INFO  (jetty-launcher-19088-thread-1) [     ] o.a.s.s.SolrDispatchFilter Using logger factory org.apache.logging.slf4j.Log4jLoggerFactory
   [junit4]   2> 1912458 INFO  (jetty-launcher-19088-thread-2) [     ] o.a.s.c.s.e.JettySolrRunner Jetty properties: {hostContext=/solr, zkHost=127.0.0.1:36165/solr, hostPort=39779}
   [junit4]   2> 1912458 INFO  (jetty-launcher-19088-thread-1) [     ] o.a.s.s.SolrDispatchFilter  ___      _       Welcome to Apache Solr™ version 8.9.0
   [junit4]   2> 1912458 INFO  (jetty-launcher-19088-thread-1) [     ] o.a.s.s.SolrDispatchFilter / __| ___| |_ _   Starting in cloud mode on port null
   [junit4]   2> 1912458 INFO  (jetty-launcher-19088-thread-1) [     ] o.a.s.s.SolrDispatchFilter \__ \/ _ \ | '_|  Install dir: /home/jenkins/jenkins-slave/workspace/Lucene/Lucene-Solr-BadApples-Tests-8.x/solr
   [junit4]   2> 1912458 INFO  (jetty-launcher-19088-thread-1) [     ] o.a.s.s.SolrDispatchFilter |___/\___/_|_|    Start time: 2021-02-08T15:29:06.606Z
   [junit4]   2> 1912458 ERROR (jetty-launcher-19088-thread-2) [     ] o.a.s.u.StartupLoggingUtils Missing Java Option solr.log.dir. Logging may be missing or incomplete.
   [junit4]   2> 1912458 INFO  (jetty-launcher-19088-thread-2) [     ] o.a.s.s.SolrDispatchFilter Using logger factory org.apache.logging.slf4j.Log4jLoggerFactory
   [junit4]   2> 1912458 INFO  (jetty-launcher-19088-thread-2) [     ] o.a.s.s.SolrDispatchFilter  ___      _       Welcome to Apache Solr™ version 8.9.0
   [junit4]   2> 1912458 INFO  (jetty-launcher-19088-thread-2) [     ] o.a.s.s.SolrDispatchFilter / __| ___| |_ _   Starting in cloud mode on port null
   [junit4]   2> 1912458 INFO  (jetty-launcher-19088-thread-2) [     ] o.a.s.s.SolrDispatchFilter \__ \/ _ \ | '_|  Install dir: /home/jenkins/jenkins-slave/workspace/Lucene/Lucene-Solr-BadApples-Tests-8.x/solr
   [junit4]   2> 1912458 INFO  (jetty-launcher-19088-thread-2) [     ] o.a.s.s.SolrDispatchFilter |___/\___/_|_|    Start time: 2021-02-08T15:29:06.606Z
   [junit4]   2> 1912464 INFO  (jetty-launcher-19088-thread-1) [     ] o.a.s.c.c.ConnectionManager Waiting for client to connect to ZooKeeper
   [junit4]   2> 1912468 INFO  (jetty-launcher-19088-thread-2) [     ] o.a.s.c.c.ConnectionManager Waiting for client to connect to ZooKeeper
   [junit4]   2> 1912472 INFO  (zkConnectionManagerCallback-19090-thread-1) [     ] o.a.s.c.c.ConnectionManager zkClient has connected
   [junit4]   2> 1912472 INFO  (jetty-launcher-19088-thread-1) [     ] o.a.s.c.c.ConnectionManager Client is connected to ZooKeeper
   [junit4]   2> 1912472 INFO  (zkConnectionManagerCallback-19092-thread-1) [     ] o.a.s.c.c.ConnectionManager zkClient has connected
   [junit4]   2> 1912472 INFO  (jetty-launcher-19088-thread-2) [     ] o.a.s.c.c.ConnectionManager Client is connected to ZooKeeper
   [junit4]   2> 1912472 INFO  (jetty-launcher-19088-thread-1) [     ] o.a.s.s.SolrDispatchFilter solr.xml found in ZooKeeper. Loading...
   [junit4]   2> 1912472 INFO  (jetty-launcher-19088-thread-2) [     ] o.a.s.s.SolrDispatchFilter solr.xml found in ZooKeeper. Loading...
   [junit4]   2> 1912475 INFO  (jetty-launcher-19088-thread-1) [     ] o.a.s.c.SolrXmlConfig Configuration parameter autoReplicaFailoverWorkLoopDelay is ignored
   [junit4]   2> 1912475 INFO  (jetty-launcher-19088-thread-1) [     ] o.a.s.c.SolrXmlConfig Configuration parameter autoReplicaFailoverBadNodeExpiration is ignored
   [junit4]   2> 1912476 INFO  (jetty-launcher-19088-thread-1) [     ] o.a.s.c.SolrXmlConfig MBean server found: com.sun.jmx.mbeanserver.JmxMBeanServer@61f0e444, but no JMX reporters were configured - adding default JMX reporter.
   [junit4]   2> 1912477 WARN  (jetty-launcher-19088-thread-1-SendThread(127.0.0.1:36165)) [     ] o.a.z.ClientCnxn An exception was thrown while closing send thread for session 0x103392da98a0003.
   [junit4]   2>           => EndOfStreamException: Unable to read additional data from server sessionid 0x103392da98a0003, likely server has closed socket
   [junit4]   2> 	at org.apache.zookeeper.ClientCnxnSocketNIO.doIO(ClientCnxnSocketNIO.java:77)
   [junit4]   2> org.apache.zookeeper.ClientCnxn$EndOfStreamException: Unable to read additional data from server sessionid 0x103392da98a0003, likely server has closed socket
   [junit4]   2> 	at org.apache.zookeeper.ClientCnxnSocketNIO.doIO(ClientCnxnSocketNIO.java:77) ~[zookeeper-3.6.2.jar:3.6.2]
   [junit4]   2> 	at org.apache.zookeeper.ClientCnxnSocketNIO.doTransport(ClientCnxnSocketNIO.java:350) ~[zookeeper-3.6.2.jar:3.6.2]
   [junit4]   2> 	at org.apache.zookeeper.ClientCnxn$SendThread.run(ClientCnxn.java:1275) [zookeeper-3.6.2.jar:3.6.2]
   [junit4]   2> 1912477 INFO  (jetty-launcher-19088-thread-2) [     ] o.a.s.c.SolrXmlConfig Configuration parameter autoReplicaFailoverWorkLoopDelay is ignored
   [junit4]   2> 1912478 INFO  (jetty-launcher-19088-thread-2) [     ] o.a.s.c.SolrXmlConfig Configuration parameter autoReplicaFailoverBadNodeExpiration is ignored
   [junit4]   2> 1912479 INFO  (jetty-launcher-19088-thread-2) [     ] o.a.s.c.SolrXmlConfig MBean server found: com.sun.jmx.mbeanserver.JmxMBeanServer@61f0e444, but no JMX reporters were configured - adding default JMX reporter.
   [junit4]   2> 1912893 INFO  (jetty-launcher-19088-thread-1) [     ] o.a.s.h.c.HttpShardHandlerFactory Host whitelist initialized: WhitelistHostChecker [whitelistHosts=null, whitelistHostCheckingEnabled=true]
   [junit4]   2> 1912893 WARN  (jetty-launcher-19088-thread-1) [     ] o.e.j.u.s.S.config Trusting all certificates configured for Client@2420c8a5[provider=null,keyStore=null,trustStore=null]
   [junit4]   2> 1912893 WARN  (jetty-launcher-19088-thread-1) [     ] o.e.j.u.s.S.config No Client EndPointIdentificationAlgorithm configured for Client@2420c8a5[provider=null,keyStore=null,trustStore=null]
   [junit4]   2> 1912895 WARN  (jetty-launcher-19088-thread-1) [     ] o.e.j.u.s.S.config Trusting all certificates configured for Client@20cfa364[provider=null,keyStore=null,trustStore=null]
   [junit4]   2> 1912895 WARN  (jetty-launcher-19088-thread-1) [     ] o.e.j.u.s.S.config No Client EndPointIdentificationAlgorithm configured for Client@20cfa364[provider=null,keyStore=null,trustStore=null]
   [junit4]   2> 1912897 INFO  (jetty-launcher-19088-thread-1) [     ] o.a.s.c.ZkContainer Zookeeper client=127.0.0.1:36165/solr
   [junit4]   2> 1912897 INFO  (jetty-launcher-19088-thread-1) [     ] o.a.s.c.c.ConnectionManager Waiting for client to connect to ZooKeeper
   [junit4]   2> 1912898 INFO  (zkConnectionManagerCallback-19106-thread-1) [     ] o.a.s.c.c.ConnectionManager zkClient has connected
   [junit4]   2> 1912898 INFO  (jetty-launcher-19088-thread-1) [     ] o.a.s.c.c.ConnectionManager Client is connected to ZooKeeper
   [junit4]   2> 1913000 INFO  (jetty-launcher-19088-thread-1) [n:127.0.0.1:38221_solr     ] o.a.s.c.c.ConnectionManager Waiting for client to connect to ZooKeeper
   [junit4]   2> 1913001 INFO  (zkConnectionManagerCallback-19108-thread-1) [     ] o.a.s.c.c.ConnectionManager zkClient has connected
   [junit4]   2> 1913001 INFO  (jetty-launcher-19088-thread-1) [n:127.0.0.1:38221_solr     ] o.a.s.c.c.ConnectionManager Client is connected to ZooKeeper
   [junit4]   2> 1913085 INFO  (jetty-launcher-19088-thread-1) [n:127.0.0.1:38221_solr     ] o.a.s.c.OverseerElectionContext I am going to be the leader 127.0.0.1:38221_solr
   [junit4]   2> 1913086 INFO  (jetty-launcher-19088-thread-1) [n:127.0.0.1:38221_solr     ] o.a.s.c.Overseer Overseer (id=72964887248764934-127.0.0.1:38221_solr-n_0000000000) starting
   [junit4]   2> 1913092 INFO  (OverseerStateUpdate-72964887248764934-127.0.0.1:38221_solr-n_0000000000) [n:127.0.0.1:38221_solr     ] o.a.s.c.Overseer Starting to work on the main queue : 127.0.0.1:38221_solr
   [junit4]   2> 1913092 INFO  (jetty-launcher-19088-thread-1) [n:127.0.0.1:38221_solr     ] o.a.s.c.ZkController Register node as live in ZooKeeper:/live_nodes/127.0.0.1:38221_solr
   [junit4]   2> 1913094 INFO  (OverseerStateUpdate-72964887248764934-127.0.0.1:38221_solr-n_0000000000) [n:127.0.0.1:38221_solr     ] o.a.s.c.c.ZkStateReader Updated live nodes from ZooKeeper... (0) -> (1)
   [junit4]   2> 1913095 INFO  (jetty-launcher-19088-thread-1) [n:127.0.0.1:38221_solr     ] o.a.s.p.PackageLoader /packages.json updated to version -1
   [junit4]   2> 1913096 WARN  (jetty-launcher-19088-thread-1) [n:127.0.0.1:38221_solr     ] o.a.s.c.CoreContainer Not all security plugins configured!  authentication=disabled authorization=disabled.  Solr is only as secure as you make it. Consider configuring authentication/authorization before exposing Solr to users internal or external.  See https://s.apache.org/solrsecurity for more info
   [junit4]   2> 1913111 INFO  (jetty-launcher-19088-thread-1) [n:127.0.0.1:38221_solr     ] o.a.s.h.a.MetricsHistoryHandler No .system collection, keeping metrics history in memory.
   [junit4]   2> 1913134 INFO  (jetty-launcher-19088-thread-1) [n:127.0.0.1:38221_solr     ] o.a.s.m.r.SolrJmxReporter JMX monitoring for 'solr.node' (registry 'solr.node') enabled at server: com.sun.jmx.mbeanserver.JmxMBeanServer@61f0e444
   [junit4]   2> 1913151 INFO  (jetty-launcher-19088-thread-1) [n:127.0.0.1:38221_solr     ] o.a.s.m.r.SolrJmxReporter JMX monitoring for 'solr.jvm' (registry 'solr.jvm') enabled at server: com.sun.jmx.mbeanserver.JmxMBeanServer@61f0e444
   [junit4]   2> 1913151 INFO  (jetty-launcher-19088-thread-1) [n:127.0.0.1:38221_solr     ] o.a.s.m.r.SolrJmxReporter JMX monitoring for 'solr.jetty' (registry 'solr.jetty') enabled at server: com.sun.jmx.mbeanserver.JmxMBeanServer@61f0e444
   [junit4]   2> 1913152 INFO  (jetty-launcher-19088-thread-1) [n:127.0.0.1:38221_solr     ] o.a.s.c.CorePropertiesLocator Found 0 core definitions underneath /home/jenkins/jenkins-slave/workspace/Lucene/Lucene-Solr-BadApples-Tests-8.x/solr/build/solr-core/test/J0/temp/solr.metrics.reporters.solr.SolrCloudReportersTest_7A605020B013D9FA-001/tempDir-002/node1
   [junit4]   2> 1914287 INFO  (jetty-launcher-19088-thread-2) [     ] o.a.s.h.c.HttpShardHandlerFactory Host whitelist initialized: WhitelistHostChecker [whitelistHosts=null, whitelistHostCheckingEnabled=true]
   [junit4]   2> 1914288 WARN  (jetty-launcher-19088-thread-2) [     ] o.e.j.u.s.S.config Trusting all certificates configured for Client@10eac2a7[provider=null,keyStore=null,trustStore=null]
   [junit4]   2> 1914288 WARN  (jetty-launcher-19088-thread-2) [     ] o.e.j.u.s.S.config No Client EndPointIdentificationAlgorithm configured for Client@10eac2a7[provider=null,keyStore=null,trustStore=null]
   [junit4]   2> 1914290 WARN  (jetty-launcher-19088-thread-2) [     ] o.e.j.u.s.S.config Trusting all certificates configured for Client@404ed9f5[provider=null,keyStore=null,trustStore=null]
   [junit4]   2> 1914290 WARN  (jetty-launcher-19088-thread-2) [     ] o.e.j.u.s.S.config No Client EndPointIdentificationAlgorithm configured for Client@404ed9f5[provider=null,keyStore=null,trustStore=null]
   [junit4]   2> 1914292 INFO  (jetty-launcher-19088-thread-2) [     ] o.a.s.c.ZkContainer Zookeeper client=127.0.0.1:36165/solr
   [junit4]   2> 1914293 INFO  (jetty-launcher-19088-thread-2) [     ] o.a.s.c.c.ConnectionManager Waiting for client to connect to ZooKeeper
   [junit4]   2> 1914293 INFO  (zkConnectionManagerCallback-19128-thread-1) [     ] o.a.s.c.c.ConnectionManager zkClient has connected
   [junit4]   2> 1914293 INFO  (jetty-launcher-19088-thread-2) [     ] o.a.s.c.c.ConnectionManager Client is connected to ZooKeeper
   [junit4]   2> 1914396 INFO  (jetty-launcher-19088-thread-2) [n:127.0.0.1:39779_solr     ] o.a.s.c.c.ConnectionManager Waiting for client to connect to ZooKeeper
   [junit4]   2> 1914397 INFO  (zkConnectionManagerCallback-19130-thread-1) [     ] o.a.s.c.c.ConnectionManager zkClient has connected
   [junit4]   2> 1914397 INFO  (jetty-launcher-19088-thread-2) [n:127.0.0.1:39779_solr     ] o.a.s.c.c.ConnectionManager Client is connected to ZooKeeper
   [junit4]   2> 1914402 INFO  (jetty-launcher-19088-thread-2) [n:127.0.0.1:39779_solr     ] o.a.s.c.c.ZkStateReader Updated live nodes from ZooKeeper... (0) -> (1)
   [junit4]   2> 1914406 INFO  (jetty-launcher-19088-thread-2) [n:127.0.0.1:39779_solr     ] o.a.s.c.ZkController Publish node=127.0.0.1:39779_solr as DOWN
   [junit4]   2> 1914407 INFO  (jetty-launcher-19088-thread-2) [n:127.0.0.1:39779_solr     ] o.a.s.c.TransientSolrCoreCacheDefault Allocating transient cache for 4 transient cores
   [junit4]   2> 1914407 INFO  (jetty-launcher-19088-thread-2) [n:127.0.0.1:39779_solr     ] o.a.s.c.ZkController Register node as live in ZooKeeper:/live_nodes/127.0.0.1:39779_solr
   [junit4]   2> 1914408 INFO  (zkCallback-19107-thread-1) [     ] o.a.s.c.c.ZkStateReader Updated live nodes from ZooKeeper... (1) -> (2)
   [junit4]   2> 1914409 INFO  (jetty-launcher-19088-thread-2) [n:127.0.0.1:39779_solr     ] o.a.s.p.PackageLoader /packages.json updated to version -1
   [junit4]   2> 1914409 WARN  (jetty-launcher-19088-thread-2) [n:127.0.0.1:39779_solr     ] o.a.s.c.CoreContainer Not all security plugins configured!  authentication=disabled authorization=disabled.  Solr is only as secure as you make it. Consider configuring authentication/authorization before exposing Solr to users internal or external.  See https://s.apache.org/solrsecurity for more info
   [junit4]   2> 1914412 INFO  (zkCallback-19129-thread-1) [     ] o.a.s.c.c.ZkStateReader Updated live nodes from ZooKeeper... (1) -> (2)
   [junit4]   2> 1914420 INFO  (jetty-launcher-19088-thread-2) [n:127.0.0.1:39779_solr     ] o.a.s.h.a.MetricsHistoryHandler No .system collection, keeping metrics history in memory.
   [junit4]   2> 1914438 INFO  (jetty-launcher-19088-thread-2) [n:127.0.0.1:39779_solr     ] o.a.s.m.r.SolrJmxReporter JMX monitoring for 'solr.node' (registry 'solr.node') enabled at server: com.sun.jmx.mbeanserver.JmxMBeanServer@61f0e444
   [junit4]   2> 1914448 INFO  (jetty-launcher-19088-thread-2) [n:127.0.0.1:39779_solr     ] o.a.s.m.r.SolrJmxReporter JMX monitoring for 'solr.jvm' (registry 'solr.jvm') enabled at server: com.sun.jmx.mbeanserver.JmxMBeanServer@61f0e444
   [junit4]   2> 1914448 INFO  (jetty-launcher-19088-thread-2) [n:127.0.0.1:39779_solr     ] o.a.s.m.r.SolrJmxReporter JMX monitoring for 'solr.jetty' (registry 'solr.jetty') enabled at server: com.sun.jmx.mbeanserver.JmxMBeanServer@61f0e444
   [junit4]   2> 1914450 INFO  (jetty-launcher-19088-thread-2) [n:127.0.0.1:39779_solr     ] o.a.s.c.CorePropertiesLocator Found 0 core definitions underneath /home/jenkins/jenkins-slave/workspace/Lucene/Lucene-Solr-BadApples-Tests-8.x/solr/build/solr-core/test/J0/temp/solr.metrics.reporters.solr.SolrCloudReportersTest_7A605020B013D9FA-001/tempDir-002/node2
   [junit4]   2> 1914466 INFO  (TEST-SolrCloudReportersTest.testDefaultPlugins-seed#[7A605020B013D9FA]) [     ] o.a.s.c.MiniSolrCloudCluster waitForAllNodes: numServers=2
   [junit4]   2> 1914466 INFO  (TEST-SolrCloudReportersTest.testDefaultPlugins-seed#[7A605020B013D9FA]) [     ] o.a.s.c.c.ConnectionManager Waiting for client to connect to ZooKeeper
   [junit4]   2> 1914467 INFO  (zkConnectionManagerCallback-19143-thread-1) [     ] o.a.s.c.c.ConnectionManager zkClient has connected
   [junit4]   2> 1914467 INFO  (TEST-SolrCloudReportersTest.testDefaultPlugins-seed#[7A605020B013D9FA]) [     ] o.a.s.c.c.ConnectionManager Client is connected to ZooKeeper
   [junit4]   2> 1914473 INFO  (TEST-SolrCloudReportersTest.testDefaultPlugins-seed#[7A605020B013D9FA]) [     ] o.a.s.c.c.ZkStateReader Updated live nodes from ZooKeeper... (0) -> (2)
   [junit4]   2> 1914473 INFO  (TEST-SolrCloudReportersTest.testDefaultPlugins-seed#[7A605020B013D9FA]) [     ] o.a.s.c.s.i.ZkClientClusterStateProvider Cluster at 127.0.0.1:36165/solr ready
   [junit4]   2> 1914476 INFO  (TEST-SolrCloudReportersTest.testDefaultPlugins-seed#[7A605020B013D9FA]) [     ] o.a.s.c.c.ConnectionManager Waiting for client to connect to ZooKeeper
   [junit4]   2> 1914476 INFO  (zkConnectionManagerCallback-19145-thread-1) [     ] o.a.s.c.c.ConnectionManager zkClient has connected
   [junit4]   2> 1914476 INFO  (TEST-SolrCloudReportersTest.testDefaultPlugins-seed#[7A605020B013D9FA]) [     ] o.a.s.c.c.ConnectionManager Client is connected to ZooKeeper
   [junit4]   2> 1914583 INFO  (OverseerThreadFactory-19115-thread-1-processing-n:127.0.0.1:38221_solr) [n:127.0.0.1:38221_solr     ] o.a.s.c.a.c.CreateCollectionCmd Create collection test_collection
   [junit4]   2> 1914686 INFO  (OverseerThreadFactory-19115-thread-1-processing-n:127.0.0.1:38221_solr) [n:127.0.0.1:38221_solr     ] o.a.s.c.c.ZkStateReader per-replica-state ver: 2 fetched for initializing /collections/test_collection/state.json 
   [junit4]   2> 1914690 INFO  (OverseerStateUpdate-72964887248764934-127.0.0.1:38221_solr-n_0000000000) [n:127.0.0.1:38221_solr     ] o.a.s.c.o.SliceMutator createReplica() {
   [junit4]   2>   "operation":"ADDREPLICA",
   [junit4]   2>   "collection":"test_collection",
   [junit4]   2>   "shard":"shard1",
   [junit4]   2>   "core":"test_collection_shard1_replica_n1",
   [junit4]   2>   "state":"down",
   [junit4]   2>   "node_name":"127.0.0.1:38221_solr",
   [junit4]   2>   "type":"NRT",
   [junit4]   2>   "waitForFinalState":"false"} 
   [junit4]   2> 1914692 INFO  (OverseerThreadFactory-19115-thread-1-processing-n:127.0.0.1:38221_solr) [n:127.0.0.1:38221_solr     ] o.a.s.c.c.ZkStateReader per-replica-state ver: 3 fetched for initializing /collections/test_collection/state.json 
   [junit4]   2> 1914693 INFO  (OverseerStateUpdate-72964887248764934-127.0.0.1:38221_solr-n_0000000000) [n:127.0.0.1:38221_solr     ] o.a.s.c.o.SliceMutator createReplica() {
   [junit4]   2>   "operation":"ADDREPLICA",
   [junit4]   2>   "collection":"test_collection",
   [junit4]   2>   "shard":"shard1",
   [junit4]   2>   "core":"test_collection_shard1_replica_n2",
   [junit4]   2>   "state":"down",
   [junit4]   2>   "node_name":"127.0.0.1:39779_solr",
   [junit4]   2>   "type":"NRT",
   [junit4]   2>   "waitForFinalState":"false"} 
   [junit4]   2> 1914698 INFO  (OverseerThreadFactory-19115-thread-1-processing-n:127.0.0.1:38221_solr) [n:127.0.0.1:38221_solr     ] o.a.s.c.c.ZkStateReader per-replica-state ver: 4 fetched for initializing /collections/test_collection/state.json 
   [junit4]   2> 1914699 INFO  (OverseerStateUpdate-72964887248764934-127.0.0.1:38221_solr-n_0000000000) [n:127.0.0.1:38221_solr     ] o.a.s.c.o.SliceMutator createReplica() {
   [junit4]   2>   "operation":"ADDREPLICA",
   [junit4]   2>   "collection":"test_collection",
   [junit4]   2>   "shard":"shard2",
   [junit4]   2>   "core":"test_collection_shard2_replica_n4",
   [junit4]   2>   "state":"down",
   [junit4]   2>   "node_name":"127.0.0.1:38221_solr",
   [junit4]   2>   "type":"NRT",
   [junit4]   2>   "waitForFinalState":"false"} 
   [junit4]   2> 1914701 INFO  (OverseerThreadFactory-19115-thread-1-processing-n:127.0.0.1:38221_solr) [n:127.0.0.1:38221_solr     ] o.a.s.c.c.ZkStateReader per-replica-state ver: 4 fetched for initializing /collections/test_collection/state.json 
   [junit4]   2> 1914702 INFO  (OverseerStateUpdate-72964887248764934-127.0.0.1:38221_solr-n_0000000000) [n:127.0.0.1:38221_solr     ] o.a.s.c.o.SliceMutator createReplica() {
   [junit4]   2>   "operation":"ADDREPLICA",
   [junit4]   2>   "collection":"test_collection",
   [junit4]   2>   "shard":"shard2",
   [junit4]   2>   "core":"test_collection_shard2_replica_n6",
   [junit4]   2>   "state":"down",
   [junit4]   2>   "node_name":"127.0.0.1:39779_solr",
   [junit4]   2>   "type":"NRT",
   [junit4]   2>   "waitForFinalState":"false"} 
   [junit4]   2> 1914802 INFO  (OverseerThreadFactory-19115-thread-1-processing-n:127.0.0.1:38221_solr) [n:127.0.0.1:38221_solr     ] o.a.s.c.c.ZkStateReader per-replica-state ver: 6 fetched for initializing /collections/test_collection/state.json 
   [junit4]   2> 1914804 INFO  (qtp1818929204-30501) [n:127.0.0.1:39779_solr    x:test_collection_shard2_replica_n6 ] o.a.s.h.a.CoreAdminOperation core create command qt=/admin/cores&coreNodeName=core_node8&collection.configName=test&newCollection=true&name=test_collection_shard2_replica_n6&action=CREATE&numShards=2&collection=test_collection&shard=shard2&wt=javabin&version=2&replicaType=NRT
   [junit4]   2> 1914805 INFO  (qtp1397172403-30497) [n:127.0.0.1:38221_solr    x:test_collection_shard1_replica_n1 ] o.a.s.h.a.CoreAdminOperation core create command qt=/admin/cores&coreNodeName=core_node3&collection.configName=test&newCollection=true&name=test_collection_shard1_replica_n1&action=CREATE&numShards=2&collection=test_collection&shard=shard1&wt=javabin&version=2&replicaType=NRT
   [junit4]   2> 1914805 INFO  (qtp1397172403-30502) [n:127.0.0.1:38221_solr    x:test_collection_shard2_replica_n4 ] o.a.s.h.a.CoreAdminOperation core create command qt=/admin/cores&coreNodeName=core_node7&collection.configName=test&newCollection=true&name=test_collection_shard2_replica_n4&action=CREATE&numShards=2&collection=test_collection&shard=shard2&wt=javabin&version=2&replicaType=NRT
   [junit4]   2> 1914806 INFO  (qtp1397172403-30502) [n:127.0.0.1:38221_solr    x:test_collection_shard2_replica_n4 ] o.a.s.c.TransientSolrCoreCacheDefault Allocating transient cache for 4 transient cores
   [junit4]   2> 1914806 INFO  (qtp1818929204-30494) [n:127.0.0.1:39779_solr    x:test_collection_shard1_replica_n2 ] o.a.s.h.a.CoreAdminOperation core create command qt=/admin/cores&coreNodeName=core_node5&collection.configName=test&newCollection=true&name=test_collection_shard1_replica_n2&action=CREATE&numShards=2&collection=test_collection&shard=shard1&wt=javabin&version=2&replicaType=NRT
   [junit4]   2> 1914807 INFO  (qtp1818929204-30501) [n:127.0.0.1:39779_solr    x:test_collection_shard2_replica_n6 ] o.a.s.c.c.ZkStateReader per-replica-state ver: 6 fetched for initializing /collections/test_collection/state.json 
   [junit4]   2> 1914807 INFO  (qtp1818929204-30501) [n:127.0.0.1:39779_solr c:test_collection s:shard2 r:core_node8 x:test_collection_shard2_replica_n6 ] o.a.s.c.c.ZkStateReader already watching , added to stateWatchers
   [junit4]   2> 1914807 INFO  (qtp1818929204-30494) [n:127.0.0.1:39779_solr c:test_collection s:shard1 r:core_node5 x:test_collection_shard1_replica_n2 ] o.a.s.c.c.ZkStateReader already watching , added to stateWatchers
   [junit4]   2> 1914808 INFO  (qtp1397172403-30502) [n:127.0.0.1:38221_solr c:test_collection s:shard2 r:core_node7 x:test_collection_shard2_replica_n4 ] o.a.s.c.c.ZkStateReader already watching , added to stateWatchers
   [junit4]   2> 1914808 INFO  (qtp1397172403-30497) [n:127.0.0.1:38221_solr c:test_collection s:shard1 r:core_node3 x:test_collection_shard1_replica_n1 ] o.a.s.c.c.ZkStateReader already watching , added to stateWatchers
   [junit4]   2> 1914809 INFO  (qtp1397172403-30502) [n:127.0.0.1:38221_solr c:test_collection s:shard2 r:core_node7 x:test_collection_shard2_replica_n4 ] o.a.s.c.c.ZkStateReader per-replica-state ver: 6 fetched for initializing /collections/test_collection/state.json 
   [junit4]   2> 1914809 INFO  (qtp1818929204-30501) [n:127.0.0.1:39779_solr c:test_collection s:shard2 r:core_node8 x:test_collection_shard2_replica_n6 ] o.a.s.c.c.ZkStateReader per-replica-state ver: 6 fetched for initializing /collections/test_collection/state.json 
   [junit4]   2> 1914810 INFO  (qtp1397172403-30502) [n:127.0.0.1:38221_solr c:test_collection s:shard2 r:core_node7 x:test_collection_shard2_replica_n4 ] o.a.s.c.c.ZkStateReader per-replica-state ver: 6 fetched for initializing /collections/test_collection/state.json 
   [junit4]   2> 1914810 INFO  (qtp1818929204-30501) [n:127.0.0.1:39779_solr c:test_collection s:shard2 r:core_node8 x:test_collection_shard2_replica_n6 ] o.a.s.c.c.ZkStateReader per-replica-state ver: 6 fetched for initializing /collections/test_collection/state.json 
   [junit4]   2> 1914810 INFO  (qtp1818929204-30494) [n:127.0.0.1:39779_solr c:test_collection s:shard1 r:core_node5 x:test_collection_shard1_replica_n2 ] o.a.s.c.c.ZkStateReader per-replica-state ver: 6 fetched for initializing /collections/test_collection/state.json 
   [junit4]   2> 1914811 INFO  (qtp1397172403-30497) [n:127.0.0.1:38221_solr c:test_collection s:shard1 r:core_node3 x:test_collection_shard1_replica_n1 ] o.a.s.c.c.ZkStateReader per-replica-state ver: 6 fetched for initializing /collections/test_collection/state.json 
   [junit4]   2> 1914812 INFO  (qtp1397172403-30502) [n:127.0.0.1:38221_solr c:test_collection s:shard2 r:core_node7 x:test_collection_shard2_replica_n4 ] o.a.s.c.c.ZkStateReader per-replica-state ver: 8 fetched for initializing /collections/test_collection/state.json 
   [junit4]   2> 1914814 INFO  (qtp1818929204-30501) [n:127.0.0.1:39779_solr c:test_collection s:shard2 r:core_node8 x:test_collection_shard2_replica_n6 ] o.a.s.c.c.ZkStateReader per-replica-state ver: 8 fetched for initializing /collections/test_collection/state.json 
   [junit4]   2> 1914816 INFO  (qtp1397172403-30502) [n:127.0.0.1:38221_solr c:test_collection s:shard2 r:core_node7 x:test_collection_shard2_replica_n4 ] o.a.s.c.c.ZkStateReader per-replica-state ver: 8 fetched for initializing /collections/test_collection/state.json 
   [junit4]   2> 1914816 INFO  (qtp1818929204-30501) [n:127.0.0.1:39779_solr c:test_collection s:shard2 r:core_node8 x:test_collection_shard2_replica_n6 ] o.a.s.c.c.ZkStateReader per-replica-state ver: 8 fetched for initializing /collections/test_collection/state.json 
   [junit4]   2> 1914817 INFO  (qtp1397172403-30502) [n:127.0.0.1:38221_solr c:test_collection s:shard2 r:core_node7 x:test_collection_shard2_replica_n4 ] o.a.s.c.c.ZkStateReader per-replica-state ver: 10 fetched for initializing /collections/test_collection/state.json 
   [junit4]   2> 1914818 INFO  (qtp1818929204-30501) [n:127.0.0.1:39779_solr c:test_collection s:shard2 r:core_node8 x:test_collection_shard2_replica_n6 ] o.a.s.c.c.ZkStateReader per-replica-state ver: 10 fetched for initializing /collections/test_collection/state.json 
   [junit4]   2> 1914818 INFO  (qtp1397172403-30497) [n:127.0.0.1:38221_solr c:test_collection s:shard1 r:core_node3 x:test_collection_shard1_replica_n1 ] o.a.s.c.SolrConfig Using Lucene MatchVersion: 8.9.0
   [junit4]   2> 1914818 INFO  (qtp1818929204-30494) [n:127.0.0.1:39779_solr c:test_collection s:shard1 r:core_node5 x:test_collection_shard1_replica_n2 ] o.a.s.c.SolrConfig Using Lucene MatchVersion: 8.9.0
   [junit4]   2> 1914821 INFO  (qtp1818929204-30501) [n:127.0.0.1:39779_solr c:test_collection s:shard2 r:core_node8 x:test_collection_shard2_replica_n6 ] o.a.s.c.c.ZkStateReader per-replica-state ver: 10 fetched for initializing /collections/test_collection/state.json 
   [junit4]   2> 1914821 INFO  (qtp1397172403-30502) [n:127.0.0.1:38221_solr c:test_collection s:shard2 r:core_node7 x:test_collection_shard2_replica_n4 ] o.a.s.c.c.ZkStateReader per-replica-state ver: 10 fetched for initializing /collections/test_collection/state.json 
   [junit4]   2> 1914828 INFO  (qtp1818929204-30494) [n:127.0.0.1:39779_solr c:test_collection s:shard1 r:core_node5 x:test_collection_shard1_replica_n2 ] o.a.s.s.IndexSchema Schema name=minimal
   [junit4]   2> 1914828 WARN  (qtp1818929204-30494) [n:127.0.0.1:39779_solr c:test_collection s:shard1 r:core_node5 x:test_collection_shard1_replica_n2 ] o.a.s.s.IndexSchema no uniqueKey specified in schema.
   [junit4]   2> 1914829 INFO  (qtp1818929204-30494) [n:127.0.0.1:39779_solr c:test_collection s:shard1 r:core_node5 x:test_collection_shard1_replica_n2 ] o.a.s.s.IndexSchema Loaded schema minimal/1.1 with uniqueid field null
   [junit4]   2> 1914829 INFO  (qtp1818929204-30494) [n:127.0.0.1:39779_solr c:test_collection s:shard1 r:core_node5 x:test_collection_shard1_replica_n2 ] o.a.s.c.CoreContainer Creating SolrCore 'test_collection_shard1_replica_n2' using configuration from configset test, trusted=true
   [junit4]   2> 1914829 INFO  (qtp1818929204-30494) [n:127.0.0.1:39779_solr c:test_collection s:shard1 r:core_node5 x:test_collection_shard1_replica_n2 ] o.a.s.m.r.SolrJmxReporter JMX monitoring for 'solr.core.test_collection.shard1.replica_n2' (registry 'solr.core.test_collection.shard1.replica_n2') enabled at server: com.sun.jmx.mbeanserver.JmxMBeanServer@61f0e444
   [junit4]   2> 1914829 INFO  (qtp1818929204-30501) [n:127.0.0.1:39779_solr c:test_collection s:shard2 r:core_node8 x:test_collection_shard2_replica_n6 ] o.a.s.c.SolrConfig Using Lucene MatchVersion: 8.9.0
   [junit4]   2> 1914829 INFO  (qtp1818929204-30494) [n:127.0.0.1:39779_solr c:test_collection s:shard1 r:core_node5 x:test_collection_shard1_replica_n2 ] o.a.s.c.SolrCore [[test_collection_shard1_replica_n2] ] Opening new SolrCore at [/home/jenkins/jenkins-slave/workspace/Lucene/Lucene-Solr-BadApples-Tests-8.x/solr/build/solr-core/test/J0/temp/solr.metrics.reporters.solr.SolrCloudReportersTest_7A605020B013D9FA-001/tempDir-002/node2/test_collection_shard1_replica_n2], dataDir=[/home/jenkins/jenkins-slave/workspace/Lucene/Lucene-Solr-BadApples-Tests-8.x/solr/build/solr-core/test/J0/temp/solr.metrics.reporters.solr.SolrCloudReportersTest_7A605020B013D9FA-001/tempDir-002/node2/test_collection_shard1_replica_n2/data/]
   [junit4]   2> 1914844 INFO  (qtp1397172403-30502) [n:127.0.0.1:38221_solr c:test_collection s:shard2 r:core_node7 x:test_collection_shard2_replica_n4 ] o.a.s.c.SolrConfig Using Lucene MatchVersion: 8.9.0
   [junit4]   2> 1914848 INFO  (qtp1818929204-30501) [n:127.0.0.1:39779_solr c:test_collection s:shard2 r:core_node8 x:test_collection_shard2_replica_n6 ] o.a.s.s.IndexSchema Schema name=minimal
   [junit4]   2> 1914848 WARN  (qtp1818929204-30501) [n:127.0.0.1:39779_solr c:test_collection s:shard2 r:core_node8 x:test_collection_shard2_replica_n6 ] o.a.s.s.IndexSchema no uniqueKey specified in schema.
   [junit4]   2> 1914848 INFO  (qtp1818929204-30501) [n:127.0.0.1:39779_solr c:test_collection s:shard2 r:core_node8 x:test_collection_shard2_replica_n6 ] o.a.s.s.IndexSchema Loaded schema minimal/1.1 with uniqueid field null
   [junit4]   2> 1914848 INFO  (qtp1818929204-30501) [n:127.0.0.1:39779_solr c:test_collection s:shard2 r:core_node8 x:test_collection_shard2_replica_n6 ] o.a.s.c.CoreContainer Creating SolrCore 'test_collection_shard2_replica_n6' using configuration from configset test, trusted=true
   [junit4]   2> 1914849 INFO  (qtp1818929204-30501) [n:127.0.0.1:39779_solr c:test_collection s:shard2 r:core_node8 x:test_collection_shard2_replica_n6 ] o.a.s.m.r.SolrJmxReporter JMX monitoring for 'solr.core.test_collection.shard2.replica_n6' (registry 'solr.core.test_collection.shard2.replica_n6') enabled at server: com.sun.jmx.mbeanserver.JmxMBeanServer@61f0e444
   [junit4]   2> 1914849 INFO  (qtp1818929204-30501) [n:127.0.0.1:39779_solr c:test_collection s:shard2 r:core_node8 x:test_collection_shard2_replica_n6 ] o.a.s.c.SolrCore [[test_collection_shard2_replica_n6] ] Opening new SolrCore at [/home/jenkins/jenkins-slave/workspace/Lucene/Lucene-Solr-BadApples-Tests-8.x/solr/build/solr-core/test/J0/temp/solr.metrics.reporters.solr.SolrCloudReportersTest_7A605020B013D9FA-001/tempDir-002/node2/test_collection_shard2_replica_n6], dataDir=[/home/jenkins/jenkins-slave/workspace/Lucene/Lucene-Solr-BadApples-Tests-8.x/solr/build/solr-core/test/J0/temp/solr.metrics.reporters.solr.SolrCloudReportersTest_7A605020B013D9FA-001/tempDir-002/node2/test_collection_shard2_replica_n6/data/]
   [junit4]   2> 1914851 INFO  (qtp1397172403-30502) [n:127.0.0.1:38221_solr c:test_collection s:shard2 r:core_node7 x:test_collection_shard2_replica_n4 ] o.a.s.s.IndexSchema Schema name=minimal
   [junit4]   2> 1914851 WARN  (qtp1397172403-30502) [n:127.0.0.1:38221_solr c:test_collection s:shard2 r:core_node7 x:test_collection_shard2_replica_n4 ] o.a.s.s.IndexSchema no uniqueKey specified in schema.
   [junit4]   2> 1914851 INFO  (qtp1397172403-30502) [n:127.0.0.1:38221_solr c:test_collection s:shard2 r:core_node7 x:test_collection_shard2_replica_n4 ] o.a.s.s.IndexSchema Loaded schema minimal/1.1 with uniqueid field null
   [junit4]   2> 1914851 INFO  (qtp1397172403-30502) [n:127.0.0.1:38221_solr c:test_collection s:shard2 r:core_node7 x:test_collection_shard2_replica_n4 ] o.a.s.c.CoreContainer Creating SolrCore 'test_collection_shard2_replica_n4' using configuration from configset test, trusted=true
   [junit4]   2> 1914851 INFO  (qtp1397172403-30502) [n:127.0.0.1:38221_solr c:test_collection s:shard2 r:core_node7 x:test_collection_shard2_replica_n4 ] o.a.s.m.r.SolrJmxReporter JMX monitoring for 'solr.core.test_collection.shard2.replica_n4' (registry 'solr.core.test_collection.shard2.replica_n4') enabled at server: com.sun.jmx.mbeanserver.JmxMBeanServer@61f0e444
   [junit4]   2> 1914852 INFO  (qtp1397172403-30502) [n:127.0.0.1:38221_solr c:test_collection s:shard2 r:core_node7 x:test_collection_shard2_replica_n4 ] o.a.s.c.SolrCore [[test_collection_shard2_replica_n4] ] Opening new SolrCore at [/home/jenkins/jenkins-slave/workspace/Lucene/Lucene-Solr-BadApples-Tests-8.x/solr/build/solr-core/test/J0/temp/solr.metrics.reporters.solr.SolrCloudReportersTest_7A605020B013D9FA-001/tempDir-002/node1/test_collection_shard2_replica_n4], dataDir=[/home/jenkins/jenkins-slave/workspace/Lucene/Lucene-Solr-BadApples-Tests-8.x/solr/build/solr-core/test/J0/temp/solr.metrics.reporters.solr.SolrCloudReportersTest_7A605020B013D9FA-001/tempDir-002/node1/test_collection_shard2_replica_n4/data/]
   [junit4]   2> 1914852 INFO  (qtp1397172403-30497) [n:127.0.0.1:38221_solr c:test_collection s:shard1 r:core_node3 x:test_collection_shard1_replica_n1 ] o.a.s.s.IndexSchema Schema name=minimal
   [junit4]   2> 1914852 WARN  (qtp1397172403-30497) [n:127.0.0.1:38221_solr c:test_collection s:shard1 r:core_node3 x:test_collection_shard1_replica_n1 ] o.a.s.s.IndexSchema no uniqueKey specified in schema.
   [junit4]   2> 1914852 INFO  (qtp1397172403-30497) [n:127.0.0.1:38221_solr c:test_collection s:shard1 r:core_node3 x:test_collection_shard1_replica_n1 ] o.a.s.s.IndexSchema Loaded schema minimal/1.1 with uniqueid field null
   [junit4]   2> 1914852 INFO  (qtp1397172403-30497) [n:127.0.0.1:38221_solr c:test_collection s:shard1 r:core_node3 x:test_collection_shard1_replica_n1 ] o.a.s.c.CoreContainer Creating SolrCore 'test_collection_shard1_replica_n1' using configuration from configset test, trusted=true
   [junit4]   2> 1914852 INFO  (qtp1397172403-30497) [n:127.0.0.1:38221_solr c:test_collection s:shard1 r:core_node3 x:test_collection_shard1_replica_n1 ] o.a.s.m.r.SolrJmxReporter JMX monitoring for 'solr.core.test_collection.shard1.replica_n1' (registry 'solr.core.test_collection.shard1.replica_n1') enabled at server: com.sun.jmx.mbeanserver.JmxMBeanServer@61f0e444
   [junit4]   2> 1914852 INFO  (qtp1397172403-30497) [n:127.0.0.1:38221_solr c:test_collection s:shard1 r:core_node3 x:test_collection_shard1_replica_n1 ] o.a.s.c.SolrCore [[test_collection_shard1_replica_n1] ] Opening new SolrCore at [/home/jenkins/jenkins-slave/workspace/Lucene/Lucene-Solr-BadApples-Tests-8.x/solr/build/solr-core/test/J0/temp/solr.metrics.reporters.solr.SolrCloudReportersTest_7A605020B013D9FA-001/tempDir-002/node1/test_collection_shard1_replica_n1], dataDir=[/home/jenkins/jenkins-slave/workspace/Lucene/Lucene-Solr-BadApples-Tests-8.x/solr/build/solr-core/test/J0/temp/solr.metrics.reporters.solr.SolrCloudReportersTest_7A605020B013D9FA-001/tempDir-002/node1/test_collection_shard1_replica_n1/data/]
   [junit4]   2> 1914885 INFO  (qtp1818929204-30494) [n:127.0.0.1:39779_solr c:test_collection s:shard1 r:core_node5 x:test_collection_shard1_replica_n2 ] o.a.s.u.CommitTracker Hard AutoCommit: disabled
   [junit4]   2> 1914885 INFO  (qtp1818929204-30494) [n:127.0.0.1:39779_solr c:test_collection s:shard1 r:core_node5 x:test_collection_shard1_replica_n2 ] o.a.s.u.CommitTracker Soft AutoCommit: disabled
   [junit4]   2> 1914887 INFO  (qtp1818929204-30494) [n:127.0.0.1:39779_solr c:test_collection s:shard1 r:core_node5 x:test_collection_shard1_replica_n2 ] o.a.s.r.ManagedResourceStorage Configured ZooKeeperStorageIO with znodeBase: /configs/test
   [junit4]   2> 1914887 INFO  (qtp1818929204-30494) [n:127.0.0.1:39779_solr c:test_collection s:shard1 r:core_node5 x:test_collection_shard1_replica_n2 ] o.a.s.r.ManagedResourceStorage Loaded null at path _rest_managed.json using ZooKeeperStorageIO:path=/configs/test
   [junit4]   2> 1914888 INFO  (qtp1818929204-30494) [n:127.0.0.1:39779_solr c:test_collection s:shard1 r:core_node5 x:test_collection_shard1_replica_n2 ] o.a.s.h.ReplicationHandler Commits will be reserved for 10000 ms
   [junit4]   2> 1914889 INFO  (qtp1818929204-30494) [n:127.0.0.1:39779_solr c:test_collection s:shard1 r:core_node5 x:test_collection_shard1_replica_n2 ] o.a.s.c.c.ZkStateReader per-replica-state ver: 14 fetched for initializing /collections/test_collection/state.json 
   [junit4]   2> 1914889 INFO  (qtp1818929204-30494) [n:127.0.0.1:39779_solr c:test_collection s:shard1 r:core_node5 x:test_collection_shard1_replica_n2 ] o.a.s.c.c.ZkStateReader already watching , added to stateWatchers
   [junit4]   2> 1914890 INFO  (qtp1818929204-30494) [n:127.0.0.1:39779_solr c:test_collection s:shard1 r:core_node5 x:test_collection_shard1_replica_n2 ] o.a.s.c.c.ZkStateReader per-replica-state ver: 14 fetched for initializing /collections/test_collection/state.json 
   [junit4]   2> 1914890 INFO  (qtp1818929204-30494) [n:127.0.0.1:39779_solr c:test_collection s:shard1 r:core_node5 x:test_collection_shard1_replica_n2 ] o.a.s.c.c.ZkStateReader per-replica-state ver: 14 fetched for initializing /collections/test_collection/state.json 
   [junit4]   2> 1914891 INFO  (qtp1818929204-30494) [n:127.0.0.1:39779_solr c:test_collection s:shard1 r:core_node5 x:test_collection_shard1_replica_n2 ] o.a.s.c.c.ZkStateReader per-replica-state ver: 14 fetched for initializing /collections/test_collection/state.json 
   [junit4]   2> 1914893 INFO  (qtp1818929204-30494) [n:127.0.0.1:39779_solr c:test_collection s:shard1 r:core_node5 x:test_collection_shard1_replica_n2 ] o.a.s.c.ZkShardTerms Successful update of terms at /collections/test_collection/terms/shard1 to Terms{values={core_node5=0}, version=0}
   [junit4]   2> 1914893 INFO  (qtp1818929204-30494) [n:127.0.0.1:39779_solr c:test_collection s:shard1 r:core_node5 x:test_collection_shard1_replica_n2 ] o.a.s.c.ShardLeaderElectionContextBase make sure parent is created /collections/test_collection/leaders/shard1
   [junit4]   2> 1914894 INFO  (searcherExecutor-19147-thread-1-processing-n:127.0.0.1:39779_solr x:test_collection_shard1_replica_n2 c:test_collection s:shard1 r:core_node5) [n:127.0.0.1:39779_solr c:test_collection s:shard1 r:core_node5 x:test_collection_shard1_replica_n2 ] o.a.s.c.SolrCore [test_collection_shard1_replica_n2]  Registered new searcher autowarm time: 0 ms
   [junit4]   2> 1914896 INFO  (qtp1818929204-30494) [n:127.0.0.1:39779_solr c:test_collection s:shard1 r:core_node5 x:test_collection_shard1_replica_n2 ] o.a.s.c.ShardLeaderElectionContext Waiting until we see more replicas up for shard shard1: total=2 found=1 timeoute in=14999ms
   [junit4]   2> 1914907 INFO  (qtp1818929204-30501) [n:127.0.0.1:39779_solr c:test_collection s:shard2 r:core_node8 x:test_collection_shard2_replica_n6 ] o.a.s.u.CommitTracker Hard AutoCommit: disabled
   [junit4]   2> 1914907 INFO  (qtp1818929204-30501) [n:127.0.0.1:39779_solr c:test_collection s:shard2 r:core_node8 x:test_collection_shard2_replica_n6 ] o.a.s.u.CommitTracker Soft AutoCommit: disabled
   [junit4]   2> 1914909 INFO  (qtp1818929204-30501) [n:127.0.0.1:39779_solr c:test_collection s:shard2 r:core_node8 x:test_collection_shard2_replica_n6 ] o.a.s.r.ManagedResourceStorage Configured ZooKeeperStorageIO with znodeBase: /configs/test
   [junit4]   2> 1914909 INFO  (qtp1818929204-30501) [n:127.0.0.1:39779_solr c:test_collection s:shard2 r:core_node8 x:test_collection_shard2_replica_n6 ] o.a.s.r.ManagedResourceStorage Loaded null at path _rest_managed.json using ZooKeeperStorageIO:path=/configs/test
   [junit4]   2> 1914909 INFO  (qtp1818929204-30501) [n:127.0.0.1:39779_solr c:test_collection s:shard2 r:core_node8 x:test_collection_shard2_replica_n6 ] o.a.s.h.ReplicationHandler Commits will be reserved for 10000 ms
   [junit4]   2> 1914910 INFO  (qtp1818929204-30501) [n:127.0.0.1:39779_solr c:test_collection s:shard2 r:core_node8 x:test_collection_shard2_replica_n6 ] o.a.s.c.c.ZkStateReader already watching , added to stateWatchers
   [junit4]   2> 1914910 INFO  (qtp1818929204-30501) [n:127.0.0.1:39779_solr c:test_collection s:shard2 r:core_node8 x:test_collection_shard2_replica_n6 ] o.a.s.c.c.ZkStateReader per-replica-state ver: 14 fetched for initializing /collections/test_collection/state.json 
   [junit4]   2> 1914911 INFO  (qtp1818929204-30501) [n:127.0.0.1:39779_solr c:test_collection s:shard2 r:core_node8 x:test_collection_shard2_replica_n6 ] o.a.s.c.c.ZkStateReader per-replica-state ver: 14 fetched for initializing /collections/test_collection/state.json 
   [junit4]   2> 1914911 INFO  (qtp1818929204-30501) [n:127.0.0.1:39779_solr c:test_collection s:shard2 r:core_node8 x:test_collection_shard2_replica_n6 ] o.a.s.c.c.ZkStateReader per-replica-state ver: 14 fetched for initializing /collections/test_collection/state.json 
   [junit4]   2> 1914913 INFO  (searcherExecutor-19149-thread-1-processing-n:127.0.0.1:39779_solr x:test_collection_shard2_replica_n6 c:test_collection s:shard2 r:core_node8) [n:127.0.0.1:39779_solr c:test_collection s:shard2 r:core_node8 x:test_collection_shard2_replica_n6 ] o.a.s.c.SolrCore [test_collection_shard2_replica_n6]  Registered new searcher autowarm time: 0 ms
   [junit4]   2> 1914914 INFO  (qtp1818929204-30501) [n:127.0.0.1:39779_solr c:test_collection s:shard2 r:core_node8 x:test_collection_shard2_replica_n6 ] o.a.s.c.ZkShardTerms Successful update of terms at /collections/test_collection/terms/shard2 to Terms{values={core_node8=0}, version=0}
   [junit4]   2> 1914914 INFO  (qtp1818929204-30501) [n:127.0.0.1:39779_solr c:test_collection s:shard2 r:core_node8 x:test_collection_shard2_replica_n6 ] o.a.s.c.ShardLeaderElectionContextBase make sure parent is created /collections/test_collection/leaders/shard2
   [junit4]   2> 1914916 INFO  (qtp1397172403-30502) [n:127.0.0.1:38221_solr c:test_collection s:shard2 r:core_node7 x:test_collection_shard2_replica_n4 ] o.a.s.u.CommitTracker Hard AutoCommit: disabled
   [junit4]   2> 1914916 INFO  (qtp1397172403-30502) [n:127.0.0.1:38221_solr c:test_collection s:shard2 r:core_node7 x:test_collection_shard2_replica_n4 ] o.a.s.u.CommitTracker Soft AutoCommit: disabled
   [junit4]   2> 1914917 INFO  (qtp1818929204-30501) [n:127.0.0.1:39779_solr c:test_collection s:shard2 r:core_node8 x:test_collection_shard2_replica_n6 ] o.a.s.c.ShardLeaderElectionContext Waiting until we see more replicas up for shard shard2: total=2 found=1 timeoute in=14999ms
   [junit4]   2> 1914918 INFO  (qtp1397172403-30502) [n:127.0.0.1:38221_solr c:test_collection s:shard2 r:core_node7 x:test_collection_shard2_replica_n4 ] o.a.s.r.ManagedResourceStorage Configured ZooKeeperStorageIO with znodeBase: /configs/test
   [junit4]   2> 1914918 INFO  (qtp1397172403-30502) [n:127.0.0.1:38221_solr c:test_collection s:shard2 r:core_node7 x:test_collection_shard2_replica_n4 ] o.a.s.r.ManagedResourceStorage Loaded null at path _rest_managed.json using ZooKeeperStorageIO:path=/configs/test
   [junit4]   2> 1914918 INFO  (qtp1397172403-30502) [n:127.0.0.1:38221_solr c:test_collection s:shard2 r:core_node7 x:test_collection_shard2_replica_n4 ] o.a.s.h.ReplicationHandler Commits will be reserved for 10000 ms
   [junit4]   2> 1914919 INFO  (qtp1397172403-30502) [n:127.0.0.1:38221_solr c:test_collection s:shard2 r:core_node7 x:test_collection_shard2_replica_n4 ] o.a.s.c.c.ZkStateReader per-replica-state ver: 14 fetched for initializing /collections/test_collection/state.json 
   [junit4]   2> 1914920 INFO  (qtp1397172403-30502) [n:127.0.0.1:38221_solr c:test_collection s:shard2 r:core_node7 x:test_collection_shard2_replica_n4 ] o.a.s.c.c.ZkStateReader already watching , added to stateWatchers
   [junit4]   2> 1914920 INFO  (qtp1397172403-30502) [n:127.0.0.1:38221_solr c:test_collection s:shard2 r:core_node7 x:test_collection_shard2_replica_n4 ] o.a.s.c.c.ZkStateReader per-replica-state ver: 14 fetched for initializing /collections/test_collection/state.json 
   [junit4]   2> 1914921 INFO  (searcherExecutor-19151-thread-1-processing-n:127.0.0.1:38221_solr x:test_collection_shard2_replica_n4 c:test_collection s:shard2 r:core_node7) [n:127.0.0.1:38221_solr c:test_collection s:shard2 r:core_node7 x:test_collection_shard2_replica_n4 ] o.a.s.c.SolrCore [test_collection_shard2_replica_n4]  Registered new searcher autowarm time: 0 ms
   [junit4]   2> 1914921 INFO  (qtp1397172403-30502) [n:127.0.0.1:38221_solr c:test_collection s:shard2 r:core_node7 x:test_collection_shard2_replica_n4 ] o.a.s.c.c.ZkStateReader per-replica-state ver: 14 fetched for initializing /collections/test_collection/state.json 
   [junit4]   2> 1914922 INFO  (qtp1397172403-30502) [n:127.0.0.1:38221_solr c:test_collection s:shard2 r:core_node7 x:test_collection_shard2_replica_n4 ] o.a.s.c.c.ZkStateReader per-replica-state ver: 14 fetched for initializing /collections/test_collection/state.json 
   [junit4]   2> 1914945 INFO  (qtp1397172403-30502) [n:127.0.0.1:38221_solr c:test_collection s:shard2 r:core_node7 x:test_collection_shard2_replica_n4 ] o.a.s.c.ZkShardTerms Successful update of terms at /collections/test_collection/terms/shard2 to Terms{values={core_node7=0, core_node8=0}, version=1}
   [junit4]   2> 1914946 INFO  (qtp1397172403-30502) [n:127.0.0.1:38221_solr c:test_collection s:shard2 r:core_node7 x:test_collection_shard2_replica_n4 ] o.a.s.c.ShardLeaderElectionContextBase make sure parent is created /collections/test_collection/leaders/shard2
   [junit4]   2> 1914950 INFO  (qtp1397172403-30497) [n:127.0.0.1:38221_solr c:test_collection s:shard1 r:core_node3 x:test_collection_shard1_replica_n1 ] o.a.s.u.CommitTracker Hard AutoCommit: disabled
   [junit4]   2> 1914950 INFO  (qtp1397172403-30497) [n:127.0.0.1:38221_solr c:test_collection s:shard1 r:core_node3 x:test_collection_shard1_replica_n1 ] o.a.s.u.CommitTracker Soft AutoCommit: disabled
   [junit4]   2> 1914952 INFO  (qtp1397172403-30497) [n:127.0.0.1:38221_solr c:test_collection s:shard1 r:core_node3 x:test_collection_shard1_replica_n1 ] o.a.s.r.ManagedResourceStorage Configured ZooKeeperStorageIO with znodeBase: /configs/test
   [junit4]   2> 1914952 INFO  (qtp1397172403-30497) [n:127.0.0.1:38221_solr c:test_collection s:shard1 r:core_node3 x:test_collection_shard1_replica_n1 ] o.a.s.r.ManagedResourceStorage Loaded null at path _rest_managed.json using ZooKeeperStorageIO:path=/configs/test
   [junit4]   2> 1914952 INFO  (qtp1397172403-30497) [n:127.0.0.1:38221_solr c:test_collection s:shard1 r:core_node3 x:test_collection_shard1_replica_n1 ] o.a.s.h.ReplicationHandler Commits will be reserved for 10000 ms
   [junit4]   2> 1914953 INFO  (qtp1397172403-30497) [n:127.0.0.1:38221_solr c:test_collection s:shard1 r:core_node3 x:test_collection_shard1_replica_n1 ] o.a.s.c.c.ZkStateReader already watching , added to stateWatchers
   [junit4]   2> 1914954 INFO  (qtp1397172403-30497) [n:127.0.0.1:38221_solr c:test_collection s:shard1 r:core_node3 x:test_collection_shard1_replica_n1 ] o.a.s.c.c.ZkStateReader per-replica-state ver: 14 fetched for initializing /collections/test_collection/state.json 
   [junit4]   2> 1914954 INFO  (searcherExecutor-19153-thread-1-processing-n:127.0.0.1:38221_solr x:test_collection_shard1_replica_n1 c:test_collection s:shard1 r:core_node3) [n:127.0.0.1:38221_solr c:test_collection s:shard1 r:core_node3 x:test_collection_shard1_replica_n1 ] o.a.s.c.SolrCore [test_collection_shard1_replica_n1]  Registered new searcher autowarm time: 0 ms
   [junit4]   2> 1914954 INFO  (qtp1397172403-30497) [n:127.0.0.1:38221_solr c:test_collection s:shard1 r:core_node3 x:test_collection_shard1_replica_n1 ] o.a.s.c.c.ZkStateReader per-replica-state ver: 14 fetched for initializing /collections/test_collection/state.json 
   [junit4]   2> 1914955 INFO  (qtp1397172403-30497) [n:127.0.0.1:38221_solr c:test_collection s:shard1 r:core_node3 x:test_collection_shard1_replica_n1 ] o.a.s.c.c.ZkStateReader per-replica-state ver: 14 fetched for initializing /collections/test_collection/state.json 
   [junit4]   2> 1914957 INFO  (qtp1397172403-30497) [n:127.0.0.1:38221_solr c:test_collection s:shard1 r:core_node3 x:test_collection_shard1_replica_n1 ] o.a.s.c.ZkShardTerms Successful update of terms at /collections/test_collection/terms/shard1 to Terms{values={core_node3=0, core_node5=0}, version=1}
   [junit4]   2> 1914957 INFO  (qtp1397172403-30497) [n:127.0.0.1:38221_solr c:test_collection s:shard1 r:core_node3 x:test_collection_shard1_replica_n1 ] o.a.s.c.ShardLeaderElectionContextBase make sure parent is created /collections/test_collection/leaders/shard1
   [junit4]   2> 1915397 INFO  (qtp1818929204-30494) [n:127.0.0.1:39779_solr c:test_collection s:shard1 r:core_node5 x:test_collection_shard1_replica_n2 ] o.a.s.c.ShardLeaderElectionContext Enough replicas found to continue.
   [junit4]   2> 1915397 INFO  (qtp1818929204-30494) [n:127.0.0.1:39779_solr c:test_collection s:shard1 r:core_node5 x:test_collection_shard1_replica_n2 ] o.a.s.c.ShardLeaderElectionContext I may be the new leader - try and sync
   [junit4]   2> 1915397 INFO  (qtp1818929204-30494) [n:127.0.0.1:39779_solr c:test_collection s:shard1 r:core_node5 x:test_collection_shard1_replica_n2 ] o.a.s.c.SyncStrategy Sync replicas to http://127.0.0.1:39779/solr/test_collection_shard1_replica_n2/
   [junit4]   2> 1915397 ERROR (qtp1818929204-30494) [n:127.0.0.1:39779_solr c:test_collection s:shard1 r:core_node5 x:test_collection_shard1_replica_n2 ] o.a.s.c.SyncStrategy No UpdateLog found - cannot sync
   [junit4]   2> 1915397 INFO  (qtp1818929204-30494) [n:127.0.0.1:39779_solr c:test_collection s:shard1 r:core_node5 x:test_collection_shard1_replica_n2 ] o.a.s.c.ShardLeaderElectionContext We failed sync, but we have no versions - we can't sync in that case - we were active before, so become leader anyway
   [junit4]   2> 1915397 INFO  (qtp1818929204-30494) [n:127.0.0.1:39779_solr c:test_collection s:shard1 r:core_node5 x:test_collection_shard1_replica_n2 ] o.a.s.c.ShardLeaderElectionContextBase Creating leader registration node /collections/test_collection/leaders/shard1/leader after winning as /collections/test_collection/leader_elect/shard1/election/72964887248764936-core_node5-n_0000000000
   [junit4]   2> 1915399 INFO  (qtp1818929204-30494) [n:127.0.0.1:39779_solr c:test_collection s:shard1 r:core_node5 x:test_collection_shard1_replica_n2 ] o.a.s.c.ShardLeaderElectionContext I am the new leader: http://127.0.0.1:39779/solr/test_collection_shard1_replica_n2/ shard1
   [junit4]   2> 1915399 INFO  (qtp1818929204-30494) [n:127.0.0.1:39779_solr c:test_collection s:shard1 r:core_node5 x:test_collection_shard1_replica_n2 ] o.a.s.c.c.ZkStateReader already watching , added to stateWatchers
   [junit4]   2> 1915400 INFO  (qtp1818929204-30494) [n:127.0.0.1:39779_solr c:test_collection s:shard1 r:core_node5 x:test_collection_shard1_replica_n2 ] o.a.s.c.c.ZkStateReader per-replica-state ver: 16 fetched for initializing /collections/test_collection/state.json 
   [junit4]   2> 1915401 INFO  (qtp1818929204-30494) [n:127.0.0.1:39779_solr c:test_collection s:shard1 r:core_node5 x:test_collection_shard1_replica_n2 ] o.a.s.c.c.ZkStateReader per-replica-state ver: 16 fetched for initializing /collections/test_collection/state.json 
   [junit4]   2> 1915401 INFO  (qtp1818929204-30494) [n:127.0.0.1:39779_solr c:test_collection s:shard1 r:core_node5 x:test_collection_shard1_replica_n2 ] o.a.s.c.c.ZkStateReader per-replica-state ver: 16 fetched for initializing /collections/test_collection/state.json 
   [junit4]   2> 1915402 INFO  (qtp1818929204-30494) [n:127.0.0.1:39779_solr c:test_collection s:shard1 r:core_node5 x:test_collection_shard1_replica_n2 ] o.a.s.c.ZkController I am the leader, no recovery necessary
   [junit4]   2> 1915404 INFO  (qtp1818929204-30494) [n:127.0.0.1:39779_solr c:test_collection s:shard1 r:core_node5 x:test_collection_shard1_replica_n2 ] o.a.s.c.c.ZkStateReader per-replica-state ver: 18 fetched for initializing /collections/test_collection/state.json 
   [junit4]   2> 1915404 INFO  (qtp1818929204-30494) [n:127.0.0.1:39779_solr c:test_collection s:shard1 r:core_node5 x:test_collection_shard1_replica_n2 ] o.a.s.c.c.ZkStateReader already watching , added to stateWatchers
   [junit4]   2> 1915404 INFO  (qtp1818929204-30494) [n:127.0.0.1:39779_solr c:test_collection s:shard1 r:core_node5 x:test_collection_shard1_replica_n2 ] o.a.s.c.c.ZkStateReader per-replica-state ver: 18 fetched for initializing /collections/test_collection/state.json 
   [junit4]   2> 1915405 INFO  (qtp1818929204-30494) [n:127.0.0.1:39779_solr c:test_collection s:shard1 r:core_node5 x:test_collection_shard1_replica_n2 ] o.a.s.c.c.ZkStateReader per-replica-state ver: 18 fetched for initializing /collections/test_collection/state.json 
   [junit4]   2> 1915408 INFO  (qtp1818929204-30494) [n:127.0.0.1:39779_solr     ] o.a.s.s.HttpSolrCall [admin] webapp=null path=/admin/cores params={qt=/admin/cores&coreNodeName=core_node5&collection.configName=test&newCollection=true&name=test_collection_shard1_replica_n2&action=CREATE&numShards=2&collection=test_collection&shard=shard1&wt=javabin&version=2&replicaType=NRT} status=0 QTime=602
   [junit4]   2> 1915418 INFO  (qtp1818929204-30501) [n:127.0.0.1:39779_solr c:test_collection s:shard2 r:core_node8 x:test_collection_shard2_replica_n6 ] o.a.s.c.ShardLeaderElectionContext Enough replicas found to continue.
   [junit4]   2> 1915418 INFO  (qtp1818929204-30501) [n:127.0.0.1:39779_solr c:test_collection s:shard2 r:core_node8 x:test_collection_shard2_replica_n6 ] o.a.s.c.ShardLeaderElectionContext I may be the new leader - try and sync
   [junit4]   2> 1915418 INFO  (qtp1818929204-30501) [n:127.0.0.1:39779_solr c:test_collection s:shard2 r:core_node8 x:test_collection_shard2_replica_n6 ] o.a.s.c.SyncStrategy Sync replicas to http://127.0.0.1:39779/solr/test_collection_shard2_replica_n6/
   [junit4]   2> 1915418 ERROR (qtp1818929204-30501) [n:127.0.0.1:39779_solr c:test_collection s:shard2 r:core_node8 x:test_collection_shard2_replica_n6 ] o.a.s.c.SyncStrategy No UpdateLog found - cannot sync
   [junit4]   2> 1915418 INFO  (qtp1818929204-30501) [n:127.0.0.1:39779_solr c:test_collection s:shard2 r:core_node8 x:test_collection_shard2_replica_n6 ] o.a.s.c.ShardLeaderElectionContext We failed sync, but we have no versions - we can't sync in that case - we were active before, so become leader anyway
   [junit4]   2> 1915418 INFO  (qtp1818929204-30501) [n:127.0.0.1:39779_solr c:test_collection s:shard2 r:core_node8 x:test_collection_shard2_replica_n6 ] o.a.s.c.ShardLeaderElectionContextBase Creating leader registration node /collections/test_collection/leaders/shard2/leader after winning as /collections/test_collection/leader_elect/shard2/election/72964887248764936-core_node8-n_0000000000
   [junit4]   2> 1915419 INFO  (qtp1818929204-30501) [n:127.0.0.1:39779_solr c:test_collection s:shard2 r:core_node8 x:test_collection_shard2_replica_n6 ] o.a.s.c.ShardLeaderElectionContext I am the new leader: http://127.0.0.1:39779/solr/test_collection_shard2_replica_n6/ shard2
   [junit4]   2> 1915419 INFO  (zkCallback-19129-thread-2) [     ] o.a.s.c.c.ZkStateReader A cluster state change: [WatchedEvent state:SyncConnected type:NodeChildrenChanged path:/collections/test_collection/state.json] for collection [test_collection] has occurred - updating... (live nodes size: [2])
   [junit4]   2> 1915420 INFO  (qtp1818929204-30501) [n:127.0.0.1:39779_solr c:test_collection s:shard2 r:core_node8 x:test_collection_shard2_replica_n6 ] o.a.s.c.c.ZkStateReader already watching , added to stateWatchers
   [junit4]   2> 1915421 INFO  (qtp1818929204-30501) [n:127.0.0.1:39779_solr c:test_collection s:shard2 r:core_node8 x:test_collection_shard2_replica_n6 ] o.a.s.c.ZkController I am the leader, no recovery necessary
   [junit4]   2> 1915424 INFO  (zkCallback-19129-thread-2) [     ] o.a.s.c.c.ZkStateReader A cluster state change: [WatchedEvent state:SyncConnected type:NodeChildrenChanged path:/collections/test_collection/state.json] for collection [test_collection] has occurred - updating... (live nodes size: [2])
   [junit4]   2> 1915424 INFO  (qtp1818929204-30501) [n:127.0.0.1:39779_solr c:test_collection s:shard2 r:core_node8 x:test_collection_shard2_replica_n6 ] o.a.s.c.c.ZkStateReader per-replica-state ver: 22 fetched for initializing /collections/test_collection/state.json 
   [junit4]   2> 1915425 INFO  (qtp1818929204-30501) [n:127.0.0.1:39779_solr c:test_collection s:shard2 r:core_node8 x:test_collection_shard2_replica_n6 ] o.a.s.c.c.ZkStateReader already watching , added to stateWatchers
   [junit4]   2> 1915425 INFO  (qtp1818929204-30501) [n:127.0.0.1:39779_solr     ] o.a.s.s.HttpSolrCall [admin] webapp=null path=/admin/cores params={qt=/admin/cores&coreNodeName=core_node8&collection.configName=test&newCollection=true&name=test_collection_shard2_replica_n6&action=CREATE&numShards=2&collection=test_collection&shard=shard2&wt=javabin&version=2&replicaType=NRT} status=0 QTime=621
   [junit4]   2> 1915948 INFO  (qtp1397172403-30502) [n:127.0.0.1:38221_solr c:test_collection s:shard2 r:core_node7 x:test_collection_shard2_replica_n4 ] o.a.s.c.c.ZkStateReader already watching , added to stateWatchers
   [junit4]   2> 1915948 INFO  (qtp1397172403-30502) [n:127.0.0.1:38221_solr c:test_collection s:shard2 r:core_node7 x:test_collection_shard2_replica_n4 ] o.a.s.c.c.ZkStateReader per-replica-state ver: 22 fetched for initializing /collections/test_collection/state.json 
   [junit4]   2> 1915949 INFO  (qtp1397172403-30502) [n:127.0.0.1:38221_solr c:test_collection s:shard2 r:core_node7 x:test_collection_shard2_replica_n4 ] o.a.s.c.c.ZkStateReader per-replica-state ver: 22 fetched for initializing /collections/test_collection/state.json 
   [junit4]   2> 1915949 INFO  (qtp1397172403-30502) [n:127.0.0.1:38221_solr c:test_collection s:shard2 r:core_node7 x:test_collection_shard2_replica_n4 ] o.a.s.c.c.ZkStateReader per-replica-state ver: 22 fetched for initializing /collections/test_collection/state.json 
   [junit4]   2> 1915951 INFO  (zkCallback-19129-thread-2) [     ] o.a.s.c.c.ZkStateReader A cluster state change: [WatchedEvent state:SyncConnected type:NodeChildrenChanged path:/collections/test_collection/state.json] for collection [test_collection] has occurred - updating... (live nodes size: [2])
   [junit4]   2> 1915952 INFO  (qtp1397172403-30502) [n:127.0.0.1:38221_solr c:test_collection s:shard2 r:core_node7 x:test_collection_shard2_replica_n4 ] o.a.s.c.c.ZkStateReader per-replica-state ver: 24 fetched for initializing /collections/test_collection/state.json 
   [junit4]   2> 1915952 INFO  (qtp1397172403-30502) [n:127.0.0.1:38221_solr c:test_collection s:shard2 r:core_node7 x:test_collection_shard2_replica_n4 ] o.a.s.c.c.ZkStateReader already watching , added to stateWatchers
   [junit4]   2> 1915953 INFO  (qtp1397172403-30502) [n:127.0.0.1:38221_solr c:test_collection s:shard2 r:core_node7 x:test_collection_shard2_replica_n4 ] o.a.s.c.c.ZkStateReader per-replica-state ver: 24 fetched for initializing /collections/test_collection/state.json 
   [junit4]   2> 1915953 INFO  (qtp1397172403-30502) [n:127.0.0.1:38221_solr c:test_collection s:shard2 r:core_node7 x:test_collection_shard2_replica_n4 ] o.a.s.c.c.ZkStateReader per-replica-state ver: 24 fetched for initializing /collections/test_collection/state.json 
   [junit4]   2> 1915954 INFO  (qtp1397172403-30502) [n:127.0.0.1:38221_solr     ] o.a.s.s.HttpSolrCall [admin] webapp=null path=/admin/cores params={qt=/admin/cores&coreNodeName=core_node7&collection.configName=test&newCollection=true&name=test_collection_shard2_replica_n4&action=CREATE&numShards=2&collection=test_collection&shard=shard2&wt=javabin&version=2&replicaType=NRT} status=0 QTime=1149
   [junit4]   2> 1915959 INFO  (qtp1397172403-30497) [n:127.0.0.1:38221_solr c:test_collection s:shard1 r:core_node3 x:test_collection_shard1_replica_n1 ] o.a.s.c.c.ZkStateReader already watching , added to stateWatchers
   [junit4]   2> 1915960 INFO  (zkCallback-19129-thread-2) [     ] o.a.s.c.c.ZkStateReader A cluster state change: [WatchedEvent state:SyncConnected type:NodeChildrenChanged path:/collections/test_collection/state.json] for collection [test_collection] has occurred - updating... (live nodes size: [2])
   [junit4]   2> 1915960 INFO  (zkCallback-19107-thread-2) [     ] o.a.s.c.c.ZkStateReader A cluster state change: [WatchedEvent state:SyncConnected type:NodeChildrenChanged path:/collections/test_collection/state.json] for collection [test_collection] has occurred - updating... (live nodes size: [2])
   [junit4]   2> 1915960 INFO  (qtp1397172403-30497) [n:127.0.0.1:38221_solr c:test_collection s:shard1 r:core_node3 x:test_collection_shard1_replica_n1 ] o.a.s.c.c.ZkStateReader per-replica-state ver: 26 fetched for initializing /collections/test_collection/state.json 
   [junit4]   2> 1915960 INFO  (qtp1397172403-30497) [n:127.0.0.1:38221_solr c:test_collection s:shard1 r:core_node3 x:test_collection_shard1_replica_n1 ] o.a.s.c.c.ZkStateReader already watching , added to stateWatchers
   [junit4]   2> 1915961 INFO  (qtp1397172403-30497) [n:127.0.0.1:38221_solr     ] o.a.s.s.HttpSolrCall [admin] webapp=null path=/admin/cores params={qt=/admin/cores&coreNodeName=core_node3&collection.configName=test&newCollection=true&name=test_collection_shard1_replica_n1&action=CREATE&numShards=2&collection=test_collection&shard=shard1&wt=javabin&version=2&replicaType=NRT} status=0 QTime=1156
   [junit4]   2> 1915963 INFO  (qtp1818929204-30496) [n:127.0.0.1:39779_solr     ] o.a.s.h.a.CollectionsHandler Wait for new collection to be active for at most 45 seconds. Check all shard replicas
   [junit4]   2> 1915963 INFO  (qtp1818929204-30496) [n:127.0.0.1:39779_solr     ] o.a.s.c.c.ZkStateReader already watching , added to stateWatchers
   [junit4]   2> 1915964 INFO  (qtp1818929204-30496) [n:127.0.0.1:39779_solr     ] o.a.s.s.HttpSolrCall [admin] webapp=null path=/admin/collections params={collection.configName=test&maxShardsPerNode=4&name=test_collection&nrtReplicas=2&action=CREATE&numShards=2&perReplicaState=true&wt=javabin&version=2} status=0 QTime=1383
   [junit4]   2> 1915964 INFO  (TEST-SolrCloudReportersTest.testDefaultPlugins-seed#[7A605020B013D9FA]) [     ] o.a.s.c.MiniSolrCloudCluster waitForActiveCollection: test_collection
   [junit4]   2> 1915964 INFO  (TEST-SolrCloudReportersTest.testDefaultPlugins-seed#[7A605020B013D9FA]) [     ] o.a.s.c.c.ZkStateReader already watching , added to stateWatchers
   [junit4]   2> 1915965 INFO  (TEST-SolrCloudReportersTest.testDefaultPlugins-seed#[7A605020B013D9FA]) [     ] o.a.s.c.c.ZkStateReader per-replica-state ver: 26 fetched for initializing /collections/test_collection/state.json 
   [junit4]   2> 1915965 INFO  (TEST-SolrCloudReportersTest.testDefaultPlugins-seed#[7A605020B013D9FA]) [     ] o.a.s.c.c.ZkStateReader per-replica-state ver: 26 fetched for initializing /collections/test_collection/state.json 
   [junit4]   2> 1915966 INFO  (TEST-SolrCloudReportersTest.testDefaultPlugins-seed#[7A605020B013D9FA]) [     ] o.a.s.c.c.ZkStateReader per-replica-state ver: 26 fetched for initializing /collections/test_collection/state.json 
   [junit4]   2> 1915967 INFO  (TEST-SolrCloudReportersTest.testDefaultPlugins-seed#[7A605020B013D9FA]) [     ] o.a.s.c.SolrCloudTestCase waitForState (test_collection): Expected test_collection with 2 shards and 2 replicas
   [junit4]   2> 1915967 INFO  (TEST-SolrCloudReportersTest.testDefaultPlugins-seed#[7A605020B013D9FA]) [     ] o.a.s.c.c.ZkStateReader already watching , added to stateWatchers
   [junit4]   2> 1915967 INFO  (TEST-SolrCloudReportersTest.testDefaultPlugins-seed#[7A605020B013D9FA]) [     ] o.a.s.c.c.ZkStateReader per-replica-state ver: 26 fetched for initializing /collections/test_collection/state.json 
   [junit4]   2> 1915967 INFO  (watches-19140-thread-1) [     ] o.a.s.c.SolrCloudTestCase active replica count: 4 expected replica count: 4
   [junit4]   2> 1915968 INFO  (TEST-SolrCloudReportersTest.testDefaultPlugins-seed#[7A605020B013D9FA]) [     ] o.a.s.c.c.ZkStateReader per-replica-state ver: 26 fetched for initializing /collections/test_collection/state.json 
   [junit4]   2> 1915968 INFO  (TEST-SolrCloudReportersTest.testDefaultPlugins-seed#[7A605020B013D9FA]) [     ] o.a.s.c.c.ZkStateReader per-replica-state ver: 26 fetched for initializing /collections/test_collection/state.json 
   [junit4]   2> 1915969 INFO  (TEST-SolrCloudReportersTest.testDefaultPlugins-seed#[7A605020B013D9FA]) [     ] o.a.s.c.SolrCloudTestCase active replica count: 4 expected replica count: 4
   [junit4]   2> 1915969 INFO  (TEST-SolrCloudReportersTest.testDefaultPlugins-seed#[7A605020B013D9FA]) [     ] o.a.s.c.SolrCloudTestCase active replica count: 4 expected replica count: 4
   [junit4]   2> 1915969 INFO  (TEST-SolrCloudReportersTest.testDefaultPlugins-seed#[7A605020B013D9FA]) [     ] o.a.s.c.SolrCloudTestCase active replica count: 4 expected replica count: 4
   [junit4]   2> 1915971 INFO  (TEST-SolrCloudReportersTest.testDefaultPlugins-seed#[7A605020B013D9FA]) [     ] o.a.s.SolrTestCaseJ4 ###Ending testDefaultPlugins
   [junit4]   2> 1915996 INFO  (TEST-SolrCloudReportersTest.testExplicitConfiguration-seed#[7A605020B013D9FA]) [     ] o.a.s.SolrTestCaseJ4 ###Starting testExplicitConfiguration
   [junit4]   2> 1916098 INFO  (jetty-closer-19166-thread-1) [     ] o.a.s.c.CoreContainer Shutting down CoreContainer instance=2025351346
   [junit4]   2> 1916098 INFO  (jetty-closer-19166-thread-1) [     ] o.a.s.c.ZkController Remove node as live in ZooKeeper:/live_nodes/127.0.0.1:38221_solr
   [junit4]   2> 1916098 INFO  (jetty-closer-19166-thread-1) [     ] o.a.s.c.ZkController Publish this node as DOWN...
   [junit4]   2> 1916098 INFO  (jetty-closer-19166-thread-1) [     ] o.a.s.c.ZkController Publish node=127.0.0.1:38221_solr as DOWN
   [junit4]   2> 1916101 INFO  (coreCloseExecutor-19171-thread-1) [n:127.0.0.1:38221_solr     ] o.a.s.c.SolrCore [test_collection_shard2_replica_n4]  CLOSING SolrCore org.apache.solr.core.SolrCore@300892a5
   [junit4]   2> 1916101 INFO  (coreCloseExecutor-19171-thread-1) [n:127.0.0.1:38221_solr     ] o.a.s.m.SolrMetricManager Closing metric reporters for registry=solr.core.test_collection.shard2.replica_n4 tag=SolrCore@300892a5
   [junit4]   2> 1916101 INFO  (coreCloseExecutor-19171-thread-1) [n:127.0.0.1:38221_solr     ] o.a.s.m.r.SolrJmxReporter Closing reporter [org.apache.solr.metrics.reporters.SolrJmxReporter@6a8aeab2: rootName = null, domain = solr.core.test_collection.shard2.replica_n4, service url = null, agent id = null] for registry solr.core.test_collection.shard2.replica_n4/com.codahale.metrics.MetricRegistry@5fb9187
   [junit4]   2> 1916102 INFO  (jetty-closer-19166-thread-2) [     ] o.a.s.c.CoreContainer Shutting down CoreContainer instance=1928237631
   [junit4]   2> 1916103 INFO  (jetty-closer-19166-thread-2) [     ] o.a.s.c.ZkController Remove node as live in ZooKeeper:/live_nodes/127.0.0.1:39779_solr
   [junit4]   2> 1916103 INFO  (coreCloseExecutor-19171-thread-2) [n:127.0.0.1:38221_solr     ] o.a.s.c.SolrCore [test_collection_shard1_replica_n1]  CLOSING SolrCore org.apache.solr.core.SolrCore@29459432
   [junit4]   2> 1916103 INFO  (jetty-closer-19166-thread-2) [     ] o.a.s.c.ZkController Publish this node as DOWN...
   [junit4]   2> 1916103 INFO  (jetty-closer-19166-thread-2) [     ] o.a.s.c.ZkController Publish node=127.0.0.1:39779_solr as DOWN
   [junit4]   2> 1916105 INFO  (zkCallback-19107-thread-2) [     ] o.a.s.c.c.ZkStateReader A cluster state change: [WatchedEvent state:SyncConnected type:NodeChildrenChanged path:/collections/test_collection/state.json] for collection [test_collection] has occurred - updating... (live nodes size: [2])
   [junit4]   2> 1916105 INFO  (zkCallback-19129-thread-2) [     ] o.a.s.c.c.ZkStateReader A cluster state change: [WatchedEvent state:SyncConnected type:NodeChildrenChanged path:/collections/test_collection/state.json] for collection [test_collection] has occurred - updating... (live nodes size: [2])
   [junit4]   2> 1916108 INFO  (coreCloseExecutor-19174-thread-1) [n:127.0.0.1:39779_solr     ] o.a.s.c.SolrCore [test_collection_shard1_replica_n2]  CLOSING SolrCore org.apache.solr.core.SolrCore@7d18fa9a
   [junit4]   2> 1916108 INFO  (coreCloseExecutor-19174-thread-1) [n:127.0.0.1:39779_solr     ] o.a.s.m.SolrMetricManager Closing metric reporters for registry=solr.core

[...truncated too long message...]

lientCnxnSocketNIO.doIO(ClientCnxnSocketNIO.java:77)
   [junit4]   2> org.apache.zookeeper.ClientCnxn$EndOfStreamException: Unable to read additional data from server sessionid 0x103392dba8b0008, likely server has closed socket
   [junit4]   2> 	at org.apache.zookeeper.ClientCnxnSocketNIO.doIO(ClientCnxnSocketNIO.java:77) ~[zookeeper-3.6.2.jar:3.6.2]
   [junit4]   2> 	at org.apache.zookeeper.ClientCnxnSocketNIO.doTransport(ClientCnxnSocketNIO.java:350) ~[zookeeper-3.6.2.jar:3.6.2]
   [junit4]   2> 	at org.apache.zookeeper.ClientCnxn$SendThread.run(ClientCnxn.java:1275) [zookeeper-3.6.2.jar:3.6.2]
   [junit4]   2> 2009076 INFO  (jetty-closer-19263-thread-2) [     ] o.e.j.s.AbstractConnector Stopped ServerConnector@54e06e9e{HTTP/1.1, (http/1.1, h2c)}{127.0.0.1:0}
   [junit4]   2> 2009076 INFO  (jetty-closer-19263-thread-2) [     ] o.e.j.s.h.ContextHandler Stopped o.e.j.s.ServletContextHandler@2668d233{/solr,null,STOPPED}
   [junit4]   2> 2009076 INFO  (jetty-closer-19263-thread-2) [     ] o.e.j.s.session node0 Stopped scavenging
   [junit4]   2> 2009077 INFO  (SUITE-SolrCloudReportersTest-seed#[7A605020B013D9FA]-worker) [     ] o.a.s.c.ZkTestServer Shutting down ZkTestServer.
   [junit4]   2> 2009077 WARN  (TEST-SolrCloudReportersTest.testExplicitConfiguration-seed#[7A605020B013D9FA]-SendThread(127.0.0.1:32779)) [     ] o.a.z.ClientCnxn An exception was thrown while closing send thread for session 0x103392dba8b0000.
   [junit4]   2>           => EndOfStreamException: Unable to read additional data from server sessionid 0x103392dba8b0000, likely server has closed socket
   [junit4]   2> 	at org.apache.zookeeper.ClientCnxnSocketNIO.doIO(ClientCnxnSocketNIO.java:77)
   [junit4]   2> org.apache.zookeeper.ClientCnxn$EndOfStreamException: Unable to read additional data from server sessionid 0x103392dba8b0000, likely server has closed socket
   [junit4]   2> 	at org.apache.zookeeper.ClientCnxnSocketNIO.doIO(ClientCnxnSocketNIO.java:77) ~[zookeeper-3.6.2.jar:3.6.2]
   [junit4]   2> 	at org.apache.zookeeper.ClientCnxnSocketNIO.doTransport(ClientCnxnSocketNIO.java:350) ~[zookeeper-3.6.2.jar:3.6.2]
   [junit4]   2> 	at org.apache.zookeeper.ClientCnxn$SendThread.run(ClientCnxn.java:1275) [zookeeper-3.6.2.jar:3.6.2]
   [junit4]   2> 2009334 WARN  (TEST-SolrCloudReportersTest.testExplicitConfiguration-seed#[7A605020B013D9FA]-SendThread(127.0.0.1:32779)) [     ] o.a.z.ClientCnxn An exception was thrown while closing send thread for session 0x103392dba8b0001.
   [junit4]   2>           => EndOfStreamException: Unable to read additional data from server sessionid 0x103392dba8b0001, likely server has closed socket
   [junit4]   2> 	at org.apache.zookeeper.ClientCnxnSocketNIO.doIO(ClientCnxnSocketNIO.java:77)
   [junit4]   2> org.apache.zookeeper.ClientCnxn$EndOfStreamException: Unable to read additional data from server sessionid 0x103392dba8b0001, likely server has closed socket
   [junit4]   2> 	at org.apache.zookeeper.ClientCnxnSocketNIO.doIO(ClientCnxnSocketNIO.java:77) ~[zookeeper-3.6.2.jar:3.6.2]
   [junit4]   2> 	at org.apache.zookeeper.ClientCnxnSocketNIO.doTransport(ClientCnxnSocketNIO.java:350) ~[zookeeper-3.6.2.jar:3.6.2]
   [junit4]   2> 	at org.apache.zookeeper.ClientCnxn$SendThread.run(ClientCnxn.java:1275) [zookeeper-3.6.2.jar:3.6.2]
   [junit4]   2> 2009436 WARN  (ZkTestServer Run Thread) [     ] o.a.s.c.ZkTestServer Watch limit violations: 
   [junit4]   2> Maximum concurrent create/delete watches above limit:
   [junit4]   2> 
   [junit4]   2> 	6	/solr/collections/test_collection/terms/shard2
   [junit4]   2> 	6	/solr/collections/test_collection/terms/shard1
   [junit4]   2> 	4	/solr/collections/test_collection/state.json
   [junit4]   2> 	3	/solr/aliases.json
   [junit4]   2> 	3	/solr/clusterprops.json
   [junit4]   2> 	2	/solr/configs/test
   [junit4]   2> 	2	/solr/packages.json
   [junit4]   2> 	2	/solr/security.json
   [junit4]   2> 
   [junit4]   2> Maximum concurrent data watches above limit:
   [junit4]   2> 
   [junit4]   2> 	8	/solr/collections/test_collection/state.json
   [junit4]   2> 	3	/solr/clusterstate.json
   [junit4]   2> 
   [junit4]   2> Maximum concurrent children watches above limit:
   [junit4]   2> 
   [junit4]   2> 	18	/solr/overseer/queue
   [junit4]   2> 	13	/solr/collections/test_collection/state.json
   [junit4]   2> 	7	/solr/live_nodes
   [junit4]   2> 	7	/solr/collections
   [junit4]   2> 	3	/solr/overseer/collection-queue-work
   [junit4]   2> 
   [junit4]   2> 2009439 INFO  (SUITE-SolrCloudReportersTest-seed#[7A605020B013D9FA]-worker) [     ] o.a.s.c.ZkTestServer waitForServerDown: 127.0.0.1:32779
   [junit4]   2> 2009439 INFO  (SUITE-SolrCloudReportersTest-seed#[7A605020B013D9FA]-worker) [     ] o.a.s.c.ZkTestServer parse host and port list: 127.0.0.1:32779
   [junit4]   2> 2009439 INFO  (SUITE-SolrCloudReportersTest-seed#[7A605020B013D9FA]-worker) [     ] o.a.s.c.ZkTestServer connecting to 127.0.0.1 32779
   [junit4]   2> NOTE: leaving temporary files on disk at: /home/jenkins/jenkins-slave/workspace/Lucene/Lucene-Solr-BadApples-Tests-8.x/solr/build/solr-core/test/J0/temp/solr.metrics.reporters.solr.SolrCloudReportersTest_7A605020B013D9FA-001
   [junit4]   2> NOTE: test params are: codec=Asserting(Lucene87): {}, docValues:{}, maxPointsInLeafNode=41, maxMBSortInHeap=7.973253445182365, sim=Asserting(RandomSimilarity(queryNorm=true): {}), locale=en-NZ, timezone=Asia/Jerusalem
   [junit4]   2> NOTE: Linux 4.15.0-112-generic amd64/Oracle Corporation 1.8.0_281 (64-bit)/cpus=4,threads=1,free=149443720,total=521666560
   [junit4]   2> NOTE: All tests run in this JVM: [SolrPluginUtilsTest, DocValuesMissingTest, SolrCoreTest, TestUniqueKeyFieldResource, HighlighterTest, CoreAdminHandlerTest, MoveReplicaHDFSFailoverTest, TestReload, TestDocTermOrds, TestPartialUpdateDeduplication, BasicZkTest, HdfsAutoAddReplicasIntegrationTest, RequiredFieldsTest, TestExplainDocTransformer, ChaosMonkeySafeLeaderWithPullReplicasTest, DistanceFunctionTest, DefaultValueUpdateProcessorTest, DisMaxRequestHandlerTest, ShardsWhitelistTest, DeleteNodeTest, RandomizedTaggerTest, AssignTest, DistributedFacetPivotWhiteBoxTest, TestHalfAndHalfDocValues, TestFilteredDocIdSet, JvmMetricsTest, TestSchemaResource, TestInPlaceUpdatesStandalone, TestSurroundQueryParser, CSVRequestHandlerTest, TestTolerantUpdateProcessorCloud, IndexBasedSpellCheckerTest, TestDistributedStatsComponentCardinality, BadComponentTest, SpellingQueryConverterTest, CopyFieldTest, TestSolrIndexConfig, TestCustomStream, SliceStateTest, AddBlockUpdateTest, BigEndianAscendingWordDeserializerTest, SearchRateTriggerIntegrationTest, TestSimpleTrackingShardHandler, DistanceUnitsTest, TestCloudConsistency, DistributedQueryElevationComponentTest, SolrRequestParserTest, TestSolrCloudSnapshots, HttpSolrCallGetCoreTest, MaxScoreCollectorTest, RulesTest, TestRetrieveFieldsOptimizer, HdfsNNFailoverTest, TestHdfsUpdateLog, CdcrRequestHandlerTest, FieldMutatingUpdateProcessorTest, CollectionStateFormat2Test, TestSimExecutePlanAction, SuggesterTSTTest, TestSimpleQParserPlugin, TestCloudPivotFacet, OverriddenZkACLAndCredentialsProvidersTest, TestFunctionQuery, SolrIndexMetricsTest, TestCoreAdminApis, RecoveryZkTest, QueryElevationComponentTest, RouteFieldTest, TestSchemalessBufferedUpdates, FullHLLTest, TestPayloadCheckQParserPlugin, CurrencyRangeFacetCloudTest, TestConfig, BlockJoinFacetSimpleTest, TestLuceneIndexBackCompat, XmlInterpolationTest, SparseHLLTest, MetricsHistoryHandlerTest, TestLazyCores, OrderedExecutorTest, TestHashQParserPlugin, PKIAuthenticationIntegrationTest, TestCustomDocTransformer, RankQParserPluginTest, ReplaceNodeTest, TestTrackingShardHandlerFactory, TestNonDefinedSimilarityFactory, NodeAddedTriggerTest, UUIDUpdateProcessorFallbackTest, CoreSorterTest, TestElisionMultitermQuery, SolrMetricManagerTest, TestUnifiedSolrHighlighterWithoutStoredId, TestCopyFieldCollectionResource, OutputWriterTest, AuthToolTest, TestComplexPhraseQParserPlugin, UnloadDistributedZkTest, HdfsSyncSliceTest, SplitShardTest, HdfsWriteToMultipleCollectionsTest, LeaderFailureAfterFreshStartTest, DistribCursorPagingTest, RegexBytesRefFilterTest, TestSolrQueryParser, NestedAtomicUpdateTest, TestConfigSetsAPIShareSchema, TestQueryUtils, TestStressRecovery, TestManagedResource, TriggerCooldownIntegrationTest, ClusterStateMockUtilTest, TestMissingGroups, TestDocumentBuilder, TestGroupingSearch, TestHighlightDedupGrouping, TestJoin, TestRandomDVFaceting, AddReplicaTest, BasicDistributedZkTest, HttpPartitionWithTlogReplicasTest, MissingSegmentRecoveryTest, NestedShardedAtomicUpdateTest, OutOfBoxZkACLAndCredentialsProvidersTest, OverseerTaskQueueTest, PackageManagerCLITest, ShardRoutingCustomTest, ShardTermsTest, SharedFSAutoReplicaFailoverTest, TestCloudSearcherWarming, TestOnReconnectListenerSupport, TestPullReplica, TestPullReplicaErrorHandling, TestShortCircuitedRequests, TestSolrCloudWithDelegationTokens, TestSolrCloudWithKerberosAlt, TestStressLiveNodes, SplitByPrefixTest, TestHdfsCloudBackupRestore, AutoAddReplicasPlanActionTest, ComputePlanActionTest, ImplicitSnitchTest, RuleEngineTest, HdfsDirectoryFactoryTest, RAMDirectoryFactoryTest, RequestHandlersTest, ResourceLoaderTest, SOLR749Test, SolrCoreCheckLockOnStartupTest, TestCoreContainer, TestSolrDeletionPolicy1, MoreLikeThisHandlerTest, RequestLoggingTest, SearchHandlerTest, TestBlobHandler, TestHdfsBackupRestoreCore, TestReqParamsAPI, TestSQLHandlerNonCloud, TestSolrConfigHandlerConcurrent, V2ApiIntegrationTest, V2StandaloneTest, XsltUpdateRequestHandlerTest, AutoscalingHistoryHandlerTest, DistributedExpandComponentTest, DistributedFacetPivotLargeTest, FacetPivotSmallTest, MoreLikeThisComponentTest, PhrasesIdentificationComponentTest, SuggestComponentTest, TestLegacyFieldReuse, TestLegacyTerms, TestMultiValuedNumericRangeQuery, TestNumericRangeQuery32, SolrJmxReporterCloudTest, SolrCloudReportersTest]
   [junit4] Completed [774/924 (1!)] on J0 in 97.81s, 2 tests, 1 error <<< FAILURES!

[...truncated 51211 lines...]