You are viewing a plain text version of this content. The canonical link for it is here.
Posted to yarn-dev@hadoop.apache.org by Apache Jenkins Server <je...@builds.apache.org> on 2013/11/26 11:58:20 UTC

Hadoop-Yarn-trunk - Build # 403 - Still Failing

See https://builds.apache.org/job/Hadoop-Yarn-trunk/403/

###################################################################################
########################## LAST 60 LINES OF THE CONSOLE ###########################
[...truncated 14082 lines...]
Running org.apache.hadoop.yarn.server.resourcemanager.webapp.TestRMWebServicesApps
Tests run: 40, Failures: 0, Errors: 0, Skipped: 0, Time elapsed: 164.219 sec - in org.apache.hadoop.yarn.server.resourcemanager.webapp.TestRMWebServicesApps

Results :

Failed tests: 
  TestRMRestart.testRMDelegationTokenRestoredOnRMRestart:1259 null

Tests run: 486, Failures: 1, Errors: 0, Skipped: 1

[INFO] ------------------------------------------------------------------------
[INFO] Reactor Summary:
[INFO] 
[INFO] hadoop-yarn ....................................... SUCCESS [4.908s]
[INFO] hadoop-yarn-api ................................... SUCCESS [2:17.275s]
[INFO] hadoop-yarn-common ................................ SUCCESS [2:12.011s]
[INFO] hadoop-yarn-server ................................ SUCCESS [0.338s]
[INFO] hadoop-yarn-server-common ......................... SUCCESS [32.743s]
[INFO] hadoop-yarn-server-nodemanager .................... SUCCESS [4:32.387s]
[INFO] hadoop-yarn-server-web-proxy ...................... SUCCESS [19.385s]
[INFO] hadoop-yarn-server-resourcemanager ................ FAILURE [13:10.270s]
[INFO] hadoop-yarn-server-tests .......................... SKIPPED
[INFO] hadoop-yarn-client ................................ SKIPPED
[INFO] hadoop-yarn-applications .......................... SKIPPED
[INFO] hadoop-yarn-applications-distributedshell ......... SKIPPED
[INFO] hadoop-yarn-applications-unmanaged-am-launcher .... SKIPPED
[INFO] hadoop-yarn-site .................................. SKIPPED
[INFO] hadoop-yarn-project ............................... SKIPPED
[INFO] ------------------------------------------------------------------------
[INFO] BUILD FAILURE
[INFO] ------------------------------------------------------------------------
[INFO] Total time: 23:11.706s
[INFO] Finished at: Tue Nov 26 10:58:16 UTC 2013
[INFO] Final Memory: 51M/769M
[INFO] ------------------------------------------------------------------------
[ERROR] Failed to execute goal org.apache.maven.plugins:maven-surefire-plugin:2.16:test (default-test) on project hadoop-yarn-server-resourcemanager: There are test failures.
[ERROR] 
[ERROR] Please refer to /home/jenkins/jenkins-slave/workspace/Hadoop-Yarn-trunk/trunk/hadoop-yarn-project/hadoop-yarn/hadoop-yarn-server/hadoop-yarn-server-resourcemanager/target/surefire-reports for the individual test results.
[ERROR] -> [Help 1]
[ERROR] 
[ERROR] To see the full stack trace of the errors, re-run Maven with the -e switch.
[ERROR] Re-run Maven using the -X switch to enable full debug logging.
[ERROR] 
[ERROR] For more information about the errors and possible solutions, please read the following articles:
[ERROR] [Help 1] http://cwiki.apache.org/confluence/display/MAVEN/MojoFailureException
[ERROR] 
[ERROR] After correcting the problems, you can resume the build with the command
[ERROR]   mvn <goals> -rf :hadoop-yarn-server-resourcemanager
Build step 'Execute shell' marked build as failure
Archiving artifacts
Updating HDFS-5526
Updating HDFS-5533
Updating YARN-1416
Updating HADOOP-10126
Updating YARN-1314
Updating HDFS-5538
Sending e-mails to: yarn-dev@hadoop.apache.org
Email was triggered for: Failure
Sending email for trigger: Failure



###################################################################################
############################## FAILED TESTS (if any) ##############################
No tests ran.