You are viewing a plain text version of this content. The canonical link for it is here.
Posted to dev@atlas.apache.org by Apache Jenkins Server <je...@builds.apache.org> on 2017/03/24 17:39:55 UTC

Build failed in Jenkins: apache-atlas-nightly #696

See <https://builds.apache.org/job/apache-atlas-nightly/696/display/redirect?page=changes>

Changes:

[madhan] ATLAS-1682: UI update to add new overlay loader to tables; fix incorrect

------------------------------------------
[...truncated 531.68 KB...]
127.0.0.1 - - [24/Mar/2017:17:31:17 +0000] "POST /api/atlas/entities HTTP/1.1" 201 - "-" "Java/1.7.0_80"
127.0.0.1 - - [24/Mar/2017:17:31:17 +0000] "GET /api/atlas/types/tableType HTTP/1.1" 200 - "-" "Java/1.7.0_80"
127.0.0.1 - - [24/Mar/2017:17:31:17 +0000] "GET /api/atlas/types/serdeType HTTP/1.1" 200 - "-" "Java/1.7.0_80"
127.0.0.1 - - [24/Mar/2017:17:31:17 +0000] "GET /api/atlas/types/classification HTTP/1.1" 200 - "-" "Java/1.7.0_80"
127.0.0.1 - - [24/Mar/2017:17:31:17 +0000] "GET /api/atlas/types/hive_db_v1 HTTP/1.1" 200 - "-" "Java/1.7.0_80"
127.0.0.1 - - [24/Mar/2017:17:31:17 +0000] "POST /api/atlas/entities HTTP/1.1" 201 - "-" "Java/1.7.0_80"
127.0.0.1 - - [24/Mar/2017:17:31:17 +0000] "POST /api/atlas/entities HTTP/1.1" 201 - "-" "Java/1.7.0_80"
127.0.0.1 - - [24/Mar/2017:17:31:17 +0000] "POST /api/atlas/entities HTTP/1.1" 201 - "-" "Java/1.7.0_80"
127.0.0.1 - - [24/Mar/2017:17:31:17 +0000] "POST /api/atlas/entities HTTP/1.1" 201 - "-" "Java/1.7.0_80"
127.0.0.1 - - [24/Mar/2017:17:31:17 +0000] "POST /api/atlas/entities HTTP/1.1" 201 - "-" "Java/1.7.0_80"
127.0.0.1 - - [24/Mar/2017:17:31:17 +0000] "POST /api/atlas/entities HTTP/1.1" 201 - "-" "Java/1.7.0_80"
127.0.0.1 - - [24/Mar/2017:17:31:17 +0000] "POST /api/atlas/entities HTTP/1.1" 201 - "-" "Java/1.7.0_80"
127.0.0.1 - - [24/Mar/2017:17:31:17 +0000] "POST /api/atlas/entities HTTP/1.1" 201 - "-" "Java/1.7.0_80"
127.0.0.1 - - [24/Mar/2017:17:31:17 +0000] "GET /api/atlas/lineage/hive/table/sales_fact_monthly_mvZdBcinpZGE/inputs/graph HTTP/1.1" 200 - "-" "Java/1.7.0_80"
127.0.0.1 - - [24/Mar/2017:17:31:19 +0000] "GET /api/atlas/entities?type=hive_table_v1&property=qualifiedName&value=sales_fact_monthly_mvZdBcinpZGE HTTP/1.1" 200 - "-" "Java/1.7.0_80"
127.0.0.1 - - [24/Mar/2017:17:31:19 +0000] "GET /api/atlas/lineage/4104227f-2db2-432d-8625-9061b17d517b/inputs/graph HTTP/1.1" 200 - "-" "Java/1.7.0_80"
127.0.0.1 - - [24/Mar/2017:17:31:20 +0000] "GET /api/atlas/lineage/hive/table/sales_factqoI25obZQU/outputs/graph HTTP/1.1" 200 - "-" "Java/1.7.0_80"
127.0.0.1 - - [24/Mar/2017:17:31:23 +0000] "GET /api/atlas/entities?type=hive_table_v1&property=qualifiedName&value=sales_factqoI25obZQU HTTP/1.1" 200 - "-" "Java/1.7.0_80"
127.0.0.1 - - [24/Mar/2017:17:31:23 +0000] "GET /api/atlas/lineage/28112eaa-b113-4e0c-8f4d-7417bc45f31a/outputs/graph HTTP/1.1" 200 - "-" "Java/1.7.0_80"
127.0.0.1 - - [24/Mar/2017:17:31:24 +0000] "GET /api/atlas/lineage/hive/table/sales_factqoI25obZQU/schema HTTP/1.1" 200 - "-" "Java/1.7.0_80"
127.0.0.1 - - [24/Mar/2017:17:31:25 +0000] "GET /api/atlas/lineage/hive/table/SalesLY0S6tipoO/schema HTTP/1.1" 404 - "-" "Java/1.7.0_80"
127.0.0.1 - - [24/Mar/2017:17:31:25 +0000] "GET /api/atlas/entities?type=hive_table_v1&property=qualifiedName&value=sales_factqoI25obZQU HTTP/1.1" 200 - "-" "Java/1.7.0_80"
127.0.0.1 - - [24/Mar/2017:17:31:25 +0000] "GET /api/atlas/lineage/28112eaa-b113-4e0c-8f4d-7417bc45f31a/schema HTTP/1.1" 200 - "-" "Java/1.7.0_80"
127.0.0.1 - - [24/Mar/2017:17:31:25 +0000] "GET /api/atlas/lineage/hive/table/blah/schema HTTP/1.1" 404 - "-" "Java/1.7.0_80"
127.0.0.1 - - [24/Mar/2017:17:31:25 +0000] "GET /api/atlas/entities?type=hive_table_v1&property=qualifiedName&value=sales_fact_monthly_mvwEPyaSazBc HTTP/1.1" 200 - "-" "Java/1.7.0_80"
127.0.0.1 - - [24/Mar/2017:17:31:25 +0000] "GET /api/atlas/v2/lineage/e2c20e12-71df-4212-9dc5-6e194d8124df?direction=INPUT&depth=5 HTTP/1.1" 200 - "-" "Java/1.7.0_80"
127.0.0.1 - - [24/Mar/2017:17:31:26 +0000] "GET /api/atlas/entities?type=hive_table_v1&property=qualifiedName&value=sales_fact_monthly_mvwEPyaSazBc HTTP/1.1" 200 - "-" "Java/1.7.0_80"
127.0.0.1 - - [24/Mar/2017:17:31:27 +0000] "GET /api/atlas/v2/lineage/e2c20e12-71df-4212-9dc5-6e194d8124df?direction=BOTH&depth=5 HTTP/1.1" 200 - "-" "Java/1.7.0_80"
127.0.0.1 - - [24/Mar/2017:17:31:29 +0000] "GET /api/atlas/entities?type=hive_table_v1&property=qualifiedName&value=sales_factLKmDn3rTYw HTTP/1.1" 200 - "-" "Java/1.7.0_80"
127.0.0.1 - - [24/Mar/2017:17:31:29 +0000] "GET /api/atlas/v2/lineage/3c8ed2b8-f416-43e9-b41d-df996dd3b715?direction=OUTPUT&depth=5 HTTP/1.1" 200 - "-" "Java/1.7.0_80"
Tests run: 11, Failures: 0, Errors: 0, Skipped: 0, Time elapsed: 16.845 sec - in org.apache.atlas.web.resources.EntityLineageJerseyResourceIT
Running org.apache.atlas.CredentialProviderUtilityIT
Tests run: 4, Failures: 0, Errors: 0, Skipped: 0, Time elapsed: 1.624 sec - in org.apache.atlas.CredentialProviderUtilityIT
Running org.apache.atlas.notification.EntityNotificationIT
127.0.0.1 - - [24/Mar/2017:17:31:35 +0000] "GET /api/atlas/types/tableType HTTP/1.1" 200 - "-" "Java/1.7.0_80"
127.0.0.1 - - [24/Mar/2017:17:31:35 +0000] "GET /api/atlas/types/serdeType HTTP/1.1" 200 - "-" "Java/1.7.0_80"
127.0.0.1 - - [24/Mar/2017:17:31:35 +0000] "GET /api/atlas/types/classification HTTP/1.1" 200 - "-" "Java/1.7.0_80"
127.0.0.1 - - [24/Mar/2017:17:31:35 +0000] "GET /api/atlas/types/hive_db_v1 HTTP/1.1" 200 - "-" "Java/1.7.0_80"
127.0.0.1 - - [24/Mar/2017:17:31:36 +0000] "POST /api/atlas/entities HTTP/1.1" 201 - "-" "Java/1.7.0_80"
127.0.0.1 - - [24/Mar/2017:17:31:37 +0000] "POST /api/atlas/entities HTTP/1.1" 201 - "-" "Java/1.7.0_80"
127.0.0.1 - - [24/Mar/2017:17:31:38 +0000] "POST /api/atlas/types HTTP/1.1" 201 - "-" "Java/1.7.0_80"
127.0.0.1 - - [24/Mar/2017:17:31:38 +0000] "POST /api/atlas/types HTTP/1.1" 201 - "-" "Java/1.7.0_80"
127.0.0.1 - - [24/Mar/2017:17:31:39 +0000] "POST /api/atlas/types HTTP/1.1" 201 - "-" "Java/1.7.0_80"
127.0.0.1 - - [24/Mar/2017:17:31:39 +0000] "POST /api/atlas/entities/dcfcd344-dbea-4e28-a82c-c48e0ba2b6c0/traits HTTP/1.1" 201 - "-" "Java/1.7.0_80"
127.0.0.1 - - [24/Mar/2017:17:31:39 +0000] "POST /api/atlas/types HTTP/1.1" 201 - "-" "Java/1.7.0_80"
127.0.0.1 - - [24/Mar/2017:17:31:39 +0000] "POST /api/atlas/entities/dcfcd344-dbea-4e28-a82c-c48e0ba2b6c0/traits HTTP/1.1" 201 - "-" "Java/1.7.0_80"
127.0.0.1 - - [24/Mar/2017:17:31:39 +0000] "DELETE /api/atlas/entities/dcfcd344-dbea-4e28-a82c-c48e0ba2b6c0/traits/TraitXweZRhMaaY HTTP/1.1" 200 - "-" "Java/1.7.0_80"
127.0.0.1 - - [24/Mar/2017:17:31:39 +0000] "POST /api/atlas/entities/dcfcd344-dbea-4e28-a82c-c48e0ba2b6c0?property=description HTTP/1.1" 200 - "-" "Java/1.7.0_80"
127.0.0.1 - - [24/Mar/2017:17:31:39 +0000] "POST /api/atlas/entities HTTP/1.1" 201 - "-" "Java/1.7.0_80"
127.0.0.1 - - [24/Mar/2017:17:31:39 +0000] "POST /api/atlas/entities HTTP/1.1" 201 - "-" "Java/1.7.0_80"
127.0.0.1 - - [24/Mar/2017:17:31:39 +0000] "DELETE /api/atlas/entities?type=hive_table&property=qualifiedName&value=table-TCPEi7Bb4z HTTP/1.1" 200 - "-" "Java/1.7.0_80"
Tests run: 5, Failures: 0, Errors: 0, Skipped: 0, Time elapsed: 6.478 sec - in org.apache.atlas.notification.EntityNotificationIT
Running org.apache.atlas.notification.NotificationHookConsumerIT
127.0.0.1 - - [24/Mar/2017:17:31:42 +0000] "GET /api/atlas/types/tableType HTTP/1.1" 200 - "-" "Java/1.7.0_80"
127.0.0.1 - - [24/Mar/2017:17:31:43 +0000] "GET /api/atlas/types/serdeType HTTP/1.1" 200 - "-" "Java/1.7.0_80"
127.0.0.1 - - [24/Mar/2017:17:31:43 +0000] "GET /api/atlas/types/classification HTTP/1.1" 200 - "-" "Java/1.7.0_80"
127.0.0.1 - - [24/Mar/2017:17:31:43 +0000] "GET /api/atlas/types/hive_db_v1 HTTP/1.1" 200 - "-" "Java/1.7.0_80"
127.0.0.1 - - [24/Mar/2017:17:31:44 +0000] "GET /api/atlas/discovery/search/dsl?query=hive_db+where+qualifiedName%3D'dbQNxQUbfb8x'&limit=10&offset=0 HTTP/1.1" 200 - "-" "Java/1.7.0_80"
127.0.0.1 - - [24/Mar/2017:17:31:44 +0000] "GET /api/atlas/entities?type=hive_db&property=qualifiedName&value=dbQNxQUbfb8x HTTP/1.1" 200 - "-" "Java/1.7.0_80"
127.0.0.1 - - [24/Mar/2017:17:31:45 +0000] "GET /api/atlas/entities/08728e77-b8f7-4a17-b5a8-08b76b677653/audit?count=1 HTTP/1.1" 200 - "-" "Java/1.7.0_80"
127.0.0.1 - - [24/Mar/2017:17:31:45 +0000] "POST /api/atlas/entities HTTP/1.1" 201 - "-" "Java/1.7.0_80"
127.0.0.1 - - [24/Mar/2017:17:31:45 +0000] "GET /api/atlas/entities/e8696b36-8586-4bb1-ade5-5ae4cfb96744 HTTP/1.1" 200 - "-" "Java/1.7.0_80"
127.0.0.1 - - [24/Mar/2017:17:31:45 +0000] "GET /api/atlas/entities/e8696b36-8586-4bb1-ade5-5ae4cfb96744 HTTP/1.1" 200 - "-" "Java/1.7.0_80"
127.0.0.1 - - [24/Mar/2017:17:31:45 +0000] "GET /api/atlas/discovery/search/dsl?query=hive_db+where+name%3D'dbK36nUBy4R7'&limit=10&offset=0 HTTP/1.1" 200 - "-" "Java/1.7.0_80"
127.0.0.1 - - [24/Mar/2017:17:31:46 +0000] "GET /api/atlas/discovery/search/dsl?query=hive_db+where+name%3D'dbK36nUBy4R7'&limit=10&offset=0 HTTP/1.1" 200 - "-" "Java/1.7.0_80"
127.0.0.1 - - [24/Mar/2017:17:31:46 +0000] "POST /api/atlas/entities HTTP/1.1" 201 - "-" "Java/1.7.0_80"
127.0.0.1 - - [24/Mar/2017:17:31:47 +0000] "GET /api/atlas/discovery/search/dsl?query=hive_db+where+qualifiedName%3D'dbPnRDnkR0S2'&limit=10&offset=0 HTTP/1.1" 200 - "-" "Java/1.7.0_80"
127.0.0.1 - - [24/Mar/2017:17:31:47 +0000] "GET /api/atlas/entities?type=hive_db&property=qualifiedName&value=dbPnRDnkR0S2 HTTP/1.1" 200 - "-" "Java/1.7.0_80"
127.0.0.1 - - [24/Mar/2017:17:31:47 +0000] "POST /api/atlas/entities HTTP/1.1" 201 - "-" "Java/1.7.0_80"
127.0.0.1 - - [24/Mar/2017:17:31:47 +0000] "GET /api/atlas/entities?type=hive_db&property=qualifiedName&value=dbI1EiQVj19j HTTP/1.1" 500 - "-" "Java/1.7.0_80"
127.0.0.1 - - [24/Mar/2017:17:31:48 +0000] "POST /api/atlas/entities HTTP/1.1" 201 - "-" "Java/1.7.0_80"
127.0.0.1 - - [24/Mar/2017:17:31:48 +0000] "GET /api/atlas/discovery/search/dsl?query=hive_db+where+qualifiedName%3D'dbfm1rM4LjcA'&limit=10&offset=0 HTTP/1.1" 200 - "-" "Java/1.7.0_80"
127.0.0.1 - - [24/Mar/2017:17:31:49 +0000] "GET /api/atlas/discovery/search/dsl?query=hive_db+where+qualifiedName%3D'dbXsSSGUCsh3'&limit=10&offset=0 HTTP/1.1" 200 - "-" "Java/1.7.0_80"
Tests run: 6, Failures: 1, Errors: 0, Skipped: 0, Time elapsed: 9.853 sec <<< FAILURE! - in org.apache.atlas.notification.NotificationHookConsumerIT
testUpdateEntityPartial(org.apache.atlas.notification.NotificationHookConsumerIT)  Time elapsed: 0.63 sec  <<< FAILURE!
org.apache.atlas.AtlasServiceException: Metadata service API org.apache.atlas.AtlasBaseClient$APIInfo@55cc8bbe failed with status 500 (Internal Server Error) Response Body ({"error":"Could not execute operation due to backend exception"})
	at org.apache.atlas.notification.NotificationHookConsumerIT.testUpdateEntityPartial(NotificationHookConsumerIT.java:130)


Results :

Failed tests: 
  NotificationHookConsumerIT.testUpdateEntityPartial:130->BaseResourceIT.waitFor:641 » AtlasService

Tests run: 133, Failures: 1, Errors: 0, Skipped: 0

[INFO] 
[INFO] --- jetty-maven-plugin:9.2.12.v20150709:stop (stop-jetty) @ atlas-webapp ---
[INFO] Waiting 10 seconds for jetty to stop
[INFO] Stopped ServerConnector@6d561f19{HTTP/1.1}{0.0.0.0:31000}
[INFO] Closing Spring root WebApplicationContext
[INFO] Shutting down log4j
[INFO] Stopped o.e.j.m.p.JettyWebAppContext@4e1843c8{/,<https://builds.apache.org/job/apache-atlas-nightly/ws/webapp/target/atlas-webapp-0.9-incubating-SNAPSHOT/,UNAVAILABLE}{/home/jenkins/jenkins-slave/workspace/apache-atlas-nightly/webapp/target/atlas-webapp-0.9-incubating-SNAPSHOT.war}>
[INFO] Server reports itself as stopped
[INFO] 
[INFO] --- maven-source-plugin:2.4:jar-no-fork (attach-sources) @ atlas-webapp ---
[INFO] Building jar: <https://builds.apache.org/job/apache-atlas-nightly/ws/webapp/target/atlas-webapp-0.9-incubating-SNAPSHOT-sources.jar>
log4j:WARN No appenders could be found for logger (org.apache.zookeeper.ClientCnxn).
log4j:WARN Please initialize the log4j system properly.
log4j:WARN See http://logging.apache.org/log4j/1.2/faq.html#noconfig for more info.
[INFO] 
[INFO] --- maven-source-plugin:2.4:test-jar-no-fork (attach-sources) @ atlas-webapp ---
[INFO] Building jar: <https://builds.apache.org/job/apache-atlas-nightly/ws/webapp/target/atlas-webapp-0.9-incubating-SNAPSHOT-test-sources.jar>
[INFO] 
[INFO] --- maven-failsafe-plugin:2.19.1:verify (verify) @ atlas-webapp ---
[INFO] ------------------------------------------------------------------------
[INFO] Reactor Summary:
[INFO] 
[INFO] Apache Atlas Server Build Tools .................... SUCCESS [  1.468 s]
[INFO] apache-atlas ....................................... SUCCESS [ 10.706 s]
[INFO] Apache Atlas Integration ........................... SUCCESS [01:03 min]
[INFO] Apache Atlas Common ................................ SUCCESS [ 21.756 s]
[INFO] Apache Atlas Typesystem ............................ SUCCESS [01:42 min]
[INFO] Apache Atlas Client ................................ SUCCESS [ 23.699 s]
[INFO] Apache Atlas Server API ............................ SUCCESS [ 12.672 s]
[INFO] Apache Atlas Notification .......................... SUCCESS [ 44.490 s]
[INFO] Apache Atlas Graph Database Projects ............... SUCCESS [  0.747 s]
[INFO] Apache Atlas Graph Database API .................... SUCCESS [  8.779 s]
[INFO] Graph Database Common Code ......................... SUCCESS [  8.718 s]
[INFO] Apache Atlas Titan 1.0.0 GraphDB Impl .............. SUCCESS [ 34.423 s]
[INFO] Shaded version of Apache hbase client .............. SUCCESS [  9.234 s]
[INFO] Apache Atlas Titan 0.5.4 Graph DB Impl ............. SUCCESS [01:49 min]
[INFO] Apache Atlas Graph Database Implementation Dependencies SUCCESS [  0.825 s]
[INFO] Shaded version of Apache hbase server .............. SUCCESS [ 24.482 s]
[INFO] Apache Atlas Repository ............................ SUCCESS [16:40 min]
[INFO] Apache Atlas Authorization ......................... SUCCESS [ 17.577 s]
[INFO] Apache Atlas Business Catalog ...................... SUCCESS [ 35.609 s]
[INFO] Apache Atlas UI .................................... SUCCESS [ 55.835 s]
[INFO] Apache Atlas Web Application ....................... FAILURE [09:01 min]
[INFO] Apache Atlas Documentation ......................... SKIPPED
[INFO] Apache Atlas FileSystem Model ...................... SKIPPED
[INFO] Apache Atlas Plugin Classloader .................... SKIPPED
[INFO] Apache Atlas Hive Bridge Shim ...................... SKIPPED
[INFO] Apache Atlas Hive Bridge ........................... SKIPPED
[INFO] Apache Atlas Falcon Bridge Shim .................... SKIPPED
[INFO] Apache Atlas Falcon Bridge ......................... SKIPPED
[INFO] Apache Atlas Sqoop Bridge Shim ..................... SKIPPED
[INFO] Apache Atlas Sqoop Bridge .......................... SKIPPED
[INFO] Apache Atlas Storm Bridge Shim ..................... SKIPPED
[INFO] Apache Atlas Storm Bridge .......................... SKIPPED
[INFO] Apache Atlas Distribution .......................... SKIPPED
[INFO] ------------------------------------------------------------------------
[INFO] BUILD FAILURE
[INFO] ------------------------------------------------------------------------
[INFO] Total time: 35:31 min
[INFO] Finished at: 2017-03-24T17:31:55+00:00
[INFO] Final Memory: 362M/1988M
[INFO] ------------------------------------------------------------------------
[ERROR] Failed to execute goal org.apache.maven.plugins:maven-failsafe-plugin:2.19.1:verify (verify) on project atlas-webapp: There are test failures.
[ERROR] 
[ERROR] Please refer to <https://builds.apache.org/job/apache-atlas-nightly/ws/webapp/target/failsafe-reports> for the individual test results.
[ERROR] -> [Help 1]
[ERROR] 
[ERROR] To see the full stack trace of the errors, re-run Maven with the -e switch.
[ERROR] Re-run Maven using the -X switch to enable full debug logging.
[ERROR] 
[ERROR] For more information about the errors and possible solutions, please read the following articles:
[ERROR] [Help 1] http://cwiki.apache.org/confluence/display/MAVEN/MojoFailureException
[ERROR] 
[ERROR] After correcting the problems, you can resume the build with the command
[ERROR]   mvn <goals> -rf :atlas-webapp
Build step 'Execute shell' marked build as failure
[CHECKSTYLE] Collecting checkstyle analysis files...
[CHECKSTYLE] Finding all files that match the pattern **/target/checkstyle-result.xml
[CHECKSTYLE] Parsing 32 files in <https://builds.apache.org/job/apache-atlas-nightly/ws/>
[CHECKSTYLE] Successfully parsed file <https://builds.apache.org/job/apache-atlas-nightly/ws/addons/falcon-bridge-shim/target/checkstyle-result.xml> with 29 unique warnings and 0 duplicates.
[CHECKSTYLE] Successfully parsed file <https://builds.apache.org/job/apache-atlas-nightly/ws/addons/falcon-bridge/target/checkstyle-result.xml> with 419 unique warnings and 0 duplicates.
[CHECKSTYLE] Successfully parsed file <https://builds.apache.org/job/apache-atlas-nightly/ws/addons/hdfs-model/target/checkstyle-result.xml> with 419 unique warnings and 0 duplicates.
[CHECKSTYLE] Successfully parsed file <https://builds.apache.org/job/apache-atlas-nightly/ws/addons/hive-bridge-shim/target/checkstyle-result.xml> with 434 unique warnings and 0 duplicates.
[CHECKSTYLE] Successfully parsed file <https://builds.apache.org/job/apache-atlas-nightly/ws/addons/hive-bridge/target/checkstyle-result.xml> with 2253 unique warnings and 0 duplicates.
[CHECKSTYLE] Successfully parsed file <https://builds.apache.org/job/apache-atlas-nightly/ws/addons/sqoop-bridge-shim/target/checkstyle-result.xml> with 2269 unique warnings and 0 duplicates.
[CHECKSTYLE] Successfully parsed file <https://builds.apache.org/job/apache-atlas-nightly/ws/addons/sqoop-bridge/target/checkstyle-result.xml> with 2398 unique warnings and 0 duplicates.
[CHECKSTYLE] Successfully parsed file <https://builds.apache.org/job/apache-atlas-nightly/ws/addons/storm-bridge-shim/target/checkstyle-result.xml> with 2419 unique warnings and 0 duplicates.
[CHECKSTYLE] Successfully parsed file <https://builds.apache.org/job/apache-atlas-nightly/ws/addons/storm-bridge/target/checkstyle-result.xml> with 2687 unique warnings and 0 duplicates.
[CHECKSTYLE] Successfully parsed file <https://builds.apache.org/job/apache-atlas-nightly/ws/authorization/target/checkstyle-result.xml> with 3151 unique warnings and 0 duplicates.
[CHECKSTYLE] Successfully parsed file <https://builds.apache.org/job/apache-atlas-nightly/ws/catalog/target/checkstyle-result.xml> with 5296 unique warnings and 0 duplicates.
[CHECKSTYLE] Successfully parsed file <https://builds.apache.org/job/apache-atlas-nightly/ws/client/target/checkstyle-result.xml> with 6906 unique warnings and 0 duplicates.
[CHECKSTYLE] Successfully parsed file <https://builds.apache.org/job/apache-atlas-nightly/ws/common/target/checkstyle-result.xml> with 8072 unique warnings and 0 duplicates.
[CHECKSTYLE] Successfully parsed file <https://builds.apache.org/job/apache-atlas-nightly/ws/dashboardv2/target/checkstyle-result.xml> with 8072 unique warnings and 0 duplicates.
[CHECKSTYLE] Successfully parsed file <https://builds.apache.org/job/apache-atlas-nightly/ws/distro/target/checkstyle-result.xml> with 8072 unique warnings and 0 duplicates.
[CHECKSTYLE] Successfully parsed file <https://builds.apache.org/job/apache-atlas-nightly/ws/docs/target/checkstyle-result.xml> with 8072 unique warnings and 0 duplicates.
[CHECKSTYLE] Successfully parsed file <https://builds.apache.org/job/apache-atlas-nightly/ws/graphdb/api/target/checkstyle-result.xml> with 8318 unique warnings and 0 duplicates.
[CHECKSTYLE] Successfully parsed file <https://builds.apache.org/job/apache-atlas-nightly/ws/graphdb/common/target/checkstyle-result.xml> with 8467 unique warnings and 0 duplicates.
[CHECKSTYLE] Successfully parsed file <https://builds.apache.org/job/apache-atlas-nightly/ws/graphdb/graphdb-impls/target/checkstyle-result.xml> with 8467 unique warnings and 0 duplicates.
[CHECKSTYLE] Successfully parsed file <https://builds.apache.org/job/apache-atlas-nightly/ws/graphdb/target/checkstyle-result.xml> with 8467 unique warnings and 0 duplicates.
[CHECKSTYLE] Successfully parsed file <https://builds.apache.org/job/apache-atlas-nightly/ws/graphdb/titan0/target/checkstyle-result.xml> with 10687 unique warnings and 0 duplicates.
[CHECKSTYLE] Successfully parsed file <https://builds.apache.org/job/apache-atlas-nightly/ws/graphdb/titan1/target/checkstyle-result.xml> with 11591 unique warnings and 0 duplicates.
[CHECKSTYLE] Successfully parsed file <https://builds.apache.org/job/apache-atlas-nightly/ws/intg/target/checkstyle-result.xml> with 17523 unique warnings and 0 duplicates.
[CHECKSTYLE] Successfully parsed file <https://builds.apache.org/job/apache-atlas-nightly/ws/notification/target/checkstyle-result.xml> with 18702 unique warnings and 0 duplicates.
[CHECKSTYLE] Successfully parsed file <https://builds.apache.org/job/apache-atlas-nightly/ws/plugin-classloader/target/checkstyle-result.xml> with 18810 unique warnings and 0 duplicates.
[CHECKSTYLE] Successfully parsed file <https://builds.apache.org/job/apache-atlas-nightly/ws/repository/target/checkstyle-result.xml> with 33676 unique warnings and 0 duplicates.
[CHECKSTYLE] Successfully parsed file <https://builds.apache.org/job/apache-atlas-nightly/ws/server-api/target/checkstyle-result.xml> with 34073 unique warnings and 0 duplicates.
[CHECKSTYLE] Successfully parsed file <https://builds.apache.org/job/apache-atlas-nightly/ws/shaded/hbase-client-shaded/target/checkstyle-result.xml> with 34073 unique warnings and 0 duplicates.
[CHECKSTYLE] Successfully parsed file <https://builds.apache.org/job/apache-atlas-nightly/ws/shaded/hbase-server-shaded/target/checkstyle-result.xml> with 34073 unique warnings and 0 duplicates.
[CHECKSTYLE] Successfully parsed file <https://builds.apache.org/job/apache-atlas-nightly/ws/target/checkstyle-result.xml> with 34073 unique warnings and 0 duplicates.
[CHECKSTYLE] Successfully parsed file <https://builds.apache.org/job/apache-atlas-nightly/ws/titan/target/checkstyle-result.xml> with 34535 unique warnings and 0 duplicates.
[CHECKSTYLE] Successfully parsed file <https://builds.apache.org/job/apache-atlas-nightly/ws/typesystem/target/checkstyle-result.xml> with 38754 unique warnings and 0 duplicates.
[CHECKSTYLE] Computing warning deltas based on reference build #695
[FINDBUGS] Collecting findbugs analysis files...
[FINDBUGS] Finding all files that match the pattern **/target/findbugs.xml
[FINDBUGS] Parsing 22 files in <https://builds.apache.org/job/apache-atlas-nightly/ws/>
[FINDBUGS] Successfully parsed file <https://builds.apache.org/job/apache-atlas-nightly/ws/addons/falcon-bridge-shim/target/findbugs.xml> with 0 unique warnings and 0 duplicates.
[FINDBUGS] Successfully parsed file <https://builds.apache.org/job/apache-atlas-nightly/ws/addons/falcon-bridge/target/findbugs.xml> with 0 unique warnings and 0 duplicates.
[FINDBUGS] Successfully parsed file <https://builds.apache.org/job/apache-atlas-nightly/ws/addons/hive-bridge-shim/target/findbugs.xml> with 0 unique warnings and 0 duplicates.
[FINDBUGS] Successfully parsed file <https://builds.apache.org/job/apache-atlas-nightly/ws/addons/hive-bridge/target/findbugs.xml> with 0 unique warnings and 0 duplicates.
[FINDBUGS] Successfully parsed file <https://builds.apache.org/job/apache-atlas-nightly/ws/addons/sqoop-bridge-shim/target/findbugs.xml> with 0 unique warnings and 0 duplicates.
[FINDBUGS] Successfully parsed file <https://builds.apache.org/job/apache-atlas-nightly/ws/addons/sqoop-bridge/target/findbugs.xml> with 0 unique warnings and 0 duplicates.
[FINDBUGS] Successfully parsed file <https://builds.apache.org/job/apache-atlas-nightly/ws/addons/storm-bridge-shim/target/findbugs.xml> with 0 unique warnings and 0 duplicates.
[FINDBUGS] Successfully parsed file <https://builds.apache.org/job/apache-atlas-nightly/ws/addons/storm-bridge/target/findbugs.xml> with 0 unique warnings and 0 duplicates.
[FINDBUGS] Successfully parsed file <https://builds.apache.org/job/apache-atlas-nightly/ws/authorization/target/findbugs.xml> with 0 unique warnings and 0 duplicates.
[FINDBUGS] Successfully parsed file <https://builds.apache.org/job/apache-atlas-nightly/ws/catalog/target/findbugs.xml> with 0 unique warnings and 0 duplicates.
[FINDBUGS] Successfully parsed file <https://builds.apache.org/job/apache-atlas-nightly/ws/client/target/findbugs.xml> with 0 unique warnings and 0 duplicates.
[FINDBUGS] Successfully parsed file <https://builds.apache.org/job/apache-atlas-nightly/ws/common/target/findbugs.xml> with 0 unique warnings and 0 duplicates.
[FINDBUGS] Successfully parsed file <https://builds.apache.org/job/apache-atlas-nightly/ws/graphdb/api/target/findbugs.xml> with 0 unique warnings and 0 duplicates.
[FINDBUGS] Successfully parsed file <https://builds.apache.org/job/apache-atlas-nightly/ws/graphdb/common/target/findbugs.xml> with 0 unique warnings and 0 duplicates.
[FINDBUGS] Successfully parsed file <https://builds.apache.org/job/apache-atlas-nightly/ws/graphdb/titan0/target/findbugs.xml> with 0 unique warnings and 0 duplicates.
[FINDBUGS] Successfully parsed file <https://builds.apache.org/job/apache-atlas-nightly/ws/intg/target/findbugs.xml> with 0 unique warnings and 0 duplicates.
[FINDBUGS] Successfully parsed file <https://builds.apache.org/job/apache-atlas-nightly/ws/notification/target/findbugs.xml> with 0 unique warnings and 0 duplicates.
[FINDBUGS] Successfully parsed file <https://builds.apache.org/job/apache-atlas-nightly/ws/plugin-classloader/target/findbugs.xml> with 0 unique warnings and 0 duplicates.
[FINDBUGS] Successfully parsed file <https://builds.apache.org/job/apache-atlas-nightly/ws/repository/target/findbugs.xml> with 0 unique warnings and 0 duplicates.
[FINDBUGS] Successfully parsed file <https://builds.apache.org/job/apache-atlas-nightly/ws/server-api/target/findbugs.xml> with 0 unique warnings and 0 duplicates.
[FINDBUGS] Successfully parsed file <https://builds.apache.org/job/apache-atlas-nightly/ws/titan/target/findbugs.xml> with 0 unique warnings and 0 duplicates.
[FINDBUGS] Successfully parsed file <https://builds.apache.org/job/apache-atlas-nightly/ws/typesystem/target/findbugs.xml> with 0 unique warnings and 0 duplicates.
[FINDBUGS] Computing warning deltas based on reference build #695
Archiving artifacts
Compressed 566.50 MB of artifacts by 63.6% relative to #695
TestNG Reports Processing: START
Looking for TestNG results report in workspace using pattern: **/target/surefire-reports/testng-results.xml,**/target/failsafe-reports/testng-results.xml
testng-results.xml was last modified before this build started. Ignoring it.
testng-results.xml was last modified before this build started. Ignoring it.
testng-results.xml was last modified before this build started. Ignoring it.
testng-results.xml was last modified before this build started. Ignoring it.
testng-results.xml was last modified before this build started. Ignoring it.
testng-results.xml was last modified before this build started. Ignoring it.
testng-results.xml was last modified before this build started. Ignoring it.
Saving reports...
Processing '/x1/jenkins/jenkins-home/jobs/apache-atlas-nightly/builds/696/testng/testng-results-1.xml'
Processing '/x1/jenkins/jenkins-home/jobs/apache-atlas-nightly/builds/696/testng/testng-results-10.xml'
Processing '/x1/jenkins/jenkins-home/jobs/apache-atlas-nightly/builds/696/testng/testng-results-2.xml'
Processing '/x1/jenkins/jenkins-home/jobs/apache-atlas-nightly/builds/696/testng/testng-results-3.xml'
Processing '/x1/jenkins/jenkins-home/jobs/apache-atlas-nightly/builds/696/testng/testng-results-4.xml'
Processing '/x1/jenkins/jenkins-home/jobs/apache-atlas-nightly/builds/696/testng/testng-results-5.xml'
Processing '/x1/jenkins/jenkins-home/jobs/apache-atlas-nightly/builds/696/testng/testng-results-6.xml'
Processing '/x1/jenkins/jenkins-home/jobs/apache-atlas-nightly/builds/696/testng/testng-results-7.xml'
Processing '/x1/jenkins/jenkins-home/jobs/apache-atlas-nightly/builds/696/testng/testng-results-8.xml'
Processing '/x1/jenkins/jenkins-home/jobs/apache-atlas-nightly/builds/696/testng/testng-results-9.xml'
Processing '/x1/jenkins/jenkins-home/jobs/apache-atlas-nightly/builds/696/testng/testng-results.xml'
1.785714% of tests failed, which exceeded threshold of 0%. Marking build as UNSTABLE
TestNG Reports Processing: FINISH

Jenkins build is back to normal : apache-atlas-nightly #698

Posted by Apache Jenkins Server <je...@builds.apache.org>.
See <https://builds.apache.org/job/apache-atlas-nightly/698/display/redirect?page=changes>


Build failed in Jenkins: apache-atlas-nightly #697

Posted by Apache Jenkins Server <je...@builds.apache.org>.
See <https://builds.apache.org/job/apache-atlas-nightly/697/display/redirect?page=changes>

Changes:

[apoorvnaik] ATLAS-1681 - Added type validations for compatibility with legacy

------------------------------------------
[...truncated 531.68 KB...]
127.0.0.1 - - [25/Mar/2017:23:30:43 +0000] "POST /api/atlas/entities HTTP/1.1" 201 - "-" "Java/1.7.0_80"
127.0.0.1 - - [25/Mar/2017:23:30:43 +0000] "GET /api/atlas/types/tableType HTTP/1.1" 200 - "-" "Java/1.7.0_80"
127.0.0.1 - - [25/Mar/2017:23:30:43 +0000] "GET /api/atlas/types/serdeType HTTP/1.1" 200 - "-" "Java/1.7.0_80"
127.0.0.1 - - [25/Mar/2017:23:30:43 +0000] "GET /api/atlas/types/classification HTTP/1.1" 200 - "-" "Java/1.7.0_80"
127.0.0.1 - - [25/Mar/2017:23:30:43 +0000] "GET /api/atlas/types/hive_db_v1 HTTP/1.1" 200 - "-" "Java/1.7.0_80"
127.0.0.1 - - [25/Mar/2017:23:30:43 +0000] "POST /api/atlas/entities HTTP/1.1" 201 - "-" "Java/1.7.0_80"
127.0.0.1 - - [25/Mar/2017:23:30:43 +0000] "POST /api/atlas/entities HTTP/1.1" 201 - "-" "Java/1.7.0_80"
127.0.0.1 - - [25/Mar/2017:23:30:44 +0000] "POST /api/atlas/entities HTTP/1.1" 201 - "-" "Java/1.7.0_80"
127.0.0.1 - - [25/Mar/2017:23:30:44 +0000] "POST /api/atlas/entities HTTP/1.1" 201 - "-" "Java/1.7.0_80"
127.0.0.1 - - [25/Mar/2017:23:30:44 +0000] "POST /api/atlas/entities HTTP/1.1" 201 - "-" "Java/1.7.0_80"
127.0.0.1 - - [25/Mar/2017:23:30:44 +0000] "POST /api/atlas/entities HTTP/1.1" 201 - "-" "Java/1.7.0_80"
127.0.0.1 - - [25/Mar/2017:23:30:44 +0000] "POST /api/atlas/entities HTTP/1.1" 201 - "-" "Java/1.7.0_80"
127.0.0.1 - - [25/Mar/2017:23:30:44 +0000] "POST /api/atlas/entities HTTP/1.1" 201 - "-" "Java/1.7.0_80"
127.0.0.1 - - [25/Mar/2017:23:30:44 +0000] "GET /api/atlas/lineage/hive/table/sales_fact_monthly_mvKWn67l4g5R/inputs/graph HTTP/1.1" 200 - "-" "Java/1.7.0_80"
127.0.0.1 - - [25/Mar/2017:23:30:46 +0000] "GET /api/atlas/entities?type=hive_table_v1&property=qualifiedName&value=sales_fact_monthly_mvKWn67l4g5R HTTP/1.1" 200 - "-" "Java/1.7.0_80"
127.0.0.1 - - [25/Mar/2017:23:30:46 +0000] "GET /api/atlas/lineage/4d0da1b4-0290-4acb-bcde-622fd183e613/inputs/graph HTTP/1.1" 200 - "-" "Java/1.7.0_80"
127.0.0.1 - - [25/Mar/2017:23:30:47 +0000] "GET /api/atlas/lineage/hive/table/sales_factjqAZSU7zyb/outputs/graph HTTP/1.1" 200 - "-" "Java/1.7.0_80"
127.0.0.1 - - [25/Mar/2017:23:30:49 +0000] "GET /api/atlas/entities?type=hive_table_v1&property=qualifiedName&value=sales_factjqAZSU7zyb HTTP/1.1" 200 - "-" "Java/1.7.0_80"
127.0.0.1 - - [25/Mar/2017:23:30:49 +0000] "GET /api/atlas/lineage/fcce6112-a3f4-4217-9f6f-ebeff102d11d/outputs/graph HTTP/1.1" 200 - "-" "Java/1.7.0_80"
127.0.0.1 - - [25/Mar/2017:23:30:50 +0000] "GET /api/atlas/lineage/hive/table/sales_factjqAZSU7zyb/schema HTTP/1.1" 200 - "-" "Java/1.7.0_80"
127.0.0.1 - - [25/Mar/2017:23:30:51 +0000] "GET /api/atlas/lineage/hive/table/SalessavZYw9wm0/schema HTTP/1.1" 404 - "-" "Java/1.7.0_80"
127.0.0.1 - - [25/Mar/2017:23:30:51 +0000] "GET /api/atlas/entities?type=hive_table_v1&property=qualifiedName&value=sales_factjqAZSU7zyb HTTP/1.1" 200 - "-" "Java/1.7.0_80"
127.0.0.1 - - [25/Mar/2017:23:30:51 +0000] "GET /api/atlas/lineage/fcce6112-a3f4-4217-9f6f-ebeff102d11d/schema HTTP/1.1" 200 - "-" "Java/1.7.0_80"
127.0.0.1 - - [25/Mar/2017:23:30:52 +0000] "GET /api/atlas/lineage/hive/table/blah/schema HTTP/1.1" 404 - "-" "Java/1.7.0_80"
127.0.0.1 - - [25/Mar/2017:23:30:52 +0000] "GET /api/atlas/entities?type=hive_table_v1&property=qualifiedName&value=sales_fact_monthly_mvf10u7bYuse HTTP/1.1" 200 - "-" "Java/1.7.0_80"
127.0.0.1 - - [25/Mar/2017:23:30:52 +0000] "GET /api/atlas/v2/lineage/467983b3-031c-456a-ba73-870a096a9867?direction=INPUT&depth=5 HTTP/1.1" 200 - "-" "Java/1.7.0_80"
127.0.0.1 - - [25/Mar/2017:23:30:53 +0000] "GET /api/atlas/entities?type=hive_table_v1&property=qualifiedName&value=sales_fact_monthly_mvf10u7bYuse HTTP/1.1" 200 - "-" "Java/1.7.0_80"
127.0.0.1 - - [25/Mar/2017:23:30:53 +0000] "GET /api/atlas/v2/lineage/467983b3-031c-456a-ba73-870a096a9867?direction=BOTH&depth=5 HTTP/1.1" 200 - "-" "Java/1.7.0_80"
127.0.0.1 - - [25/Mar/2017:23:30:55 +0000] "GET /api/atlas/entities?type=hive_table_v1&property=qualifiedName&value=sales_factTtELs4CF7T HTTP/1.1" 200 - "-" "Java/1.7.0_80"
127.0.0.1 - - [25/Mar/2017:23:30:55 +0000] "GET /api/atlas/v2/lineage/94a02bf6-34db-43dd-8cf4-caece85f8dae?direction=OUTPUT&depth=5 HTTP/1.1" 200 - "-" "Java/1.7.0_80"
Tests run: 11, Failures: 0, Errors: 0, Skipped: 0, Time elapsed: 16.756 sec - in org.apache.atlas.web.resources.EntityLineageJerseyResourceIT
Running org.apache.atlas.CredentialProviderUtilityIT
Tests run: 4, Failures: 0, Errors: 0, Skipped: 0, Time elapsed: 1.577 sec - in org.apache.atlas.CredentialProviderUtilityIT
Running org.apache.atlas.notification.EntityNotificationIT
127.0.0.1 - - [25/Mar/2017:23:31:02 +0000] "GET /api/atlas/types/tableType HTTP/1.1" 200 - "-" "Java/1.7.0_80"
127.0.0.1 - - [25/Mar/2017:23:31:02 +0000] "GET /api/atlas/types/serdeType HTTP/1.1" 200 - "-" "Java/1.7.0_80"
127.0.0.1 - - [25/Mar/2017:23:31:02 +0000] "GET /api/atlas/types/classification HTTP/1.1" 200 - "-" "Java/1.7.0_80"
127.0.0.1 - - [25/Mar/2017:23:31:02 +0000] "GET /api/atlas/types/hive_db_v1 HTTP/1.1" 200 - "-" "Java/1.7.0_80"
127.0.0.1 - - [25/Mar/2017:23:31:03 +0000] "POST /api/atlas/entities HTTP/1.1" 201 - "-" "Java/1.7.0_80"
127.0.0.1 - - [25/Mar/2017:23:31:04 +0000] "POST /api/atlas/entities HTTP/1.1" 201 - "-" "Java/1.7.0_80"
127.0.0.1 - - [25/Mar/2017:23:31:05 +0000] "POST /api/atlas/types HTTP/1.1" 201 - "-" "Java/1.7.0_80"
127.0.0.1 - - [25/Mar/2017:23:31:05 +0000] "POST /api/atlas/types HTTP/1.1" 201 - "-" "Java/1.7.0_80"
127.0.0.1 - - [25/Mar/2017:23:31:05 +0000] "POST /api/atlas/types HTTP/1.1" 201 - "-" "Java/1.7.0_80"
127.0.0.1 - - [25/Mar/2017:23:31:05 +0000] "POST /api/atlas/entities/367f4224-a48c-4d9e-9897-04631d6be9fc/traits HTTP/1.1" 201 - "-" "Java/1.7.0_80"
127.0.0.1 - - [25/Mar/2017:23:31:05 +0000] "POST /api/atlas/types HTTP/1.1" 201 - "-" "Java/1.7.0_80"
127.0.0.1 - - [25/Mar/2017:23:31:05 +0000] "POST /api/atlas/entities/367f4224-a48c-4d9e-9897-04631d6be9fc/traits HTTP/1.1" 201 - "-" "Java/1.7.0_80"
127.0.0.1 - - [25/Mar/2017:23:31:05 +0000] "DELETE /api/atlas/entities/367f4224-a48c-4d9e-9897-04631d6be9fc/traits/TraiteLLWydu2Se HTTP/1.1" 200 - "-" "Java/1.7.0_80"
127.0.0.1 - - [25/Mar/2017:23:31:05 +0000] "POST /api/atlas/entities/367f4224-a48c-4d9e-9897-04631d6be9fc?property=description HTTP/1.1" 200 - "-" "Java/1.7.0_80"
127.0.0.1 - - [25/Mar/2017:23:31:05 +0000] "POST /api/atlas/entities HTTP/1.1" 201 - "-" "Java/1.7.0_80"
127.0.0.1 - - [25/Mar/2017:23:31:05 +0000] "POST /api/atlas/entities HTTP/1.1" 201 - "-" "Java/1.7.0_80"
127.0.0.1 - - [25/Mar/2017:23:31:06 +0000] "DELETE /api/atlas/entities?type=hive_table&property=qualifiedName&value=table-jpqLwdP32F HTTP/1.1" 200 - "-" "Java/1.7.0_80"
Tests run: 5, Failures: 0, Errors: 0, Skipped: 0, Time elapsed: 6.384 sec - in org.apache.atlas.notification.EntityNotificationIT
Running org.apache.atlas.notification.NotificationHookConsumerIT
127.0.0.1 - - [25/Mar/2017:23:31:09 +0000] "GET /api/atlas/types/tableType HTTP/1.1" 200 - "-" "Java/1.7.0_80"
127.0.0.1 - - [25/Mar/2017:23:31:09 +0000] "GET /api/atlas/types/serdeType HTTP/1.1" 200 - "-" "Java/1.7.0_80"
127.0.0.1 - - [25/Mar/2017:23:31:09 +0000] "GET /api/atlas/types/classification HTTP/1.1" 200 - "-" "Java/1.7.0_80"
127.0.0.1 - - [25/Mar/2017:23:31:09 +0000] "GET /api/atlas/types/hive_db_v1 HTTP/1.1" 200 - "-" "Java/1.7.0_80"
127.0.0.1 - - [25/Mar/2017:23:31:10 +0000] "GET /api/atlas/discovery/search/dsl?query=hive_db+where+qualifiedName%3D'dbrjD8xwhBJU'&limit=10&offset=0 HTTP/1.1" 200 - "-" "Java/1.7.0_80"
127.0.0.1 - - [25/Mar/2017:23:31:11 +0000] "GET /api/atlas/entities?type=hive_db&property=qualifiedName&value=dbrjD8xwhBJU HTTP/1.1" 200 - "-" "Java/1.7.0_80"
127.0.0.1 - - [25/Mar/2017:23:31:11 +0000] "GET /api/atlas/entities/ee8d62df-bd4f-4151-af4d-08b1273757f9/audit?count=1 HTTP/1.1" 200 - "-" "Java/1.7.0_80"
127.0.0.1 - - [25/Mar/2017:23:31:11 +0000] "POST /api/atlas/entities HTTP/1.1" 201 - "-" "Java/1.7.0_80"
127.0.0.1 - - [25/Mar/2017:23:31:11 +0000] "GET /api/atlas/entities/7b3793c5-b67a-4def-9e0c-3016483fdea5 HTTP/1.1" 200 - "-" "Java/1.7.0_80"
127.0.0.1 - - [25/Mar/2017:23:31:11 +0000] "GET /api/atlas/entities/7b3793c5-b67a-4def-9e0c-3016483fdea5 HTTP/1.1" 200 - "-" "Java/1.7.0_80"
127.0.0.1 - - [25/Mar/2017:23:31:11 +0000] "GET /api/atlas/discovery/search/dsl?query=hive_db+where+name%3D'dbrwH8UEbVAN'&limit=10&offset=0 HTTP/1.1" 200 - "-" "Java/1.7.0_80"
127.0.0.1 - - [25/Mar/2017:23:31:12 +0000] "GET /api/atlas/discovery/search/dsl?query=hive_db+where+name%3D'dbrwH8UEbVAN'&limit=10&offset=0 HTTP/1.1" 200 - "-" "Java/1.7.0_80"
127.0.0.1 - - [25/Mar/2017:23:31:13 +0000] "POST /api/atlas/entities HTTP/1.1" 201 - "-" "Java/1.7.0_80"
127.0.0.1 - - [25/Mar/2017:23:31:13 +0000] "GET /api/atlas/discovery/search/dsl?query=hive_db+where+qualifiedName%3D'dbKNrSofgLn7'&limit=10&offset=0 HTTP/1.1" 200 - "-" "Java/1.7.0_80"
127.0.0.1 - - [25/Mar/2017:23:31:14 +0000] "GET /api/atlas/entities?type=hive_db&property=qualifiedName&value=dbKNrSofgLn7 HTTP/1.1" 200 - "-" "Java/1.7.0_80"
127.0.0.1 - - [25/Mar/2017:23:31:14 +0000] "POST /api/atlas/entities HTTP/1.1" 201 - "-" "Java/1.7.0_80"
127.0.0.1 - - [25/Mar/2017:23:31:14 +0000] "GET /api/atlas/entities?type=hive_db&property=qualifiedName&value=dbvsBPGmY2UX HTTP/1.1" 500 - "-" "Java/1.7.0_80"
127.0.0.1 - - [25/Mar/2017:23:31:14 +0000] "POST /api/atlas/entities HTTP/1.1" 201 - "-" "Java/1.7.0_80"
127.0.0.1 - - [25/Mar/2017:23:31:14 +0000] "GET /api/atlas/discovery/search/dsl?query=hive_db+where+qualifiedName%3D'dbh0kwNpfVot'&limit=10&offset=0 HTTP/1.1" 200 - "-" "Java/1.7.0_80"
127.0.0.1 - - [25/Mar/2017:23:31:15 +0000] "GET /api/atlas/discovery/search/dsl?query=hive_db+where+qualifiedName%3D'dbTGe2GCYRny'&limit=10&offset=0 HTTP/1.1" 200 - "-" "Java/1.7.0_80"
Tests run: 6, Failures: 1, Errors: 0, Skipped: 0, Time elapsed: 9.696 sec <<< FAILURE! - in org.apache.atlas.notification.NotificationHookConsumerIT
testUpdateEntityPartial(org.apache.atlas.notification.NotificationHookConsumerIT)  Time elapsed: 0.575 sec  <<< FAILURE!
org.apache.atlas.AtlasServiceException: Metadata service API org.apache.atlas.AtlasBaseClient$APIInfo@5955c4d1 failed with status 500 (Internal Server Error) Response Body ({"error":"Could not execute operation due to backend exception"})
	at org.apache.atlas.notification.NotificationHookConsumerIT.testUpdateEntityPartial(NotificationHookConsumerIT.java:130)


Results :

Failed tests: 
  NotificationHookConsumerIT.testUpdateEntityPartial:130->BaseResourceIT.waitFor:641 » AtlasService

Tests run: 133, Failures: 1, Errors: 0, Skipped: 0

[INFO] 
[INFO] --- jetty-maven-plugin:9.2.12.v20150709:stop (stop-jetty) @ atlas-webapp ---
[INFO] Waiting 10 seconds for jetty to stop
[INFO] Stopped ServerConnector@38ae2aa2{HTTP/1.1}{0.0.0.0:31000}
[INFO] Closing Spring root WebApplicationContext
[INFO] Shutting down log4j
[INFO] Stopped o.e.j.m.p.JettyWebAppContext@7aae580e{/,<https://builds.apache.org/job/apache-atlas-nightly/ws/webapp/target/atlas-webapp-0.9-incubating-SNAPSHOT/,UNAVAILABLE}{/home/jenkins/jenkins-slave/workspace/apache-atlas-nightly/webapp/target/atlas-webapp-0.9-incubating-SNAPSHOT.war}>
[INFO] Server reports itself as stopped
[INFO] 
[INFO] --- maven-source-plugin:2.4:jar-no-fork (attach-sources) @ atlas-webapp ---
[INFO] Building jar: <https://builds.apache.org/job/apache-atlas-nightly/ws/webapp/target/atlas-webapp-0.9-incubating-SNAPSHOT-sources.jar>
log4j:WARN No appenders could be found for logger (org.apache.zookeeper.ClientCnxn).
log4j:WARN Please initialize the log4j system properly.
log4j:WARN See http://logging.apache.org/log4j/1.2/faq.html#noconfig for more info.
[INFO] 
[INFO] --- maven-source-plugin:2.4:test-jar-no-fork (attach-sources) @ atlas-webapp ---
[INFO] Building jar: <https://builds.apache.org/job/apache-atlas-nightly/ws/webapp/target/atlas-webapp-0.9-incubating-SNAPSHOT-test-sources.jar>
[INFO] 
[INFO] --- maven-failsafe-plugin:2.19.1:verify (verify) @ atlas-webapp ---
[INFO] ------------------------------------------------------------------------
[INFO] Reactor Summary:
[INFO] 
[INFO] Apache Atlas Server Build Tools .................... SUCCESS [  2.503 s]
[INFO] apache-atlas ....................................... SUCCESS [ 19.934 s]
[INFO] Apache Atlas Integration ........................... SUCCESS [01:02 min]
[INFO] Apache Atlas Common ................................ SUCCESS [ 20.566 s]
[INFO] Apache Atlas Typesystem ............................ SUCCESS [01:35 min]
[INFO] Apache Atlas Client ................................ SUCCESS [ 22.444 s]
[INFO] Apache Atlas Server API ............................ SUCCESS [ 11.975 s]
[INFO] Apache Atlas Notification .......................... SUCCESS [ 45.200 s]
[INFO] Apache Atlas Graph Database Projects ............... SUCCESS [  0.635 s]
[INFO] Apache Atlas Graph Database API .................... SUCCESS [  8.279 s]
[INFO] Graph Database Common Code ......................... SUCCESS [  8.240 s]
[INFO] Apache Atlas Titan 1.0.0 GraphDB Impl .............. SUCCESS [ 36.827 s]
[INFO] Shaded version of Apache hbase client .............. SUCCESS [  9.411 s]
[INFO] Apache Atlas Titan 0.5.4 Graph DB Impl ............. SUCCESS [01:47 min]
[INFO] Apache Atlas Graph Database Implementation Dependencies SUCCESS [  0.958 s]
[INFO] Shaded version of Apache hbase server .............. SUCCESS [ 25.102 s]
[INFO] Apache Atlas Repository ............................ SUCCESS [15:59 min]
[INFO] Apache Atlas Authorization ......................... SUCCESS [ 16.032 s]
[INFO] Apache Atlas Business Catalog ...................... SUCCESS [ 35.093 s]
[INFO] Apache Atlas UI .................................... SUCCESS [01:10 min]
[INFO] Apache Atlas Web Application ....................... FAILURE [09:01 min]
[INFO] Apache Atlas Documentation ......................... SKIPPED
[INFO] Apache Atlas FileSystem Model ...................... SKIPPED
[INFO] Apache Atlas Plugin Classloader .................... SKIPPED
[INFO] Apache Atlas Hive Bridge Shim ...................... SKIPPED
[INFO] Apache Atlas Hive Bridge ........................... SKIPPED
[INFO] Apache Atlas Falcon Bridge Shim .................... SKIPPED
[INFO] Apache Atlas Falcon Bridge ......................... SKIPPED
[INFO] Apache Atlas Sqoop Bridge Shim ..................... SKIPPED
[INFO] Apache Atlas Sqoop Bridge .......................... SKIPPED
[INFO] Apache Atlas Storm Bridge Shim ..................... SKIPPED
[INFO] Apache Atlas Storm Bridge .......................... SKIPPED
[INFO] Apache Atlas Distribution .......................... SKIPPED
[INFO] ------------------------------------------------------------------------
[INFO] BUILD FAILURE
[INFO] ------------------------------------------------------------------------
[INFO] Total time: 35:04 min
[INFO] Finished at: 2017-03-25T23:31:22+00:00
[INFO] Final Memory: 351M/1232M
[INFO] ------------------------------------------------------------------------
[ERROR] Failed to execute goal org.apache.maven.plugins:maven-failsafe-plugin:2.19.1:verify (verify) on project atlas-webapp: There are test failures.
[ERROR] 
[ERROR] Please refer to <https://builds.apache.org/job/apache-atlas-nightly/ws/webapp/target/failsafe-reports> for the individual test results.
[ERROR] -> [Help 1]
[ERROR] 
[ERROR] To see the full stack trace of the errors, re-run Maven with the -e switch.
[ERROR] Re-run Maven using the -X switch to enable full debug logging.
[ERROR] 
[ERROR] For more information about the errors and possible solutions, please read the following articles:
[ERROR] [Help 1] http://cwiki.apache.org/confluence/display/MAVEN/MojoFailureException
[ERROR] 
[ERROR] After correcting the problems, you can resume the build with the command
[ERROR]   mvn <goals> -rf :atlas-webapp
Build step 'Execute shell' marked build as failure
[CHECKSTYLE] Collecting checkstyle analysis files...
[CHECKSTYLE] Finding all files that match the pattern **/target/checkstyle-result.xml
[CHECKSTYLE] Parsing 32 files in <https://builds.apache.org/job/apache-atlas-nightly/ws/>
[CHECKSTYLE] Successfully parsed file <https://builds.apache.org/job/apache-atlas-nightly/ws/addons/falcon-bridge-shim/target/checkstyle-result.xml> with 29 unique warnings and 0 duplicates.
[CHECKSTYLE] Successfully parsed file <https://builds.apache.org/job/apache-atlas-nightly/ws/addons/falcon-bridge/target/checkstyle-result.xml> with 419 unique warnings and 0 duplicates.
[CHECKSTYLE] Successfully parsed file <https://builds.apache.org/job/apache-atlas-nightly/ws/addons/hdfs-model/target/checkstyle-result.xml> with 419 unique warnings and 0 duplicates.
[CHECKSTYLE] Successfully parsed file <https://builds.apache.org/job/apache-atlas-nightly/ws/addons/hive-bridge-shim/target/checkstyle-result.xml> with 434 unique warnings and 0 duplicates.
[CHECKSTYLE] Successfully parsed file <https://builds.apache.org/job/apache-atlas-nightly/ws/addons/hive-bridge/target/checkstyle-result.xml> with 2253 unique warnings and 0 duplicates.
[CHECKSTYLE] Successfully parsed file <https://builds.apache.org/job/apache-atlas-nightly/ws/addons/sqoop-bridge-shim/target/checkstyle-result.xml> with 2269 unique warnings and 0 duplicates.
[CHECKSTYLE] Successfully parsed file <https://builds.apache.org/job/apache-atlas-nightly/ws/addons/sqoop-bridge/target/checkstyle-result.xml> with 2398 unique warnings and 0 duplicates.
[CHECKSTYLE] Successfully parsed file <https://builds.apache.org/job/apache-atlas-nightly/ws/addons/storm-bridge-shim/target/checkstyle-result.xml> with 2419 unique warnings and 0 duplicates.
[CHECKSTYLE] Successfully parsed file <https://builds.apache.org/job/apache-atlas-nightly/ws/addons/storm-bridge/target/checkstyle-result.xml> with 2687 unique warnings and 0 duplicates.
[CHECKSTYLE] Successfully parsed file <https://builds.apache.org/job/apache-atlas-nightly/ws/authorization/target/checkstyle-result.xml> with 3151 unique warnings and 0 duplicates.
[CHECKSTYLE] Successfully parsed file <https://builds.apache.org/job/apache-atlas-nightly/ws/catalog/target/checkstyle-result.xml> with 5296 unique warnings and 0 duplicates.
[CHECKSTYLE] Successfully parsed file <https://builds.apache.org/job/apache-atlas-nightly/ws/client/target/checkstyle-result.xml> with 6906 unique warnings and 0 duplicates.
[CHECKSTYLE] Successfully parsed file <https://builds.apache.org/job/apache-atlas-nightly/ws/common/target/checkstyle-result.xml> with 8072 unique warnings and 0 duplicates.
[CHECKSTYLE] Successfully parsed file <https://builds.apache.org/job/apache-atlas-nightly/ws/dashboardv2/target/checkstyle-result.xml> with 8072 unique warnings and 0 duplicates.
[CHECKSTYLE] Successfully parsed file <https://builds.apache.org/job/apache-atlas-nightly/ws/distro/target/checkstyle-result.xml> with 8072 unique warnings and 0 duplicates.
[CHECKSTYLE] Successfully parsed file <https://builds.apache.org/job/apache-atlas-nightly/ws/docs/target/checkstyle-result.xml> with 8072 unique warnings and 0 duplicates.
[CHECKSTYLE] Successfully parsed file <https://builds.apache.org/job/apache-atlas-nightly/ws/graphdb/api/target/checkstyle-result.xml> with 8318 unique warnings and 0 duplicates.
[CHECKSTYLE] Successfully parsed file <https://builds.apache.org/job/apache-atlas-nightly/ws/graphdb/common/target/checkstyle-result.xml> with 8467 unique warnings and 0 duplicates.
[CHECKSTYLE] Successfully parsed file <https://builds.apache.org/job/apache-atlas-nightly/ws/graphdb/graphdb-impls/target/checkstyle-result.xml> with 8467 unique warnings and 0 duplicates.
[CHECKSTYLE] Successfully parsed file <https://builds.apache.org/job/apache-atlas-nightly/ws/graphdb/target/checkstyle-result.xml> with 8467 unique warnings and 0 duplicates.
[CHECKSTYLE] Successfully parsed file <https://builds.apache.org/job/apache-atlas-nightly/ws/graphdb/titan0/target/checkstyle-result.xml> with 10687 unique warnings and 0 duplicates.
[CHECKSTYLE] Successfully parsed file <https://builds.apache.org/job/apache-atlas-nightly/ws/graphdb/titan1/target/checkstyle-result.xml> with 11591 unique warnings and 0 duplicates.
[CHECKSTYLE] Successfully parsed file <https://builds.apache.org/job/apache-atlas-nightly/ws/intg/target/checkstyle-result.xml> with 17525 unique warnings and 0 duplicates.
[CHECKSTYLE] Successfully parsed file <https://builds.apache.org/job/apache-atlas-nightly/ws/notification/target/checkstyle-result.xml> with 18704 unique warnings and 0 duplicates.
[CHECKSTYLE] Successfully parsed file <https://builds.apache.org/job/apache-atlas-nightly/ws/plugin-classloader/target/checkstyle-result.xml> with 18812 unique warnings and 0 duplicates.
[CHECKSTYLE] Successfully parsed file <https://builds.apache.org/job/apache-atlas-nightly/ws/repository/target/checkstyle-result.xml> with 33673 unique warnings and 0 duplicates.
[CHECKSTYLE] Successfully parsed file <https://builds.apache.org/job/apache-atlas-nightly/ws/server-api/target/checkstyle-result.xml> with 34070 unique warnings and 0 duplicates.
[CHECKSTYLE] Successfully parsed file <https://builds.apache.org/job/apache-atlas-nightly/ws/shaded/hbase-client-shaded/target/checkstyle-result.xml> with 34070 unique warnings and 0 duplicates.
[CHECKSTYLE] Successfully parsed file <https://builds.apache.org/job/apache-atlas-nightly/ws/shaded/hbase-server-shaded/target/checkstyle-result.xml> with 34070 unique warnings and 0 duplicates.
[CHECKSTYLE] Successfully parsed file <https://builds.apache.org/job/apache-atlas-nightly/ws/target/checkstyle-result.xml> with 34070 unique warnings and 0 duplicates.
[CHECKSTYLE] Successfully parsed file <https://builds.apache.org/job/apache-atlas-nightly/ws/titan/target/checkstyle-result.xml> with 34532 unique warnings and 0 duplicates.
[CHECKSTYLE] Successfully parsed file <https://builds.apache.org/job/apache-atlas-nightly/ws/typesystem/target/checkstyle-result.xml> with 38751 unique warnings and 0 duplicates.
[CHECKSTYLE] Computing warning deltas based on reference build #695
[FINDBUGS] Collecting findbugs analysis files...
[FINDBUGS] Finding all files that match the pattern **/target/findbugs.xml
[FINDBUGS] Parsing 22 files in <https://builds.apache.org/job/apache-atlas-nightly/ws/>
[FINDBUGS] Successfully parsed file <https://builds.apache.org/job/apache-atlas-nightly/ws/addons/falcon-bridge-shim/target/findbugs.xml> with 0 unique warnings and 0 duplicates.
[FINDBUGS] Successfully parsed file <https://builds.apache.org/job/apache-atlas-nightly/ws/addons/falcon-bridge/target/findbugs.xml> with 0 unique warnings and 0 duplicates.
[FINDBUGS] Successfully parsed file <https://builds.apache.org/job/apache-atlas-nightly/ws/addons/hive-bridge-shim/target/findbugs.xml> with 0 unique warnings and 0 duplicates.
[FINDBUGS] Successfully parsed file <https://builds.apache.org/job/apache-atlas-nightly/ws/addons/hive-bridge/target/findbugs.xml> with 0 unique warnings and 0 duplicates.
[FINDBUGS] Successfully parsed file <https://builds.apache.org/job/apache-atlas-nightly/ws/addons/sqoop-bridge-shim/target/findbugs.xml> with 0 unique warnings and 0 duplicates.
[FINDBUGS] Successfully parsed file <https://builds.apache.org/job/apache-atlas-nightly/ws/addons/sqoop-bridge/target/findbugs.xml> with 0 unique warnings and 0 duplicates.
[FINDBUGS] Successfully parsed file <https://builds.apache.org/job/apache-atlas-nightly/ws/addons/storm-bridge-shim/target/findbugs.xml> with 0 unique warnings and 0 duplicates.
[FINDBUGS] Successfully parsed file <https://builds.apache.org/job/apache-atlas-nightly/ws/addons/storm-bridge/target/findbugs.xml> with 0 unique warnings and 0 duplicates.
[FINDBUGS] Successfully parsed file <https://builds.apache.org/job/apache-atlas-nightly/ws/authorization/target/findbugs.xml> with 0 unique warnings and 0 duplicates.
[FINDBUGS] Successfully parsed file <https://builds.apache.org/job/apache-atlas-nightly/ws/catalog/target/findbugs.xml> with 0 unique warnings and 0 duplicates.
[FINDBUGS] Successfully parsed file <https://builds.apache.org/job/apache-atlas-nightly/ws/client/target/findbugs.xml> with 0 unique warnings and 0 duplicates.
[FINDBUGS] Successfully parsed file <https://builds.apache.org/job/apache-atlas-nightly/ws/common/target/findbugs.xml> with 0 unique warnings and 0 duplicates.
[FINDBUGS] Successfully parsed file <https://builds.apache.org/job/apache-atlas-nightly/ws/graphdb/api/target/findbugs.xml> with 0 unique warnings and 0 duplicates.
[FINDBUGS] Successfully parsed file <https://builds.apache.org/job/apache-atlas-nightly/ws/graphdb/common/target/findbugs.xml> with 0 unique warnings and 0 duplicates.
[FINDBUGS] Successfully parsed file <https://builds.apache.org/job/apache-atlas-nightly/ws/graphdb/titan0/target/findbugs.xml> with 0 unique warnings and 0 duplicates.
[FINDBUGS] Successfully parsed file <https://builds.apache.org/job/apache-atlas-nightly/ws/intg/target/findbugs.xml> with 0 unique warnings and 0 duplicates.
[FINDBUGS] Successfully parsed file <https://builds.apache.org/job/apache-atlas-nightly/ws/notification/target/findbugs.xml> with 0 unique warnings and 0 duplicates.
[FINDBUGS] Successfully parsed file <https://builds.apache.org/job/apache-atlas-nightly/ws/plugin-classloader/target/findbugs.xml> with 0 unique warnings and 0 duplicates.
[FINDBUGS] Successfully parsed file <https://builds.apache.org/job/apache-atlas-nightly/ws/repository/target/findbugs.xml> with 0 unique warnings and 0 duplicates.
[FINDBUGS] Successfully parsed file <https://builds.apache.org/job/apache-atlas-nightly/ws/server-api/target/findbugs.xml> with 0 unique warnings and 0 duplicates.
[FINDBUGS] Successfully parsed file <https://builds.apache.org/job/apache-atlas-nightly/ws/titan/target/findbugs.xml> with 0 unique warnings and 0 duplicates.
[FINDBUGS] Successfully parsed file <https://builds.apache.org/job/apache-atlas-nightly/ws/typesystem/target/findbugs.xml> with 0 unique warnings and 0 duplicates.
[FINDBUGS] Computing warning deltas based on reference build #695
Archiving artifacts
Compressed 566.50 MB of artifacts by 63.6% relative to #695
TestNG Reports Processing: START
Looking for TestNG results report in workspace using pattern: **/target/surefire-reports/testng-results.xml,**/target/failsafe-reports/testng-results.xml
testng-results.xml was last modified before this build started. Ignoring it.
testng-results.xml was last modified before this build started. Ignoring it.
testng-results.xml was last modified before this build started. Ignoring it.
testng-results.xml was last modified before this build started. Ignoring it.
testng-results.xml was last modified before this build started. Ignoring it.
testng-results.xml was last modified before this build started. Ignoring it.
testng-results.xml was last modified before this build started. Ignoring it.
Saving reports...
Processing '/x1/jenkins/jenkins-home/jobs/apache-atlas-nightly/builds/697/testng/testng-results-1.xml'
Processing '/x1/jenkins/jenkins-home/jobs/apache-atlas-nightly/builds/697/testng/testng-results-10.xml'
Processing '/x1/jenkins/jenkins-home/jobs/apache-atlas-nightly/builds/697/testng/testng-results-2.xml'
Processing '/x1/jenkins/jenkins-home/jobs/apache-atlas-nightly/builds/697/testng/testng-results-3.xml'
Processing '/x1/jenkins/jenkins-home/jobs/apache-atlas-nightly/builds/697/testng/testng-results-4.xml'
Processing '/x1/jenkins/jenkins-home/jobs/apache-atlas-nightly/builds/697/testng/testng-results-5.xml'
Processing '/x1/jenkins/jenkins-home/jobs/apache-atlas-nightly/builds/697/testng/testng-results-6.xml'
Processing '/x1/jenkins/jenkins-home/jobs/apache-atlas-nightly/builds/697/testng/testng-results-7.xml'
Processing '/x1/jenkins/jenkins-home/jobs/apache-atlas-nightly/builds/697/testng/testng-results-8.xml'
Processing '/x1/jenkins/jenkins-home/jobs/apache-atlas-nightly/builds/697/testng/testng-results-9.xml'
Processing '/x1/jenkins/jenkins-home/jobs/apache-atlas-nightly/builds/697/testng/testng-results.xml'
1.785714% of tests failed, which exceeded threshold of 0%. Marking build as UNSTABLE
TestNG Reports Processing: FINISH