You are viewing a plain text version of this content. The canonical link for it is here.
Posted to issues@maven.apache.org by "Slawomir Jaranowski (Jira)" <ji...@apache.org> on 2022/03/11 07:17:00 UTC
[jira] [Assigned] (SUREFIRE-2036) Regression: 3.0.0-M5 fails with configured JUnit 5 provider
[ https://issues.apache.org/jira/browse/SUREFIRE-2036?page=com.atlassian.jira.plugin.system.issuetabpanels:all-tabpanel ]
Slawomir Jaranowski reassigned SUREFIRE-2036:
---------------------------------------------
Assignee: Slawomir Jaranowski
> Regression: 3.0.0-M5 fails with configured JUnit 5 provider
> -----------------------------------------------------------
>
> Key: SUREFIRE-2036
> URL: https://issues.apache.org/jira/browse/SUREFIRE-2036
> Project: Maven Surefire
> Issue Type: Bug
> Reporter: Robert James Oxspring
> Assignee: Slawomir Jaranowski
> Priority: Major
> Fix For: 3.0.0-M6
>
>
> SUREFIRE-2033 breaks the automatic configuration of the JUnit 5 provider when {{junit-platform-runner}} happens to be in the classpath, but additionally manual override of this misconfiguration is broken too and results in a {{{}NullPointerException{}}}.
> Specifically, using [https://github.com/apache/maven-surefire/pull/485]:
> {code:java}
> % mvn test -f surefire-its/src/test/resources/surefire-2036 -Dsurefire.version=3.0.0-M5 -X
> ...
> [INFO] ------------------------------------------------------------------------
> [INFO] BUILD FAILURE
> [INFO] ------------------------------------------------------------------------
> [INFO] Total time: 1.022 s
> [INFO] Finished at: 2022-03-09T22:18:36Z
> [INFO] ------------------------------------------------------------------------
> [ERROR] Failed to execute goal org.apache.maven.plugins:maven-surefire-plugin:3.0.0-M5:test (default-test) on project surefire-2036: Execution default-test of goal org.apache.maven.plugins:maven-surefire-plugin:3.0.0-M5:test failed.: NullPointerException -> [Help 1]
> org.apache.maven.lifecycle.LifecycleExecutionException: Failed to execute goal org.apache.maven.plugins:maven-surefire-plugin:3.0.0-M5:test (default-test) on project surefire-2036: Execution default-test of goal org.apache.maven.plugins:maven-surefire-plugin:3.0.0-M5:test failed.
> at org.apache.maven.lifecycle.internal.MojoExecutor.execute (MojoExecutor.java:215)
> at org.apache.maven.lifecycle.internal.MojoExecutor.execute (MojoExecutor.java:156)
> at org.apache.maven.lifecycle.internal.MojoExecutor.execute (MojoExecutor.java:148)
> at org.apache.maven.lifecycle.internal.LifecycleModuleBuilder.buildProject (LifecycleModuleBuilder.java:117)
> at org.apache.maven.lifecycle.internal.LifecycleModuleBuilder.buildProject (LifecycleModuleBuilder.java:81)
> at org.apache.maven.lifecycle.internal.builder.singlethreaded.SingleThreadedBuilder.build (SingleThreadedBuilder.java:56)
> at org.apache.maven.lifecycle.internal.LifecycleStarter.execute (LifecycleStarter.java:128)
> at org.apache.maven.DefaultMaven.doExecute (DefaultMaven.java:305)
> at org.apache.maven.DefaultMaven.doExecute (DefaultMaven.java:192)
> at org.apache.maven.DefaultMaven.execute (DefaultMaven.java:105)
> at org.apache.maven.cli.MavenCli.execute (MavenCli.java:957)
> at org.apache.maven.cli.MavenCli.doMain (MavenCli.java:289)
> at org.apache.maven.cli.MavenCli.main (MavenCli.java:193)
> at jdk.internal.reflect.NativeMethodAccessorImpl.invoke0 (Native Method)
> at jdk.internal.reflect.NativeMethodAccessorImpl.invoke (NativeMethodAccessorImpl.java:62)
> at jdk.internal.reflect.DelegatingMethodAccessorImpl.invoke (DelegatingMethodAccessorImpl.java:43)
> at java.lang.reflect.Method.invoke (Method.java:566)
> at org.codehaus.plexus.classworlds.launcher.Launcher.launchEnhanced (Launcher.java:282)
> at org.codehaus.plexus.classworlds.launcher.Launcher.launch (Launcher.java:225)
> at org.codehaus.plexus.classworlds.launcher.Launcher.mainWithExitCode (Launcher.java:406)
> at org.codehaus.plexus.classworlds.launcher.Launcher.main (Launcher.java:347)
> Caused by: org.apache.maven.plugin.PluginExecutionException: Execution default-test of goal org.apache.maven.plugins:maven-surefire-plugin:3.0.0-M5:test failed.
> at org.apache.maven.plugin.DefaultBuildPluginManager.executeMojo (DefaultBuildPluginManager.java:148)
> at org.apache.maven.lifecycle.internal.MojoExecutor.execute (MojoExecutor.java:210)
> at org.apache.maven.lifecycle.internal.MojoExecutor.execute (MojoExecutor.java:156)
> at org.apache.maven.lifecycle.internal.MojoExecutor.execute (MojoExecutor.java:148)
> at org.apache.maven.lifecycle.internal.LifecycleModuleBuilder.buildProject (LifecycleModuleBuilder.java:117)
> at org.apache.maven.lifecycle.internal.LifecycleModuleBuilder.buildProject (LifecycleModuleBuilder.java:81)
> at org.apache.maven.lifecycle.internal.builder.singlethreaded.SingleThreadedBuilder.build (SingleThreadedBuilder.java:56)
> at org.apache.maven.lifecycle.internal.LifecycleStarter.execute (LifecycleStarter.java:128)
> at org.apache.maven.DefaultMaven.doExecute (DefaultMaven.java:305)
> at org.apache.maven.DefaultMaven.doExecute (DefaultMaven.java:192)
> at org.apache.maven.DefaultMaven.execute (DefaultMaven.java:105)
> at org.apache.maven.cli.MavenCli.execute (MavenCli.java:957)
> at org.apache.maven.cli.MavenCli.doMain (MavenCli.java:289)
> at org.apache.maven.cli.MavenCli.main (MavenCli.java:193)
> at jdk.internal.reflect.NativeMethodAccessorImpl.invoke0 (Native Method)
> at jdk.internal.reflect.NativeMethodAccessorImpl.invoke (NativeMethodAccessorImpl.java:62)
> at jdk.internal.reflect.DelegatingMethodAccessorImpl.invoke (DelegatingMethodAccessorImpl.java:43)
> at java.lang.reflect.Method.invoke (Method.java:566)
> at org.codehaus.plexus.classworlds.launcher.Launcher.launchEnhanced (Launcher.java:282)
> at org.codehaus.plexus.classworlds.launcher.Launcher.launch (Launcher.java:225)
> at org.codehaus.plexus.classworlds.launcher.Launcher.mainWithExitCode (Launcher.java:406)
> at org.codehaus.plexus.classworlds.launcher.Launcher.main (Launcher.java:347)
> Caused by: java.lang.NullPointerException
> at org.apache.maven.plugin.surefire.AbstractSurefireMojo$JUnitPlatformProviderInfo.alignProviderVersions (AbstractSurefireMojo.java:3300)
> at org.apache.maven.plugin.surefire.AbstractSurefireMojo$JUnitPlatformProviderInfo.getProviderClasspath (AbstractSurefireMojo.java:3260)
> at org.apache.maven.plugin.surefire.AbstractSurefireMojo.newStartupConfigWithClasspath (AbstractSurefireMojo.java:1908)
> at org.apache.maven.plugin.surefire.AbstractSurefireMojo.createStartupConfiguration (AbstractSurefireMojo.java:1894)
> at org.apache.maven.plugin.surefire.AbstractSurefireMojo.createForkStarter (AbstractSurefireMojo.java:2374)
> at org.apache.maven.plugin.surefire.AbstractSurefireMojo.executeProvider (AbstractSurefireMojo.java:1310)
> at org.apache.maven.plugin.surefire.AbstractSurefireMojo.executeAfterPreconditionsChecked (AbstractSurefireMojo.java:1159)
> at org.apache.maven.plugin.surefire.AbstractSurefireMojo.execute (AbstractSurefireMojo.java:932)
> at org.apache.maven.plugin.DefaultBuildPluginManager.executeMojo (DefaultBuildPluginManager.java:137)
> at org.apache.maven.lifecycle.internal.MojoExecutor.execute (MojoExecutor.java:210)
> at org.apache.maven.lifecycle.internal.MojoExecutor.execute (MojoExecutor.java:156)
> at org.apache.maven.lifecycle.internal.MojoExecutor.execute (MojoExecutor.java:148)
> at org.apache.maven.lifecycle.internal.LifecycleModuleBuilder.buildProject (LifecycleModuleBuilder.java:117)
> at org.apache.maven.lifecycle.internal.LifecycleModuleBuilder.buildProject (LifecycleModuleBuilder.java:81)
> at org.apache.maven.lifecycle.internal.builder.singlethreaded.SingleThreadedBuilder.build (SingleThreadedBuilder.java:56)
> at org.apache.maven.lifecycle.internal.LifecycleStarter.execute (LifecycleStarter.java:128)
> at org.apache.maven.DefaultMaven.doExecute (DefaultMaven.java:305)
> at org.apache.maven.DefaultMaven.doExecute (DefaultMaven.java:192)
> at org.apache.maven.DefaultMaven.execute (DefaultMaven.java:105)
> at org.apache.maven.cli.MavenCli.execute (MavenCli.java:957)
> at org.apache.maven.cli.MavenCli.doMain (MavenCli.java:289)
> at org.apache.maven.cli.MavenCli.main (MavenCli.java:193)
> at jdk.internal.reflect.NativeMethodAccessorImpl.invoke0 (Native Method)
> at jdk.internal.reflect.NativeMethodAccessorImpl.invoke (NativeMethodAccessorImpl.java:62)
> at jdk.internal.reflect.DelegatingMethodAccessorImpl.invoke (DelegatingMethodAccessorImpl.java:43)
> at java.lang.reflect.Method.invoke (Method.java:566)
> at org.codehaus.plexus.classworlds.launcher.Launcher.launchEnhanced (Launcher.java:282)
> at org.codehaus.plexus.classworlds.launcher.Launcher.launch (Launcher.java:225)
> at org.codehaus.plexus.classworlds.launcher.Launcher.mainWithExitCode (Launcher.java:406)
> at org.codehaus.plexus.classworlds.launcher.Launcher.main (Launcher.java:347)
> [ERROR]
> [ERROR]
> [ERROR] For more information about the errors and possible solutions, please read the following articles:
> [ERROR] [Help 1] http://cwiki.apache.org/confluence/display/MAVEN/PluginExecutionException{code}
> Running older versions shows shows that this wasn't a problem previously:
> {code:java}
> % mvn test -f surefire-its/src/test/resources/surefire-2036 -Dsurefire.version=3.0.0-M1 | tail -n13
> [INFO] Running pkg.JUnit5Test
> [INFO] Tests run: 1, Failures: 0, Errors: 0, Skipped: 0, Time elapsed: 0.016 s - in pkg.JUnit5Test
> [INFO]
> [INFO] Results:
> [INFO]
> [INFO] Tests run: 1, Failures: 0, Errors: 0, Skipped: 0
> [INFO]
> [INFO] ------------------------------------------------------------------------
> [INFO] BUILD SUCCESS
> [INFO] ------------------------------------------------------------------------
> [INFO] Total time: 1.493 s
> [INFO] Finished at: 2022-03-09T22:16:21Z
> [INFO] ------------------------------------------------------------------------
> % mvn test -f surefire-its/src/test/resources/surefire-2036 -Dsurefire.version=3.0.0-M2 | tail -n13
> [INFO] Running pkg.JUnit5Test
> [INFO] Tests run: 1, Failures: 0, Errors: 0, Skipped: 0, Time elapsed: 0.02 s - in pkg.JUnit5Test
> [INFO]
> [INFO] Results:
> [INFO]
> [INFO] Tests run: 1, Failures: 0, Errors: 0, Skipped: 0
> [INFO]
> [INFO] ------------------------------------------------------------------------
> [INFO] BUILD SUCCESS
> [INFO] ------------------------------------------------------------------------
> [INFO] Total time: 1.576 s
> [INFO] Finished at: 2022-03-09T22:16:29Z
> [INFO] ------------------------------------------------------------------------
> % mvn test -f surefire-its/src/test/resources/surefire-2036 -Dsurefire.version=3.0.0-M3 | tail -n13
> [INFO] Running pkg.JUnit5Test
> [INFO] Tests run: 1, Failures: 0, Errors: 0, Skipped: 0, Time elapsed: 0.011 s - in pkg.JUnit5Test
> [INFO]
> [INFO] Results:
> [INFO]
> [INFO] Tests run: 1, Failures: 0, Errors: 0, Skipped: 0
> [INFO]
> [INFO] ------------------------------------------------------------------------
> [INFO] BUILD SUCCESS
> [INFO] ------------------------------------------------------------------------
> [INFO] Total time: 1.492 s
> [INFO] Finished at: 2022-03-09T22:16:34Z
> [INFO] ------------------------------------------------------------------------
> % mvn test -f surefire-its/src/test/resources/surefire-2036 -Dsurefire.version=3.0.0-M4 | tail -n13
> [INFO] Running pkg.JUnit5Test
> [INFO] Tests run: 1, Failures: 0, Errors: 0, Skipped: 0, Time elapsed: 0.036 s - in pkg.JUnit5Test
> [INFO]
> [INFO] Results:
> [INFO]
> [INFO] Tests run: 1, Failures: 0, Errors: 0, Skipped: 0
> [INFO]
> [INFO] ------------------------------------------------------------------------
> [INFO] BUILD SUCCESS
> [INFO] ------------------------------------------------------------------------
> [INFO] Total time: 1.723 s
> [INFO] Finished at: 2022-03-09T22:16:40Z
> [INFO] ------------------------------------------------------------------------
> {code}
> h1.
--
This message was sent by Atlassian Jira
(v8.20.1#820001)