You are viewing a plain text version of this content. The canonical link for it is here.
Posted to commits@beam.apache.org by Apache Jenkins Server <je...@builds.apache.org> on 2017/09/26 09:07:18 UTC
Build failed in Jenkins: beam_PostCommit_Python_Verify #3216
See <https://builds.apache.org/job/beam_PostCommit_Python_Verify/3216/display/redirect>
------------------------------------------
[...truncated 44.47 KB...]
Collecting mock<3.0.0,>=1.0.1 (from apache-beam==2.2.0.dev0)
Using cached mock-2.0.0-py2.py3-none-any.whl
Collecting oauth2client<4.0.0,>=2.0.1 (from apache-beam==2.2.0.dev0)
Collecting protobuf<=3.3.0,>=3.2.0 (from apache-beam==2.2.0.dev0)
Using cached protobuf-3.3.0-cp27-cp27mu-manylinux1_x86_64.whl
Collecting pyyaml<4.0.0,>=3.12 (from apache-beam==2.2.0.dev0)
Collecting six<1.11,>=1.9 (from apache-beam==2.2.0.dev0)
Using cached six-1.10.0-py2.py3-none-any.whl
Collecting typing<3.7.0,>=3.6.0 (from apache-beam==2.2.0.dev0)
Using cached typing-3.6.2-py2-none-any.whl
Requirement already satisfied: enum34>=1.0.4 in ./target/.tox/py27cython/lib/python2.7/site-packages (from grpcio<2.0,>=1.0->apache-beam==2.2.0.dev0)
Requirement already satisfied: futures>=2.2.0 in ./target/.tox/py27cython/lib/python2.7/site-packages (from grpcio<2.0,>=1.0->apache-beam==2.2.0.dev0)
Collecting funcsigs>=1; python_version < "3.3" (from mock<3.0.0,>=1.0.1->apache-beam==2.2.0.dev0)
Using cached funcsigs-1.0.2-py2.py3-none-any.whl
Collecting pbr>=0.11 (from mock<3.0.0,>=1.0.1->apache-beam==2.2.0.dev0)
Using cached pbr-3.1.1-py2.py3-none-any.whl
Collecting pyasn1>=0.1.7 (from oauth2client<4.0.0,>=2.0.1->apache-beam==2.2.0.dev0)
Using cached pyasn1-0.3.6-py2.py3-none-any.whl
Collecting rsa>=3.1.4 (from oauth2client<4.0.0,>=2.0.1->apache-beam==2.2.0.dev0)
Using cached rsa-3.4.2-py2.py3-none-any.whl
Collecting pyasn1-modules>=0.0.5 (from oauth2client<4.0.0,>=2.0.1->apache-beam==2.2.0.dev0)
Using cached pyasn1_modules-0.1.4-py2.py3-none-any.whl
Requirement already satisfied: setuptools in ./target/.tox/py27cython/lib/python2.7/site-packages (from protobuf<=3.3.0,>=3.2.0->apache-beam==2.2.0.dev0)
Building wheels for collected packages: apache-beam
Running setup.py bdist_wheel for apache-beam: started
Running setup.py bdist_wheel for apache-beam: finished with status 'error'
Complete output from command <https://builds.apache.org/job/beam_PostCommit_Python_Verify/ws/sdks/python/target/.tox/py27cython/bin/python> -u -c "import setuptools, tokenize;__file__='/tmp/pip-bwb8_k-build/setup.py';f=getattr(tokenize, 'open', open)(__file__);code=f.read().replace('\r\n', '\n');f.close();exec(compile(code, __file__, 'exec'))" bdist_wheel -d /tmp/tmpSlFhVEpip-wheel- --python-tag cp27:
<https://builds.apache.org/job/beam_PostCommit_Python_Verify/ws/sdks/python/target/.tox/py27cython/local/lib/python2.7/site-packages/setuptools/dist.py>:351: UserWarning: Normalizing '2.2.0.dev' to '2.2.0.dev0'
normalized_version,
running bdist_wheel
running build
running build_py
Traceback (most recent call last):
File "<string>", line 1, in <module>
File "/tmp/pip-bwb8_k-build/setup.py", line 203, in <module>
'test': generate_protos_first(test),
File "/usr/lib/python2.7/distutils/core.py", line 151, in setup
dist.run_commands()
File "/usr/lib/python2.7/distutils/dist.py", line 953, in run_commands
self.run_command(cmd)
File "/usr/lib/python2.7/distutils/dist.py", line 972, in run_command
cmd_obj.run()
File "<https://builds.apache.org/job/beam_PostCommit_Python_Verify/ws/sdks/python/target/.tox/py27cython/local/lib/python2.7/site-packages/wheel/bdist_wheel.py",> line 204, in run
self.run_command('build')
File "/usr/lib/python2.7/distutils/cmd.py", line 326, in run_command
self.distribution.run_command(command)
File "/usr/lib/python2.7/distutils/dist.py", line 972, in run_command
cmd_obj.run()
File "/usr/lib/python2.7/distutils/command/build.py", line 128, in run
self.run_command(cmd_name)
File "/usr/lib/python2.7/distutils/cmd.py", line 326, in run_command
self.distribution.run_command(command)
File "/usr/lib/python2.7/distutils/dist.py", line 972, in run_command
cmd_obj.run()
File "/tmp/pip-bwb8_k-build/setup.py", line 143, in run
gen_protos.generate_proto_files()
File "gen_protos.py", line 65, in generate_proto_files
'Not in apache git tree; unable to find proto definitions.')
RuntimeError: Not in apache git tree; unable to find proto definitions.
----------------------------------------
Failed building wheel for apache-beam
Running setup.py clean for apache-beam
Failed to build apache-beam
Installing collected packages: avro, crcmod, dill, httplib2, funcsigs, pbr, six, mock, pyasn1, rsa, pyasn1-modules, oauth2client, protobuf, pyyaml, typing, apache-beam
Found existing installation: six 1.11.0
Uninstalling six-1.11.0:
Successfully uninstalled six-1.11.0
Found existing installation: protobuf 3.4.0
Uninstalling protobuf-3.4.0:
Successfully uninstalled protobuf-3.4.0
Running setup.py install for apache-beam: started
Running setup.py install for apache-beam: finished with status 'error'
Complete output from command <https://builds.apache.org/job/beam_PostCommit_Python_Verify/ws/sdks/python/target/.tox/py27cython/bin/python> -u -c "import setuptools, tokenize;__file__='/tmp/pip-bwb8_k-build/setup.py';f=getattr(tokenize, 'open', open)(__file__);code=f.read().replace('\r\n', '\n');f.close();exec(compile(code, __file__, 'exec'))" install --record /tmp/pip-GHuaRd-record/install-record.txt --single-version-externally-managed --compile --install-headers <https://builds.apache.org/job/beam_PostCommit_Python_Verify/ws/sdks/python/target/.tox/py27cython/include/site/python2.7/apache-beam>:
<https://builds.apache.org/job/beam_PostCommit_Python_Verify/ws/sdks/python/target/.tox/py27cython/local/lib/python2.7/site-packages/setuptools/dist.py>:351: UserWarning: Normalizing '2.2.0.dev' to '2.2.0.dev0'
normalized_version,
running install
running build
running build_py
Traceback (most recent call last):
File "<string>", line 1, in <module>
File "/tmp/pip-bwb8_k-build/setup.py", line 203, in <module>
'test': generate_protos_first(test),
File "/usr/lib/python2.7/distutils/core.py", line 151, in setup
dist.run_commands()
File "/usr/lib/python2.7/distutils/dist.py", line 953, in run_commands
self.run_command(cmd)
File "/usr/lib/python2.7/distutils/dist.py", line 972, in run_command
cmd_obj.run()
File "<https://builds.apache.org/job/beam_PostCommit_Python_Verify/ws/sdks/python/target/.tox/py27cython/local/lib/python2.7/site-packages/setuptools/command/install.py",> line 61, in run
return orig.install.run(self)
File "/usr/lib/python2.7/distutils/command/install.py", line 601, in run
self.run_command('build')
File "/usr/lib/python2.7/distutils/cmd.py", line 326, in run_command
self.distribution.run_command(command)
File "/usr/lib/python2.7/distutils/dist.py", line 972, in run_command
cmd_obj.run()
File "/usr/lib/python2.7/distutils/command/build.py", line 128, in run
self.run_command(cmd_name)
File "/usr/lib/python2.7/distutils/cmd.py", line 326, in run_command
self.distribution.run_command(command)
File "/usr/lib/python2.7/distutils/dist.py", line 972, in run_command
cmd_obj.run()
File "/tmp/pip-bwb8_k-build/setup.py", line 143, in run
gen_protos.generate_proto_files()
File "gen_protos.py", line 65, in generate_proto_files
'Not in apache git tree; unable to find proto definitions.')
RuntimeError: Not in apache git tree; unable to find proto definitions.
----------------------------------------
Command "<https://builds.apache.org/job/beam_PostCommit_Python_Verify/ws/sdks/python/target/.tox/py27cython/bin/python> -u -c "import setuptools, tokenize;__file__='/tmp/pip-bwb8_k-build/setup.py';f=getattr(tokenize, 'open', open)(__file__);code=f.read().replace('\r\n', '\n');f.close();exec(compile(code, __file__, 'exec'))" install --record /tmp/pip-GHuaRd-record/install-record.txt --single-version-externally-managed --compile --install-headers <https://builds.apache.org/job/beam_PostCommit_Python_Verify/ws/sdks/python/target/.tox/py27cython/include/site/python2.7/apache-beam"> failed with error code 1 in /tmp/pip-bwb8_k-build/
py27cython installed: avro==1.8.2,crcmod==1.7,Cython==0.25.2,dill==0.2.6,enum34==1.1.6,funcsigs==1.0.2,futures==3.1.1,grpcio==1.6.0,grpcio-tools==1.3.5,httplib2==0.9.2,mock==2.0.0,nose==1.3.7,oauth2client==3.0.0,pbr==3.1.1,protobuf==3.3.0,pyasn1==0.3.6,pyasn1-modules==0.1.4,PyYAML==3.12,rsa==3.4.2,six==1.10.0,typing==3.6.2
py27gcp create: <https://builds.apache.org/job/beam_PostCommit_Python_Verify/ws/sdks/python/target/.tox/py27gcp>
py27gcp installdeps: nose==1.3.7
py27gcp inst: <https://builds.apache.org/job/beam_PostCommit_Python_Verify/ws/sdks/python/target/.tox/dist/apache-beam-2.2.0.dev.zip>
ERROR: invocation failed (exit code 1), logfile: <https://builds.apache.org/job/beam_PostCommit_Python_Verify/ws/sdks/python/target/.tox/py27gcp/log/py27gcp-2.log>
ERROR: actionid: py27gcp
msg: installpkg
cmdargs: [local('<https://builds.apache.org/job/beam_PostCommit_Python_Verify/ws/sdks/python/target/.tox/py27gcp/bin/pip'),> 'install', '<https://builds.apache.org/job/beam_PostCommit_Python_Verify/ws/sdks/python/target/.tox/dist/apache-beam-2.2.0.dev.zip']>
env: {'JENKINS_HOME': '/x1/jenkins/jenkins-home', 'BUILD_CAUSE': 'TIMERTRIGGER', 'GIT_COMMIT': '352f106f992a2ff4c08274685657242f04f967ef', 'HUDSON_URL': 'https://builds.apache.org/', 'BUILD_URL': 'https://builds.apache.org/job/beam_PostCommit_Python_Verify/3216/', 'GIT_PREVIOUS_COMMIT': '352f106f992a2ff4c08274685657242f04f967ef', 'BUILD_TAG': 'jenkins-beam_PostCommit_Python_Verify-3216', 'SSH_CLIENT': '62.210.60.235 55148 22', 'JENKINS_URL': 'https://builds.apache.org/', 'LOGNAME': 'jenkins', 'USER': 'jenkins', 'WORKSPACE': '<https://builds.apache.org/job/beam_PostCommit_Python_Verify/ws/',> 'HOME': '/home/jenkins', 'PATH': '<https://builds.apache.org/job/beam_PostCommit_Python_Verify/ws/sdks/python/target/.tox/py27gcp/bin>:/home/jenkins/tools/java/latest1.8/bin:/usr/local/sbin:/usr/local/bin:/usr/sbin:/usr/bin:/sbin:/bin:/usr/games:/usr/local/games', 'JOB_NAME': 'beam_PostCommit_Python_Verify', 'LANG': 'en_US.UTF-8', 'RUN_DISPLAY_URL': 'https://builds.apache.org/job/beam_PostCommit_Python_Verify/3216/display/redirect', 'VIRTUAL_ENV': '<https://builds.apache.org/job/beam_PostCommit_Python_Verify/ws/sdks/python/target/.tox/py27gcp',> 'SHELL': '/bin/bash', 'GIT_PREVIOUS_SUCCESSFUL_COMMIT': '352f106f992a2ff4c08274685657242f04f967ef', 'SHLVL': '3', 'NLSPATH': '/usr/dt/lib/nls/msg/%L/%N.cat', 'GIT_AUTHOR_EMAIL': 'builds@apache.org', 'HUDSON_HOME': '/x1/jenkins/jenkins-home', 'NODE_LABELS': 'beam beam3', 'GIT_COMMITTER_EMAIL': 'builds@apache.org', 'BUILD_CAUSE_TIMERTRIGGER': 'true', 'PYTHONHASHSEED': '1916936165', 'JAVA_HOME': '/home/jenkins/tools/java/latest1.8', 'ROOT_BUILD_CAUSE': 'TIMERTRIGGER', 'BUILD_ID': '3216', 'BUILD_NUMBER': '3216', 'XDG_RUNTIME_DIR': '/run/user/9997', 'HUDSON_COOKIE': 'c8daf14e-ca60-41df-b11d-721956eeaf8a', 'JOB_URL': 'https://builds.apache.org/job/beam_PostCommit_Python_Verify/', 'TEST_HOST': 'beam3', 'GIT_BRANCH': 'origin/master', 'JOB_BASE_NAME': 'beam_PostCommit_Python_Verify', 'GIT_AUTHOR_NAME': 'jenkins', 'ROOT_BUILD_CAUSE_TIMERTRIGGER': 'true', 'GIT_COMMITTER_NAME': 'jenkins', 'XDG_SESSION_ID': '122', '_': '/home/jenkins/.local/bin//tox', 'sha1': 'master', 'COVERALLS_REPO_TOKEN': '****', 'JOB_DISPLAY_URL': 'https://builds.apache.org/job/beam_PostCommit_Python_Verify/display/redirect', 'HUDSON_SERVER_COOKIE': 'f4ebd1e6b0d976e8', 'EXECUTOR_NUMBER': '0', 'NODE_NAME': 'beam3', 'PWD': '<https://builds.apache.org/job/beam_PostCommit_Python_Verify/ws/',> 'SPARK_LOCAL_IP': '127.0.0.1', 'JENKINS_SERVER_COOKIE': 'f4ebd1e6b0d976e8', 'BUILD_DISPLAY_NAME': '#3216', 'XFILESEARCHPATH': '/usr/dt/app-defaults/%L/Dt', 'MAIL': '/var/mail/jenkins', 'SSH_CONNECTION': '62.210.60.235 55148 10.128.0.4 22', 'RUN_CHANGES_DISPLAY_URL': 'https://builds.apache.org/job/beam_PostCommit_Python_Verify/3216/display/redirect?page=changes', 'GIT_URL': 'https://github.com/apache/beam.git'}
Processing ./target/.tox/dist/apache-beam-2.2.0.dev.zip
Collecting avro<2.0.0,>=1.8.1 (from apache-beam==2.2.0.dev0)
Collecting crcmod<2.0,>=1.7 (from apache-beam==2.2.0.dev0)
Collecting dill==0.2.6 (from apache-beam==2.2.0.dev0)
Collecting grpcio<2.0,>=1.0 (from apache-beam==2.2.0.dev0)
Using cached grpcio-1.6.0-cp27-cp27mu-manylinux1_x86_64.whl
Collecting httplib2<0.10,>=0.8 (from apache-beam==2.2.0.dev0)
Collecting mock<3.0.0,>=1.0.1 (from apache-beam==2.2.0.dev0)
Using cached mock-2.0.0-py2.py3-none-any.whl
Collecting oauth2client<4.0.0,>=2.0.1 (from apache-beam==2.2.0.dev0)
Collecting protobuf<=3.3.0,>=3.2.0 (from apache-beam==2.2.0.dev0)
Using cached protobuf-3.3.0-cp27-cp27mu-manylinux1_x86_64.whl
Collecting pyyaml<4.0.0,>=3.12 (from apache-beam==2.2.0.dev0)
Collecting six<1.11,>=1.9 (from apache-beam==2.2.0.dev0)
Using cached six-1.10.0-py2.py3-none-any.whl
Collecting typing<3.7.0,>=3.6.0 (from apache-beam==2.2.0.dev0)
Using cached typing-3.6.2-py2-none-any.whl
Collecting enum34>=1.0.4 (from grpcio<2.0,>=1.0->apache-beam==2.2.0.dev0)
Using cached enum34-1.1.6-py2-none-any.whl
Collecting futures>=2.2.0 (from grpcio<2.0,>=1.0->apache-beam==2.2.0.dev0)
Using cached futures-3.1.1-py2-none-any.whl
Collecting funcsigs>=1; python_version < "3.3" (from mock<3.0.0,>=1.0.1->apache-beam==2.2.0.dev0)
Using cached funcsigs-1.0.2-py2.py3-none-any.whl
Collecting pbr>=0.11 (from mock<3.0.0,>=1.0.1->apache-beam==2.2.0.dev0)
Using cached pbr-3.1.1-py2.py3-none-any.whl
Collecting pyasn1>=0.1.7 (from oauth2client<4.0.0,>=2.0.1->apache-beam==2.2.0.dev0)
Using cached pyasn1-0.3.6-py2.py3-none-any.whl
Collecting rsa>=3.1.4 (from oauth2client<4.0.0,>=2.0.1->apache-beam==2.2.0.dev0)
Using cached rsa-3.4.2-py2.py3-none-any.whl
Collecting pyasn1-modules>=0.0.5 (from oauth2client<4.0.0,>=2.0.1->apache-beam==2.2.0.dev0)
Using cached pyasn1_modules-0.1.4-py2.py3-none-any.whl
Requirement already satisfied: setuptools in ./target/.tox/py27gcp/lib/python2.7/site-packages (from protobuf<=3.3.0,>=3.2.0->apache-beam==2.2.0.dev0)
Building wheels for collected packages: apache-beam
Running setup.py bdist_wheel for apache-beam: started
Running setup.py bdist_wheel for apache-beam: finished with status 'error'
Complete output from command <https://builds.apache.org/job/beam_PostCommit_Python_Verify/ws/sdks/python/target/.tox/py27gcp/bin/python> -u -c "import setuptools, tokenize;__file__='/tmp/pip-MNdiLM-build/setup.py';f=getattr(tokenize, 'open', open)(__file__);code=f.read().replace('\r\n', '\n');f.close();exec(compile(code, __file__, 'exec'))" bdist_wheel -d /tmp/tmp3Af35epip-wheel- --python-tag cp27:
<https://builds.apache.org/job/beam_PostCommit_Python_Verify/ws/sdks/python/target/.tox/py27gcp/local/lib/python2.7/site-packages/setuptools/dist.py>:351: UserWarning: Normalizing '2.2.0.dev' to '2.2.0.dev0'
normalized_version,
running bdist_wheel
running build
running build_py
gen_protos.py:46: UserWarning: Installing grpcio-tools is recommended for development.
warnings.warn('Installing grpcio-tools is recommended for development.')
Traceback (most recent call last):
File "<string>", line 1, in <module>
File "/tmp/pip-MNdiLM-build/setup.py", line 203, in <module>
'test': generate_protos_first(test),
File "/usr/lib/python2.7/distutils/core.py", line 151, in setup
dist.run_commands()
File "/usr/lib/python2.7/distutils/dist.py", line 953, in run_commands
self.run_command(cmd)
File "/usr/lib/python2.7/distutils/dist.py", line 972, in run_command
cmd_obj.run()
File "<https://builds.apache.org/job/beam_PostCommit_Python_Verify/ws/sdks/python/target/.tox/py27gcp/local/lib/python2.7/site-packages/wheel/bdist_wheel.py",> line 204, in run
self.run_command('build')
File "/usr/lib/python2.7/distutils/cmd.py", line 326, in run_command
self.distribution.run_command(command)
File "/usr/lib/python2.7/distutils/dist.py", line 972, in run_command
cmd_obj.run()
File "/usr/lib/python2.7/distutils/command/build.py", line 128, in run
self.run_command(cmd_name)
File "/usr/lib/python2.7/distutils/cmd.py", line 326, in run_command
self.distribution.run_command(command)
File "/usr/lib/python2.7/distutils/dist.py", line 972, in run_command
cmd_obj.run()
File "/tmp/pip-MNdiLM-build/setup.py", line 143, in run
gen_protos.generate_proto_files()
File "gen_protos.py", line 65, in generate_proto_files
'Not in apache git tree; unable to find proto definitions.')
RuntimeError: Not in apache git tree; unable to find proto definitions.
----------------------------------------
Failed building wheel for apache-beam
Running setup.py clean for apache-beam
Failed to build apache-beam
Installing collected packages: avro, crcmod, dill, six, protobuf, enum34, futures, grpcio, httplib2, funcsigs, pbr, mock, pyasn1, rsa, pyasn1-modules, oauth2client, pyyaml, typing, apache-beam
Running setup.py install for apache-beam: started
Running setup.py install for apache-beam: finished with status 'error'
Complete output from command <https://builds.apache.org/job/beam_PostCommit_Python_Verify/ws/sdks/python/target/.tox/py27gcp/bin/python> -u -c "import setuptools, tokenize;__file__='/tmp/pip-MNdiLM-build/setup.py';f=getattr(tokenize, 'open', open)(__file__);code=f.read().replace('\r\n', '\n');f.close();exec(compile(code, __file__, 'exec'))" install --record /tmp/pip-fVeUx9-record/install-record.txt --single-version-externally-managed --compile --install-headers <https://builds.apache.org/job/beam_PostCommit_Python_Verify/ws/sdks/python/target/.tox/py27gcp/include/site/python2.7/apache-beam>:
<https://builds.apache.org/job/beam_PostCommit_Python_Verify/ws/sdks/python/target/.tox/py27gcp/local/lib/python2.7/site-packages/setuptools/dist.py>:351: UserWarning: Normalizing '2.2.0.dev' to '2.2.0.dev0'
normalized_version,
running install
running build
running build_py
gen_protos.py:46: UserWarning: Installing grpcio-tools is recommended for development.
warnings.warn('Installing grpcio-tools is recommended for development.')
Traceback (most recent call last):
File "<string>", line 1, in <module>
File "/tmp/pip-MNdiLM-build/setup.py", line 203, in <module>
'test': generate_protos_first(test),
File "/usr/lib/python2.7/distutils/core.py", line 151, in setup
dist.run_commands()
File "/usr/lib/python2.7/distutils/dist.py", line 953, in run_commands
self.run_command(cmd)
File "/usr/lib/python2.7/distutils/dist.py", line 972, in run_command
cmd_obj.run()
File "<https://builds.apache.org/job/beam_PostCommit_Python_Verify/ws/sdks/python/target/.tox/py27gcp/local/lib/python2.7/site-packages/setuptools/command/install.py",> line 61, in run
return orig.install.run(self)
File "/usr/lib/python2.7/distutils/command/install.py", line 601, in run
self.run_command('build')
File "/usr/lib/python2.7/distutils/cmd.py", line 326, in run_command
self.distribution.run_command(command)
File "/usr/lib/python2.7/distutils/dist.py", line 972, in run_command
cmd_obj.run()
File "/usr/lib/python2.7/distutils/command/build.py", line 128, in run
self.run_command(cmd_name)
File "/usr/lib/python2.7/distutils/cmd.py", line 326, in run_command
self.distribution.run_command(command)
File "/usr/lib/python2.7/distutils/dist.py", line 972, in run_command
cmd_obj.run()
File "/tmp/pip-MNdiLM-build/setup.py", line 143, in run
gen_protos.generate_proto_files()
File "gen_protos.py", line 65, in generate_proto_files
'Not in apache git tree; unable to find proto definitions.')
RuntimeError: Not in apache git tree; unable to find proto definitions.
----------------------------------------
Command "<https://builds.apache.org/job/beam_PostCommit_Python_Verify/ws/sdks/python/target/.tox/py27gcp/bin/python> -u -c "import setuptools, tokenize;__file__='/tmp/pip-MNdiLM-build/setup.py';f=getattr(tokenize, 'open', open)(__file__);code=f.read().replace('\r\n', '\n');f.close();exec(compile(code, __file__, 'exec'))" install --record /tmp/pip-fVeUx9-record/install-record.txt --single-version-externally-managed --compile --install-headers <https://builds.apache.org/job/beam_PostCommit_Python_Verify/ws/sdks/python/target/.tox/py27gcp/include/site/python2.7/apache-beam"> failed with error code 1 in /tmp/pip-MNdiLM-build/
py27gcp installed: avro==1.8.2,crcmod==1.7,dill==0.2.6,enum34==1.1.6,funcsigs==1.0.2,futures==3.1.1,grpcio==1.6.0,httplib2==0.9.2,mock==2.0.0,nose==1.3.7,oauth2client==3.0.0,pbr==3.1.1,protobuf==3.3.0,pyasn1==0.3.6,pyasn1-modules==0.1.4,PyYAML==3.12,rsa==3.4.2,six==1.10.0,typing==3.6.2
___________________________________ summary ____________________________________
ERROR: docs: InvocationError: <https://builds.apache.org/job/beam_PostCommit_Python_Verify/ws/sdks/python/target/.tox/docs/bin/pip> install <https://builds.apache.org/job/beam_PostCommit_Python_Verify/ws/sdks/python/target/.tox/dist/apache-beam-2.2.0.dev.zip> (see <https://builds.apache.org/job/beam_PostCommit_Python_Verify/ws/sdks/python/target/.tox/docs/log/docs-2.log)>
ERROR: lint: InvocationError: <https://builds.apache.org/job/beam_PostCommit_Python_Verify/ws/sdks/python/target/.tox/lint/bin/pip> install <https://builds.apache.org/job/beam_PostCommit_Python_Verify/ws/sdks/python/target/.tox/dist/apache-beam-2.2.0.dev.zip> (see <https://builds.apache.org/job/beam_PostCommit_Python_Verify/ws/sdks/python/target/.tox/lint/log/lint-2.log)>
ERROR: py27: InvocationError: <https://builds.apache.org/job/beam_PostCommit_Python_Verify/ws/sdks/python/target/.tox/py27/bin/pip> install <https://builds.apache.org/job/beam_PostCommit_Python_Verify/ws/sdks/python/target/.tox/dist/apache-beam-2.2.0.dev.zip> (see <https://builds.apache.org/job/beam_PostCommit_Python_Verify/ws/sdks/python/target/.tox/py27/log/py27-2.log)>
ERROR: py27cython: InvocationError: <https://builds.apache.org/job/beam_PostCommit_Python_Verify/ws/sdks/python/target/.tox/py27cython/bin/pip> install <https://builds.apache.org/job/beam_PostCommit_Python_Verify/ws/sdks/python/target/.tox/dist/apache-beam-2.2.0.dev.zip> (see <https://builds.apache.org/job/beam_PostCommit_Python_Verify/ws/sdks/python/target/.tox/py27cython/log/py27cython-2.log)>
ERROR: py27gcp: InvocationError: <https://builds.apache.org/job/beam_PostCommit_Python_Verify/ws/sdks/python/target/.tox/py27gcp/bin/pip> install <https://builds.apache.org/job/beam_PostCommit_Python_Verify/ws/sdks/python/target/.tox/dist/apache-beam-2.2.0.dev.zip> (see <https://builds.apache.org/job/beam_PostCommit_Python_Verify/ws/sdks/python/target/.tox/py27gcp/log/py27gcp-2.log)>
Build step 'Execute shell' marked build as failure
Jenkins build is back to normal : beam_PostCommit_Python_Verify
#3218
Posted by Apache Jenkins Server <je...@builds.apache.org>.
See <https://builds.apache.org/job/beam_PostCommit_Python_Verify/3218/display/redirect?page=changes>
Build failed in Jenkins: beam_PostCommit_Python_Verify #3217
Posted by Apache Jenkins Server <je...@builds.apache.org>.
See <https://builds.apache.org/job/beam_PostCommit_Python_Verify/3217/display/redirect>
------------------------------------------
[...truncated 44.47 KB...]
Collecting mock<3.0.0,>=1.0.1 (from apache-beam==2.2.0.dev0)
Using cached mock-2.0.0-py2.py3-none-any.whl
Collecting oauth2client<4.0.0,>=2.0.1 (from apache-beam==2.2.0.dev0)
Collecting protobuf<=3.3.0,>=3.2.0 (from apache-beam==2.2.0.dev0)
Using cached protobuf-3.3.0-cp27-cp27mu-manylinux1_x86_64.whl
Collecting pyyaml<4.0.0,>=3.12 (from apache-beam==2.2.0.dev0)
Collecting six<1.11,>=1.9 (from apache-beam==2.2.0.dev0)
Using cached six-1.10.0-py2.py3-none-any.whl
Collecting typing<3.7.0,>=3.6.0 (from apache-beam==2.2.0.dev0)
Using cached typing-3.6.2-py2-none-any.whl
Requirement already satisfied: enum34>=1.0.4 in ./target/.tox/py27cython/lib/python2.7/site-packages (from grpcio<2.0,>=1.0->apache-beam==2.2.0.dev0)
Requirement already satisfied: futures>=2.2.0 in ./target/.tox/py27cython/lib/python2.7/site-packages (from grpcio<2.0,>=1.0->apache-beam==2.2.0.dev0)
Collecting pbr>=0.11 (from mock<3.0.0,>=1.0.1->apache-beam==2.2.0.dev0)
Using cached pbr-3.1.1-py2.py3-none-any.whl
Collecting funcsigs>=1; python_version < "3.3" (from mock<3.0.0,>=1.0.1->apache-beam==2.2.0.dev0)
Using cached funcsigs-1.0.2-py2.py3-none-any.whl
Collecting pyasn1-modules>=0.0.5 (from oauth2client<4.0.0,>=2.0.1->apache-beam==2.2.0.dev0)
Using cached pyasn1_modules-0.1.4-py2.py3-none-any.whl
Collecting pyasn1>=0.1.7 (from oauth2client<4.0.0,>=2.0.1->apache-beam==2.2.0.dev0)
Using cached pyasn1-0.3.6-py2.py3-none-any.whl
Collecting rsa>=3.1.4 (from oauth2client<4.0.0,>=2.0.1->apache-beam==2.2.0.dev0)
Using cached rsa-3.4.2-py2.py3-none-any.whl
Requirement already satisfied: setuptools in ./target/.tox/py27cython/lib/python2.7/site-packages (from protobuf<=3.3.0,>=3.2.0->apache-beam==2.2.0.dev0)
Building wheels for collected packages: apache-beam
Running setup.py bdist_wheel for apache-beam: started
Running setup.py bdist_wheel for apache-beam: finished with status 'error'
Complete output from command <https://builds.apache.org/job/beam_PostCommit_Python_Verify/ws/sdks/python/target/.tox/py27cython/bin/python> -u -c "import setuptools, tokenize;__file__='/tmp/pip-eCHOmJ-build/setup.py';f=getattr(tokenize, 'open', open)(__file__);code=f.read().replace('\r\n', '\n');f.close();exec(compile(code, __file__, 'exec'))" bdist_wheel -d /tmp/tmptPMcj5pip-wheel- --python-tag cp27:
<https://builds.apache.org/job/beam_PostCommit_Python_Verify/ws/sdks/python/target/.tox/py27cython/local/lib/python2.7/site-packages/setuptools/dist.py>:351: UserWarning: Normalizing '2.2.0.dev' to '2.2.0.dev0'
normalized_version,
running bdist_wheel
running build
running build_py
Traceback (most recent call last):
File "<string>", line 1, in <module>
File "/tmp/pip-eCHOmJ-build/setup.py", line 203, in <module>
'test': generate_protos_first(test),
File "/usr/lib/python2.7/distutils/core.py", line 151, in setup
dist.run_commands()
File "/usr/lib/python2.7/distutils/dist.py", line 953, in run_commands
self.run_command(cmd)
File "/usr/lib/python2.7/distutils/dist.py", line 972, in run_command
cmd_obj.run()
File "<https://builds.apache.org/job/beam_PostCommit_Python_Verify/ws/sdks/python/target/.tox/py27cython/local/lib/python2.7/site-packages/wheel/bdist_wheel.py",> line 204, in run
self.run_command('build')
File "/usr/lib/python2.7/distutils/cmd.py", line 326, in run_command
self.distribution.run_command(command)
File "/usr/lib/python2.7/distutils/dist.py", line 972, in run_command
cmd_obj.run()
File "/usr/lib/python2.7/distutils/command/build.py", line 128, in run
self.run_command(cmd_name)
File "/usr/lib/python2.7/distutils/cmd.py", line 326, in run_command
self.distribution.run_command(command)
File "/usr/lib/python2.7/distutils/dist.py", line 972, in run_command
cmd_obj.run()
File "/tmp/pip-eCHOmJ-build/setup.py", line 143, in run
gen_protos.generate_proto_files()
File "gen_protos.py", line 65, in generate_proto_files
'Not in apache git tree; unable to find proto definitions.')
RuntimeError: Not in apache git tree; unable to find proto definitions.
----------------------------------------
Failed building wheel for apache-beam
Running setup.py clean for apache-beam
Failed to build apache-beam
Installing collected packages: avro, crcmod, dill, httplib2, pbr, six, funcsigs, mock, pyasn1, pyasn1-modules, rsa, oauth2client, protobuf, pyyaml, typing, apache-beam
Found existing installation: six 1.11.0
Uninstalling six-1.11.0:
Successfully uninstalled six-1.11.0
Found existing installation: protobuf 3.4.0
Uninstalling protobuf-3.4.0:
Successfully uninstalled protobuf-3.4.0
Running setup.py install for apache-beam: started
Running setup.py install for apache-beam: finished with status 'error'
Complete output from command <https://builds.apache.org/job/beam_PostCommit_Python_Verify/ws/sdks/python/target/.tox/py27cython/bin/python> -u -c "import setuptools, tokenize;__file__='/tmp/pip-eCHOmJ-build/setup.py';f=getattr(tokenize, 'open', open)(__file__);code=f.read().replace('\r\n', '\n');f.close();exec(compile(code, __file__, 'exec'))" install --record /tmp/pip-EgMaHx-record/install-record.txt --single-version-externally-managed --compile --install-headers <https://builds.apache.org/job/beam_PostCommit_Python_Verify/ws/sdks/python/target/.tox/py27cython/include/site/python2.7/apache-beam>:
<https://builds.apache.org/job/beam_PostCommit_Python_Verify/ws/sdks/python/target/.tox/py27cython/local/lib/python2.7/site-packages/setuptools/dist.py>:351: UserWarning: Normalizing '2.2.0.dev' to '2.2.0.dev0'
normalized_version,
running install
running build
running build_py
Traceback (most recent call last):
File "<string>", line 1, in <module>
File "/tmp/pip-eCHOmJ-build/setup.py", line 203, in <module>
'test': generate_protos_first(test),
File "/usr/lib/python2.7/distutils/core.py", line 151, in setup
dist.run_commands()
File "/usr/lib/python2.7/distutils/dist.py", line 953, in run_commands
self.run_command(cmd)
File "/usr/lib/python2.7/distutils/dist.py", line 972, in run_command
cmd_obj.run()
File "<https://builds.apache.org/job/beam_PostCommit_Python_Verify/ws/sdks/python/target/.tox/py27cython/local/lib/python2.7/site-packages/setuptools/command/install.py",> line 61, in run
return orig.install.run(self)
File "/usr/lib/python2.7/distutils/command/install.py", line 601, in run
self.run_command('build')
File "/usr/lib/python2.7/distutils/cmd.py", line 326, in run_command
self.distribution.run_command(command)
File "/usr/lib/python2.7/distutils/dist.py", line 972, in run_command
cmd_obj.run()
File "/usr/lib/python2.7/distutils/command/build.py", line 128, in run
self.run_command(cmd_name)
File "/usr/lib/python2.7/distutils/cmd.py", line 326, in run_command
self.distribution.run_command(command)
File "/usr/lib/python2.7/distutils/dist.py", line 972, in run_command
cmd_obj.run()
File "/tmp/pip-eCHOmJ-build/setup.py", line 143, in run
gen_protos.generate_proto_files()
File "gen_protos.py", line 65, in generate_proto_files
'Not in apache git tree; unable to find proto definitions.')
RuntimeError: Not in apache git tree; unable to find proto definitions.
----------------------------------------
Command "<https://builds.apache.org/job/beam_PostCommit_Python_Verify/ws/sdks/python/target/.tox/py27cython/bin/python> -u -c "import setuptools, tokenize;__file__='/tmp/pip-eCHOmJ-build/setup.py';f=getattr(tokenize, 'open', open)(__file__);code=f.read().replace('\r\n', '\n');f.close();exec(compile(code, __file__, 'exec'))" install --record /tmp/pip-EgMaHx-record/install-record.txt --single-version-externally-managed --compile --install-headers <https://builds.apache.org/job/beam_PostCommit_Python_Verify/ws/sdks/python/target/.tox/py27cython/include/site/python2.7/apache-beam"> failed with error code 1 in /tmp/pip-eCHOmJ-build/
py27cython installed: avro==1.8.2,crcmod==1.7,Cython==0.25.2,dill==0.2.6,enum34==1.1.6,funcsigs==1.0.2,futures==3.1.1,grpcio==1.6.0,grpcio-tools==1.3.5,httplib2==0.9.2,mock==2.0.0,nose==1.3.7,oauth2client==3.0.0,pbr==3.1.1,protobuf==3.3.0,pyasn1==0.3.6,pyasn1-modules==0.1.4,PyYAML==3.12,rsa==3.4.2,six==1.10.0,typing==3.6.2
py27gcp create: <https://builds.apache.org/job/beam_PostCommit_Python_Verify/ws/sdks/python/target/.tox/py27gcp>
py27gcp installdeps: nose==1.3.7
py27gcp inst: <https://builds.apache.org/job/beam_PostCommit_Python_Verify/ws/sdks/python/target/.tox/dist/apache-beam-2.2.0.dev.zip>
ERROR: invocation failed (exit code 1), logfile: <https://builds.apache.org/job/beam_PostCommit_Python_Verify/ws/sdks/python/target/.tox/py27gcp/log/py27gcp-2.log>
ERROR: actionid: py27gcp
msg: installpkg
cmdargs: [local('<https://builds.apache.org/job/beam_PostCommit_Python_Verify/ws/sdks/python/target/.tox/py27gcp/bin/pip'),> 'install', '<https://builds.apache.org/job/beam_PostCommit_Python_Verify/ws/sdks/python/target/.tox/dist/apache-beam-2.2.0.dev.zip']>
env: {'JENKINS_HOME': '/x1/jenkins/jenkins-home', 'BUILD_CAUSE': 'TIMERTRIGGER', 'GIT_COMMIT': '352f106f992a2ff4c08274685657242f04f967ef', 'HUDSON_URL': 'https://builds.apache.org/', 'BUILD_URL': 'https://builds.apache.org/job/beam_PostCommit_Python_Verify/3217/', 'GIT_PREVIOUS_COMMIT': '352f106f992a2ff4c08274685657242f04f967ef', 'BUILD_TAG': 'jenkins-beam_PostCommit_Python_Verify-3217', 'SSH_CLIENT': '62.210.60.235 55148 22', 'JENKINS_URL': 'https://builds.apache.org/', 'LOGNAME': 'jenkins', 'USER': 'jenkins', 'WORKSPACE': '<https://builds.apache.org/job/beam_PostCommit_Python_Verify/ws/',> 'HOME': '/home/jenkins', 'PATH': '<https://builds.apache.org/job/beam_PostCommit_Python_Verify/ws/sdks/python/target/.tox/py27gcp/bin>:/home/jenkins/tools/java/latest1.8/bin:/usr/local/sbin:/usr/local/bin:/usr/sbin:/usr/bin:/sbin:/bin:/usr/games:/usr/local/games', 'JOB_NAME': 'beam_PostCommit_Python_Verify', 'LANG': 'en_US.UTF-8', 'RUN_DISPLAY_URL': 'https://builds.apache.org/job/beam_PostCommit_Python_Verify/3217/display/redirect', 'VIRTUAL_ENV': '<https://builds.apache.org/job/beam_PostCommit_Python_Verify/ws/sdks/python/target/.tox/py27gcp',> 'SHELL': '/bin/bash', 'GIT_PREVIOUS_SUCCESSFUL_COMMIT': '352f106f992a2ff4c08274685657242f04f967ef', 'SHLVL': '3', 'NLSPATH': '/usr/dt/lib/nls/msg/%L/%N.cat', 'GIT_AUTHOR_EMAIL': 'builds@apache.org', 'HUDSON_HOME': '/x1/jenkins/jenkins-home', 'NODE_LABELS': 'beam beam3', 'GIT_COMMITTER_EMAIL': 'builds@apache.org', 'BUILD_CAUSE_TIMERTRIGGER': 'true', 'PYTHONHASHSEED': '1024006109', 'JAVA_HOME': '/home/jenkins/tools/java/latest1.8', 'ROOT_BUILD_CAUSE': 'TIMERTRIGGER', 'BUILD_ID': '3217', 'BUILD_NUMBER': '3217', 'XDG_RUNTIME_DIR': '/run/user/9997', 'HUDSON_COOKIE': 'e28dd751-4900-45f7-809b-f87846873bab', 'JOB_URL': 'https://builds.apache.org/job/beam_PostCommit_Python_Verify/', 'TEST_HOST': 'beam3', 'GIT_BRANCH': 'origin/master', 'JOB_BASE_NAME': 'beam_PostCommit_Python_Verify', 'GIT_AUTHOR_NAME': 'jenkins', 'ROOT_BUILD_CAUSE_TIMERTRIGGER': 'true', 'GIT_COMMITTER_NAME': 'jenkins', 'XDG_SESSION_ID': '122', '_': '/home/jenkins/.local/bin//tox', 'sha1': 'master', 'COVERALLS_REPO_TOKEN': '****', 'JOB_DISPLAY_URL': 'https://builds.apache.org/job/beam_PostCommit_Python_Verify/display/redirect', 'HUDSON_SERVER_COOKIE': 'f4ebd1e6b0d976e8', 'EXECUTOR_NUMBER': '1', 'NODE_NAME': 'beam3', 'PWD': '<https://builds.apache.org/job/beam_PostCommit_Python_Verify/ws/',> 'SPARK_LOCAL_IP': '127.0.0.1', 'JENKINS_SERVER_COOKIE': 'f4ebd1e6b0d976e8', 'BUILD_DISPLAY_NAME': '#3217', 'XFILESEARCHPATH': '/usr/dt/app-defaults/%L/Dt', 'MAIL': '/var/mail/jenkins', 'SSH_CONNECTION': '62.210.60.235 55148 10.128.0.4 22', 'RUN_CHANGES_DISPLAY_URL': 'https://builds.apache.org/job/beam_PostCommit_Python_Verify/3217/display/redirect?page=changes', 'GIT_URL': 'https://github.com/apache/beam.git'}
Processing ./target/.tox/dist/apache-beam-2.2.0.dev.zip
Collecting avro<2.0.0,>=1.8.1 (from apache-beam==2.2.0.dev0)
Collecting crcmod<2.0,>=1.7 (from apache-beam==2.2.0.dev0)
Collecting dill==0.2.6 (from apache-beam==2.2.0.dev0)
Collecting grpcio<2.0,>=1.0 (from apache-beam==2.2.0.dev0)
Using cached grpcio-1.6.0-cp27-cp27mu-manylinux1_x86_64.whl
Collecting httplib2<0.10,>=0.8 (from apache-beam==2.2.0.dev0)
Collecting mock<3.0.0,>=1.0.1 (from apache-beam==2.2.0.dev0)
Using cached mock-2.0.0-py2.py3-none-any.whl
Collecting oauth2client<4.0.0,>=2.0.1 (from apache-beam==2.2.0.dev0)
Collecting protobuf<=3.3.0,>=3.2.0 (from apache-beam==2.2.0.dev0)
Using cached protobuf-3.3.0-cp27-cp27mu-manylinux1_x86_64.whl
Collecting pyyaml<4.0.0,>=3.12 (from apache-beam==2.2.0.dev0)
Collecting six<1.11,>=1.9 (from apache-beam==2.2.0.dev0)
Using cached six-1.10.0-py2.py3-none-any.whl
Collecting typing<3.7.0,>=3.6.0 (from apache-beam==2.2.0.dev0)
Using cached typing-3.6.2-py2-none-any.whl
Collecting enum34>=1.0.4 (from grpcio<2.0,>=1.0->apache-beam==2.2.0.dev0)
Using cached enum34-1.1.6-py2-none-any.whl
Collecting futures>=2.2.0 (from grpcio<2.0,>=1.0->apache-beam==2.2.0.dev0)
Using cached futures-3.1.1-py2-none-any.whl
Collecting pbr>=0.11 (from mock<3.0.0,>=1.0.1->apache-beam==2.2.0.dev0)
Using cached pbr-3.1.1-py2.py3-none-any.whl
Collecting funcsigs>=1; python_version < "3.3" (from mock<3.0.0,>=1.0.1->apache-beam==2.2.0.dev0)
Using cached funcsigs-1.0.2-py2.py3-none-any.whl
Collecting pyasn1-modules>=0.0.5 (from oauth2client<4.0.0,>=2.0.1->apache-beam==2.2.0.dev0)
Using cached pyasn1_modules-0.1.4-py2.py3-none-any.whl
Collecting pyasn1>=0.1.7 (from oauth2client<4.0.0,>=2.0.1->apache-beam==2.2.0.dev0)
Using cached pyasn1-0.3.6-py2.py3-none-any.whl
Collecting rsa>=3.1.4 (from oauth2client<4.0.0,>=2.0.1->apache-beam==2.2.0.dev0)
Using cached rsa-3.4.2-py2.py3-none-any.whl
Requirement already satisfied: setuptools in ./target/.tox/py27gcp/lib/python2.7/site-packages (from protobuf<=3.3.0,>=3.2.0->apache-beam==2.2.0.dev0)
Building wheels for collected packages: apache-beam
Running setup.py bdist_wheel for apache-beam: started
Running setup.py bdist_wheel for apache-beam: finished with status 'error'
Complete output from command <https://builds.apache.org/job/beam_PostCommit_Python_Verify/ws/sdks/python/target/.tox/py27gcp/bin/python> -u -c "import setuptools, tokenize;__file__='/tmp/pip-3qU7yM-build/setup.py';f=getattr(tokenize, 'open', open)(__file__);code=f.read().replace('\r\n', '\n');f.close();exec(compile(code, __file__, 'exec'))" bdist_wheel -d /tmp/tmpT9tITfpip-wheel- --python-tag cp27:
<https://builds.apache.org/job/beam_PostCommit_Python_Verify/ws/sdks/python/target/.tox/py27gcp/local/lib/python2.7/site-packages/setuptools/dist.py>:351: UserWarning: Normalizing '2.2.0.dev' to '2.2.0.dev0'
normalized_version,
running bdist_wheel
running build
running build_py
gen_protos.py:46: UserWarning: Installing grpcio-tools is recommended for development.
warnings.warn('Installing grpcio-tools is recommended for development.')
Traceback (most recent call last):
File "<string>", line 1, in <module>
File "/tmp/pip-3qU7yM-build/setup.py", line 203, in <module>
'test': generate_protos_first(test),
File "/usr/lib/python2.7/distutils/core.py", line 151, in setup
dist.run_commands()
File "/usr/lib/python2.7/distutils/dist.py", line 953, in run_commands
self.run_command(cmd)
File "/usr/lib/python2.7/distutils/dist.py", line 972, in run_command
cmd_obj.run()
File "<https://builds.apache.org/job/beam_PostCommit_Python_Verify/ws/sdks/python/target/.tox/py27gcp/local/lib/python2.7/site-packages/wheel/bdist_wheel.py",> line 204, in run
self.run_command('build')
File "/usr/lib/python2.7/distutils/cmd.py", line 326, in run_command
self.distribution.run_command(command)
File "/usr/lib/python2.7/distutils/dist.py", line 972, in run_command
cmd_obj.run()
File "/usr/lib/python2.7/distutils/command/build.py", line 128, in run
self.run_command(cmd_name)
File "/usr/lib/python2.7/distutils/cmd.py", line 326, in run_command
self.distribution.run_command(command)
File "/usr/lib/python2.7/distutils/dist.py", line 972, in run_command
cmd_obj.run()
File "/tmp/pip-3qU7yM-build/setup.py", line 143, in run
gen_protos.generate_proto_files()
File "gen_protos.py", line 65, in generate_proto_files
'Not in apache git tree; unable to find proto definitions.')
RuntimeError: Not in apache git tree; unable to find proto definitions.
----------------------------------------
Failed building wheel for apache-beam
Running setup.py clean for apache-beam
Failed to build apache-beam
Installing collected packages: avro, crcmod, dill, enum34, six, protobuf, futures, grpcio, httplib2, pbr, funcsigs, mock, pyasn1, pyasn1-modules, rsa, oauth2client, pyyaml, typing, apache-beam
Running setup.py install for apache-beam: started
Running setup.py install for apache-beam: finished with status 'error'
Complete output from command <https://builds.apache.org/job/beam_PostCommit_Python_Verify/ws/sdks/python/target/.tox/py27gcp/bin/python> -u -c "import setuptools, tokenize;__file__='/tmp/pip-3qU7yM-build/setup.py';f=getattr(tokenize, 'open', open)(__file__);code=f.read().replace('\r\n', '\n');f.close();exec(compile(code, __file__, 'exec'))" install --record /tmp/pip-3qKypm-record/install-record.txt --single-version-externally-managed --compile --install-headers <https://builds.apache.org/job/beam_PostCommit_Python_Verify/ws/sdks/python/target/.tox/py27gcp/include/site/python2.7/apache-beam>:
<https://builds.apache.org/job/beam_PostCommit_Python_Verify/ws/sdks/python/target/.tox/py27gcp/local/lib/python2.7/site-packages/setuptools/dist.py>:351: UserWarning: Normalizing '2.2.0.dev' to '2.2.0.dev0'
normalized_version,
running install
running build
running build_py
gen_protos.py:46: UserWarning: Installing grpcio-tools is recommended for development.
warnings.warn('Installing grpcio-tools is recommended for development.')
Traceback (most recent call last):
File "<string>", line 1, in <module>
File "/tmp/pip-3qU7yM-build/setup.py", line 203, in <module>
'test': generate_protos_first(test),
File "/usr/lib/python2.7/distutils/core.py", line 151, in setup
dist.run_commands()
File "/usr/lib/python2.7/distutils/dist.py", line 953, in run_commands
self.run_command(cmd)
File "/usr/lib/python2.7/distutils/dist.py", line 972, in run_command
cmd_obj.run()
File "<https://builds.apache.org/job/beam_PostCommit_Python_Verify/ws/sdks/python/target/.tox/py27gcp/local/lib/python2.7/site-packages/setuptools/command/install.py",> line 61, in run
return orig.install.run(self)
File "/usr/lib/python2.7/distutils/command/install.py", line 601, in run
self.run_command('build')
File "/usr/lib/python2.7/distutils/cmd.py", line 326, in run_command
self.distribution.run_command(command)
File "/usr/lib/python2.7/distutils/dist.py", line 972, in run_command
cmd_obj.run()
File "/usr/lib/python2.7/distutils/command/build.py", line 128, in run
self.run_command(cmd_name)
File "/usr/lib/python2.7/distutils/cmd.py", line 326, in run_command
self.distribution.run_command(command)
File "/usr/lib/python2.7/distutils/dist.py", line 972, in run_command
cmd_obj.run()
File "/tmp/pip-3qU7yM-build/setup.py", line 143, in run
gen_protos.generate_proto_files()
File "gen_protos.py", line 65, in generate_proto_files
'Not in apache git tree; unable to find proto definitions.')
RuntimeError: Not in apache git tree; unable to find proto definitions.
----------------------------------------
Command "<https://builds.apache.org/job/beam_PostCommit_Python_Verify/ws/sdks/python/target/.tox/py27gcp/bin/python> -u -c "import setuptools, tokenize;__file__='/tmp/pip-3qU7yM-build/setup.py';f=getattr(tokenize, 'open', open)(__file__);code=f.read().replace('\r\n', '\n');f.close();exec(compile(code, __file__, 'exec'))" install --record /tmp/pip-3qKypm-record/install-record.txt --single-version-externally-managed --compile --install-headers <https://builds.apache.org/job/beam_PostCommit_Python_Verify/ws/sdks/python/target/.tox/py27gcp/include/site/python2.7/apache-beam"> failed with error code 1 in /tmp/pip-3qU7yM-build/
py27gcp installed: avro==1.8.2,crcmod==1.7,dill==0.2.6,enum34==1.1.6,funcsigs==1.0.2,futures==3.1.1,grpcio==1.6.0,httplib2==0.9.2,mock==2.0.0,nose==1.3.7,oauth2client==3.0.0,pbr==3.1.1,protobuf==3.3.0,pyasn1==0.3.6,pyasn1-modules==0.1.4,PyYAML==3.12,rsa==3.4.2,six==1.10.0,typing==3.6.2
___________________________________ summary ____________________________________
ERROR: docs: InvocationError: <https://builds.apache.org/job/beam_PostCommit_Python_Verify/ws/sdks/python/target/.tox/docs/bin/pip> install <https://builds.apache.org/job/beam_PostCommit_Python_Verify/ws/sdks/python/target/.tox/dist/apache-beam-2.2.0.dev.zip> (see <https://builds.apache.org/job/beam_PostCommit_Python_Verify/ws/sdks/python/target/.tox/docs/log/docs-2.log)>
ERROR: lint: InvocationError: <https://builds.apache.org/job/beam_PostCommit_Python_Verify/ws/sdks/python/target/.tox/lint/bin/pip> install <https://builds.apache.org/job/beam_PostCommit_Python_Verify/ws/sdks/python/target/.tox/dist/apache-beam-2.2.0.dev.zip> (see <https://builds.apache.org/job/beam_PostCommit_Python_Verify/ws/sdks/python/target/.tox/lint/log/lint-2.log)>
ERROR: py27: InvocationError: <https://builds.apache.org/job/beam_PostCommit_Python_Verify/ws/sdks/python/target/.tox/py27/bin/pip> install <https://builds.apache.org/job/beam_PostCommit_Python_Verify/ws/sdks/python/target/.tox/dist/apache-beam-2.2.0.dev.zip> (see <https://builds.apache.org/job/beam_PostCommit_Python_Verify/ws/sdks/python/target/.tox/py27/log/py27-2.log)>
ERROR: py27cython: InvocationError: <https://builds.apache.org/job/beam_PostCommit_Python_Verify/ws/sdks/python/target/.tox/py27cython/bin/pip> install <https://builds.apache.org/job/beam_PostCommit_Python_Verify/ws/sdks/python/target/.tox/dist/apache-beam-2.2.0.dev.zip> (see <https://builds.apache.org/job/beam_PostCommit_Python_Verify/ws/sdks/python/target/.tox/py27cython/log/py27cython-2.log)>
ERROR: py27gcp: InvocationError: <https://builds.apache.org/job/beam_PostCommit_Python_Verify/ws/sdks/python/target/.tox/py27gcp/bin/pip> install <https://builds.apache.org/job/beam_PostCommit_Python_Verify/ws/sdks/python/target/.tox/dist/apache-beam-2.2.0.dev.zip> (see <https://builds.apache.org/job/beam_PostCommit_Python_Verify/ws/sdks/python/target/.tox/py27gcp/log/py27gcp-2.log)>
Build step 'Execute shell' marked build as failure