You are viewing a plain text version of this content. The canonical link for it is here.
Posted to dev@pdfbox.apache.org by Apache Jenkins Server <je...@builds.apache.org> on 2017/08/08 18:13:48 UTC
Build failed in Jenkins: PDFBox-trunk #3521
See <https://builds.apache.org/job/PDFBox-trunk/3521/display/redirect?page=changes>
Changes:
[tilman] PDFBOX-3584: add build option variable to be used for jdk9
[tilman] PDFBOX-3584: add build option variable to be used for jdk9
------------------------------------------
[...truncated 60.16 KB...]
Running org.apache.pdfbox.pdmodel.font.TestFontEncoding
Tests run: 3, Failures: 0, Errors: 0, Skipped: 0, Time elapsed: 0.003 sec - in org.apache.pdfbox.pdmodel.font.TestFontEncoding
Running org.apache.pdfbox.pdmodel.common.TestEmbeddedFiles
Tests run: 2, Failures: 0, Errors: 0, Skipped: 0, Time elapsed: 0.003 sec - in org.apache.pdfbox.pdmodel.common.TestEmbeddedFiles
Running org.apache.pdfbox.pdmodel.common.PDStreamTest
Tests run: 3, Failures: 0, Errors: 0, Skipped: 0, Time elapsed: 0.001 sec - in org.apache.pdfbox.pdmodel.common.PDStreamTest
Running org.apache.pdfbox.pdmodel.common.function.type4.TestParser
Tests run: 4, Failures: 0, Errors: 0, Skipped: 0, Time elapsed: 0.019 sec - in org.apache.pdfbox.pdmodel.common.function.type4.TestParser
Running org.apache.pdfbox.pdmodel.common.function.type4.TestOperators
Tests run: 40, Failures: 0, Errors: 0, Skipped: 0, Time elapsed: 0.015 sec - in org.apache.pdfbox.pdmodel.common.function.type4.TestOperators
Running org.apache.pdfbox.pdmodel.common.function.TestFunctions
Tests run: 46, Failures: 0, Errors: 0, Skipped: 0, Time elapsed: 0.012 sec - in org.apache.pdfbox.pdmodel.common.function.TestFunctions
Running org.apache.pdfbox.pdmodel.common.function.TestPDFunctionType4
Tests run: 2, Failures: 0, Errors: 0, Skipped: 0, Time elapsed: 0 sec - in org.apache.pdfbox.pdmodel.common.function.TestPDFunctionType4
Running org.apache.pdfbox.pdmodel.common.TestPDNameTreeNode
Tests run: 2, Failures: 0, Errors: 0, Skipped: 0, Time elapsed: 0.002 sec - in org.apache.pdfbox.pdmodel.common.TestPDNameTreeNode
Running org.apache.pdfbox.pdmodel.common.TestPDNumberTreeNode
Tests run: 3, Failures: 0, Errors: 0, Skipped: 0, Time elapsed: 0.002 sec - in org.apache.pdfbox.pdmodel.common.TestPDNumberTreeNode
Running org.apache.pdfbox.pdmodel.TestPDDocumentInformation
Tests run: 2, Failures: 0, Errors: 0, Skipped: 0, Time elapsed: 0.004 sec - in org.apache.pdfbox.pdmodel.TestPDDocumentInformation
Running org.apache.pdfbox.pdmodel.TestPDPageTree
Tests run: 4, Failures: 0, Errors: 0, Skipped: 0, Time elapsed: 0.006 sec - in org.apache.pdfbox.pdmodel.TestPDPageTree
Running org.apache.pdfbox.multipdf.PDFMergerUtilityTest
Tests run: 3, Failures: 0, Errors: 0, Skipped: 0, Time elapsed: 4.248 sec - in org.apache.pdfbox.multipdf.PDFMergerUtilityTest
Running org.apache.pdfbox.multipdf.PageExtractorTest
Tests run: 1, Failures: 0, Errors: 0, Skipped: 0, Time elapsed: 0.042 sec - in org.apache.pdfbox.multipdf.PageExtractorTest
Running org.apache.pdfbox.multipdf.MergeAnnotationsTest
Tests run: 1, Failures: 0, Errors: 0, Skipped: 0, Time elapsed: 0.649 sec - in org.apache.pdfbox.multipdf.MergeAnnotationsTest
Running org.apache.pdfbox.multipdf.MergeAcroFormsTest
Tests run: 2, Failures: 0, Errors: 0, Skipped: 0, Time elapsed: 1.367 sec - in org.apache.pdfbox.multipdf.MergeAcroFormsTest
Running org.apache.pdfbox.multipdf.PDFCloneUtilityTest
Tests run: 2, Failures: 0, Errors: 0, Skipped: 0, Time elapsed: 0.035 sec - in org.apache.pdfbox.multipdf.PDFCloneUtilityTest
Running org.apache.pdfbox.multipdf.TestLayerUtility
Tests run: 1, Failures: 0, Errors: 0, Skipped: 0, Time elapsed: 0.007 sec - in org.apache.pdfbox.multipdf.TestLayerUtility
Results :
Tests run: 402, Failures: 0, Errors: 0, Skipped: 0
[JENKINS] Recording test results
[INFO]
[INFO] --- animal-sniffer-maven-plugin:1.15:check (check-java-version) @ pdfbox ---
[INFO] Checking unresolved references to org.codehaus.mojo.signature:java17:1.0
[INFO]
[INFO] --- maven-bundle-plugin:3.3.0:bundle (default-bundle) @ pdfbox ---
[INFO]
[INFO] --- maven-site-plugin:3.4:attach-descriptor (attach-descriptor) @ pdfbox ---
[INFO]
[INFO] >>> maven-source-plugin:2.3:jar (attach-sources) > generate-sources @ pdfbox >>>
[WARNING] Failed to getClass for org.apache.maven.plugin.source.SourceJarMojo
[INFO]
[INFO] <<< maven-source-plugin:2.3:jar (attach-sources) < generate-sources @ pdfbox <<<
[INFO]
[INFO] --- maven-source-plugin:2.3:jar (attach-sources) @ pdfbox ---
[INFO] Building jar: <https://builds.apache.org/job/PDFBox-trunk/ws/trunk/pdfbox/target/pdfbox-3.0.0-SNAPSHOT-sources.jar>
[INFO]
[INFO] --- apache-rat-plugin:0.12:check (default) @ pdfbox ---
[INFO] Enabled default license matchers.
[INFO] Will parse SCM ignores for exclusions...
[INFO] Finished adding exclusions from SCM ignore files.
[INFO] 61 implicit excludes (use -debug for more details).
[INFO] Exclude: src/main/resources/org/apache/pdfbox/resources/afm/*
[INFO] Exclude: src/main/resources/org/apache/pdfbox/resources/icc/*
[INFO] Exclude: src/main/resources/org/apache/pdfbox/resources/glyphlist/glyphlist.txt
[INFO] Exclude: src/main/resources/org/apache/pdfbox/resources/glyphlist/zapfdingbats.txt
[INFO] Exclude: src/main/resources/org/apache/pdfbox/resources/text/BidiMirroring.txt
[INFO] Exclude: src/main/resources/META-INF/services/*
[INFO] Exclude: src/test/resources/input/rendering/*.ai
[INFO] Exclude: src/test/resources/input/*.txt
[INFO] Exclude: src/test/resources/output/*
[INFO] Exclude: src/test/resources/org/apache/pdfbox/pdmodel/sRGB.*
[INFO] Exclude: src/test/resources/org/apache/pdfbox/pdfparser/*.fdf
[INFO] Exclude: release.properties
[INFO] Exclude: src/test/resources/org/apache/pdfbox/encryption/*.der
[INFO] Exclude: src/test/resources/org/apache/pdfbox/encryption/*.pfx
[INFO] Exclude: src/test/resources/org/apache/pdfbox/filter/*.bin
[INFO] Exclude: src/test/resources/org/apache/pdfbox/text/*.txt
[INFO] Exclude: src/main/java/org/apache/pdfbox/filter/CCITTFaxDecoderStream.java
[INFO] Exclude: src/main/java/org/apache/pdfbox/filter/CCITTFaxEncoderStream.java
[INFO] Exclude: src/main/java/org/apache/pdfbox/filter/TIFFExtension.java
[INFO] 816 resources included (use -debug for more details)
[INFO] Rat check: Summary over all files. Unapproved: 0, unknown: 0, generated: 0, approved: 709 licenses.
[INFO]
[INFO] --- dependency-check-maven:2.1.0:check (default) @ pdfbox ---
[INFO] Checking for updates
[INFO] Skipping NVD check since last check was within 4 hours.
[INFO] Check for updates complete (2 ms)
[INFO] Analysis Started
[INFO] Finished Archive Analyzer (0 seconds)
[INFO] Finished File Name Analyzer (0 seconds)
[INFO] Finished Jar Analyzer (0 seconds)
[INFO] Finished Central Analyzer (0 seconds)
[INFO] Finished Dependency Merging Analyzer (0 seconds)
[INFO] Finished Version Filter Analyzer (0 seconds)
[INFO] Finished Hint Analyzer (0 seconds)
[INFO] Created CPE Index (0 seconds)
[INFO] Finished CPE Analyzer (0 seconds)
[INFO] Finished False Positive Analyzer (0 seconds)
[INFO] Finished Cpe Suppression Analyzer (0 seconds)
[INFO] Finished NVD CVE Analyzer (0 seconds)
[INFO] Finished Vulnerability Suppression Analyzer (0 seconds)
[INFO] Finished Dependency Bundling Analyzer (0 seconds)
[INFO] Analysis Complete (2 seconds)
[INFO]
[INFO] --- maven-install-plugin:2.5.2:install (default-install) @ pdfbox ---
[INFO] Installing <https://builds.apache.org/job/PDFBox-trunk/ws/trunk/pdfbox/target/pdfbox-3.0.0-SNAPSHOT.jar> to /home/jenkins/jenkins-slave/maven-repositories/0/org/apache/pdfbox/pdfbox/3.0.0-SNAPSHOT/pdfbox-3.0.0-SNAPSHOT.jar
[INFO] Installing <https://builds.apache.org/job/PDFBox-trunk/ws/trunk/pdfbox/pom.xml> to /home/jenkins/jenkins-slave/maven-repositories/0/org/apache/pdfbox/pdfbox/3.0.0-SNAPSHOT/pdfbox-3.0.0-SNAPSHOT.pom
[INFO] Installing <https://builds.apache.org/job/PDFBox-trunk/ws/trunk/pdfbox/target/pdfbox-3.0.0-SNAPSHOT-sources.jar> to /home/jenkins/jenkins-slave/maven-repositories/0/org/apache/pdfbox/pdfbox/3.0.0-SNAPSHOT/pdfbox-3.0.0-SNAPSHOT-sources.jar
[INFO]
[INFO] --- maven-bundle-plugin:3.3.0:install (default-install) @ pdfbox ---
[INFO] Installing org/apache/pdfbox/pdfbox/3.0.0-SNAPSHOT/pdfbox-3.0.0-SNAPSHOT.jar
[INFO] Writing OBR metadata
[INFO]
[INFO] --- maven-deploy-plugin:2.8.2:deploy (default-deploy) @ pdfbox ---
[INFO] Downloading: https://repository.apache.org/content/repositories/snapshots/org/apache/pdfbox/pdfbox/3.0.0-SNAPSHOT/maven-metadata.xml
[INFO] Downloaded: https://repository.apache.org/content/repositories/snapshots/org/apache/pdfbox/pdfbox/3.0.0-SNAPSHOT/maven-metadata.xml (995 B at 1.8 KB/sec)
[INFO] Uploading: https://repository.apache.org/content/repositories/snapshots/org/apache/pdfbox/pdfbox/3.0.0-SNAPSHOT/pdfbox-3.0.0-20170808.181241-204.jar
[INFO] Uploaded: https://repository.apache.org/content/repositories/snapshots/org/apache/pdfbox/pdfbox/3.0.0-SNAPSHOT/pdfbox-3.0.0-20170808.181241-204.jar (2441 KB at 1639.3 KB/sec)
[INFO] Uploading: https://repository.apache.org/content/repositories/snapshots/org/apache/pdfbox/pdfbox/3.0.0-SNAPSHOT/pdfbox-3.0.0-20170808.181241-204.pom
[INFO] Uploaded: https://repository.apache.org/content/repositories/snapshots/org/apache/pdfbox/pdfbox/3.0.0-SNAPSHOT/pdfbox-3.0.0-20170808.181241-204.pom (9 KB at 10.0 KB/sec)
[INFO] Downloading: https://repository.apache.org/content/repositories/snapshots/org/apache/pdfbox/pdfbox/maven-metadata.xml
[INFO] Downloaded: https://repository.apache.org/content/repositories/snapshots/org/apache/pdfbox/pdfbox/maven-metadata.xml (464 B at 0.8 KB/sec)
[INFO] Uploading: https://repository.apache.org/content/repositories/snapshots/org/apache/pdfbox/pdfbox/3.0.0-SNAPSHOT/maven-metadata.xml
[INFO] Uploaded: https://repository.apache.org/content/repositories/snapshots/org/apache/pdfbox/pdfbox/3.0.0-SNAPSHOT/maven-metadata.xml (995 B at 1.2 KB/sec)
[INFO] Uploading: https://repository.apache.org/content/repositories/snapshots/org/apache/pdfbox/pdfbox/maven-metadata.xml
[INFO] Uploaded: https://repository.apache.org/content/repositories/snapshots/org/apache/pdfbox/pdfbox/maven-metadata.xml (464 B at 0.6 KB/sec)
[INFO] Uploading: https://repository.apache.org/content/repositories/snapshots/org/apache/pdfbox/pdfbox/3.0.0-SNAPSHOT/pdfbox-3.0.0-20170808.181241-204-sources.jar
[INFO] Uploaded: https://repository.apache.org/content/repositories/snapshots/org/apache/pdfbox/pdfbox/3.0.0-SNAPSHOT/pdfbox-3.0.0-20170808.181241-204-sources.jar (2306 KB at 1531.8 KB/sec)
[INFO] Uploading: https://repository.apache.org/content/repositories/snapshots/org/apache/pdfbox/pdfbox/3.0.0-SNAPSHOT/maven-metadata.xml
[INFO] Uploaded: https://repository.apache.org/content/repositories/snapshots/org/apache/pdfbox/pdfbox/3.0.0-SNAPSHOT/maven-metadata.xml (995 B at 1.2 KB/sec)
[INFO]
[INFO] --- maven-bundle-plugin:3.3.0:deploy (default-deploy) @ pdfbox ---
[INFO] Remote OBR update disabled (enable with -DremoteOBR)
[INFO]
[INFO] ------------------------------------------------------------------------
[INFO] Building Apache Preflight 3.0.0-SNAPSHOT
[INFO] ------------------------------------------------------------------------
[INFO]
[INFO] --- maven-clean-plugin:2.5:clean (default-clean) @ preflight ---
[TASKS] Scanning folder '<https://builds.apache.org/job/PDFBox-trunk/ws/trunk/preflight'> for files matching the pattern '**/*.java' - excludes:
[TASKS] Found 136 files to scan for tasks
Found 21 open tasks.
[TASKS] Computing warning deltas based on reference build #3520
[INFO]
[INFO] --- maven-remote-resources-plugin:1.5:process (default) @ preflight ---
[INFO]
[INFO] --- maven-resources-plugin:2.6:resources (default-resources) @ preflight ---
[INFO] Using 'UTF-8' encoding to copy filtered resources.
[INFO] Copying 0 resource
[INFO] Copying 3 resources
[INFO]
[INFO] --- maven-compiler-plugin:3.1:compile (default-compile) @ preflight ---
[INFO] Changes detected - recompiling the module!
[INFO] Compiling 111 source files to <https://builds.apache.org/job/PDFBox-trunk/ws/trunk/preflight/target/classes>
[INFO]
[INFO] --- maven-download-plugin:1.1.0:wget (get-isartor) @ preflight ---
[INFO] Got from cache: /home/jenkins/jenkins-slave/maven-repositories/0/.cache/maven-download-plugin/isartor-pdfa-2008-08-13.zip
[INFO]
[INFO] --- maven-download-plugin:1.1.0:wget (get-bavaria) @ preflight ---
[INFO] Got from cache: /home/jenkins/jenkins-slave/maven-repositories/0/.cache/maven-download-plugin/2009-04-03-Bavaria-pdfa.zip
[INFO]
[INFO] --- maven-resources-plugin:2.6:testResources (default-testResources) @ preflight ---
[INFO] Using 'UTF-8' encoding to copy filtered resources.
[INFO] Copying 9 resources
[INFO] Copying 3 resources
[INFO]
[INFO] --- maven-compiler-plugin:3.1:testCompile (default-testCompile) @ preflight ---
[INFO] Changes detected - recompiling the module!
[INFO] Compiling 25 source files to <https://builds.apache.org/job/PDFBox-trunk/ws/trunk/preflight/target/test-classes>
[INFO]
[INFO] --- maven-surefire-plugin:2.17:test (default-test) @ preflight ---
[INFO] Tests are skipped.
[INFO]
[INFO] --- animal-sniffer-maven-plugin:1.15:check (check-java-version) @ preflight ---
[INFO] Checking unresolved references to org.codehaus.mojo.signature:java17:1.0
[INFO]
[INFO] --- maven-surefire-plugin:2.17:test (surefire-test) @ preflight ---
[INFO] Surefire report directory: <https://builds.apache.org/job/PDFBox-trunk/ws/trunk/preflight/target/surefire-reports>
-------------------------------------------------------
T E S T S
-------------------------------------------------------
Error: Could not find or load main class ${addmod}
Results :
Tests run: 0, Failures: 0, Errors: 0, Skipped: 0
[JENKINS] Recording test results
[INFO] ------------------------------------------------------------------------
[INFO] Reactor Summary:
[INFO]
[INFO] PDFBox parent ...................................... SUCCESS [01:08 min]
[INFO] Apache FontBox ..................................... SUCCESS [ 50.861 s]
[INFO] Apache XmpBox ...................................... SUCCESS [ 36.409 s]
[INFO] Apache PDFBox ...................................... SUCCESS [02:19 min]
[INFO] Apache Preflight ................................... FAILURE [ 20.088 s]
[INFO] Apache Preflight application ....................... SKIPPED
[INFO] Apache PDFBox Debugger ............................. SKIPPED
[INFO] Apache PDFBox tools ................................ SKIPPED
[INFO] Apache PDFBox application .......................... SKIPPED
[INFO] Apache PDFBox Debugger application ................. SKIPPED
[INFO] Apache PDFBox examples ............................. SKIPPED
[INFO] Apache PDFBox ...................................... SKIPPED
[INFO] ------------------------------------------------------------------------
[INFO] BUILD FAILURE
[INFO] ------------------------------------------------------------------------
[INFO] Total time: 05:38 min
[INFO] Finished at: 2017-08-08T18:13:24+00:00
[INFO] Final Memory: 43M/571M
[INFO] ------------------------------------------------------------------------
[ERROR] Failed to execute goal org.apache.maven.plugins:maven-surefire-plugin:2.17:test (surefire-test) on project preflight: Execution surefire-test of goal org.apache.maven.plugins:maven-surefire-plugin:2.17:test failed: The forked VM terminated without properly saying goodbye. VM crash or System.exit called?
[ERROR] Command was /bin/sh -c cd <https://builds.apache.org/job/PDFBox-trunk/ws/trunk/preflight> && /home/jenkins/tools/java/jdk1.7.0_79-unlimited-security/bin/java -Xmx768m '${addmod}' -jar <https://builds.apache.org/job/PDFBox-trunk/ws/trunk/preflight/target/surefire/surefirebooter8883703114516723160.jar> <https://builds.apache.org/job/PDFBox-trunk/ws/trunk/preflight/target/surefire/surefire2050328292184260333tmp> <https://builds.apache.org/job/PDFBox-trunk/ws/trunk/preflight/target/surefire/surefire_32266969442643890391tmp>
[ERROR] -> [Help 1]
[ERROR]
[ERROR] To see the full stack trace of the errors, re-run Maven with the -e switch.
[ERROR] Re-run Maven using the -X switch to enable full debug logging.
[ERROR]
[ERROR] For more information about the errors and possible solutions, please read the following articles:
[ERROR] [Help 1] http://cwiki.apache.org/confluence/display/MAVEN/PluginExecutionException
[ERROR]
[ERROR] After correcting the problems, you can resume the build with the command
[ERROR] mvn <goals> -rf :preflight
[JENKINS] Archiving <https://builds.apache.org/job/PDFBox-trunk/ws/trunk/xmpbox/pom.xml> to org.apache.pdfbox/xmpbox/3.0.0-SNAPSHOT/xmpbox-3.0.0-SNAPSHOT.pom
[JENKINS] Archiving <https://builds.apache.org/job/PDFBox-trunk/ws/trunk/xmpbox/target/xmpbox-3.0.0-SNAPSHOT.jar> to org.apache.pdfbox/xmpbox/3.0.0-20170808.181020-207/xmpbox-3.0.0-20170808.181020-207.jar
[JENKINS] Archiving <https://builds.apache.org/job/PDFBox-trunk/ws/trunk/xmpbox/target/xmpbox-3.0.0-SNAPSHOT-sources.jar> to org.apache.pdfbox/xmpbox/3.0.0-20170808.181020-207/xmpbox-3.0.0-20170808.181020-207-sources.jar
[Fast Archiver] No artifacts from PDFBox-trunk » Apache XmpBox #3520 to compare, so performing full copy of artifacts
[JENKINS] Archiving <https://builds.apache.org/job/PDFBox-trunk/ws/trunk/tools/pom.xml> to org.apache.pdfbox/pdfbox-tools/3.0.0-SNAPSHOT/pdfbox-tools-3.0.0-SNAPSHOT.pom
[JENKINS] Archiving <https://builds.apache.org/job/PDFBox-trunk/ws/trunk/debugger/pom.xml> to org.apache.pdfbox/pdfbox-debugger/3.0.0-SNAPSHOT/pdfbox-debugger-3.0.0-SNAPSHOT.pom
[JENKINS] Archiving <https://builds.apache.org/job/PDFBox-trunk/ws/trunk/preflight-app/pom.xml> to org.apache.pdfbox/preflight-app/3.0.0-SNAPSHOT/preflight-app-3.0.0-SNAPSHOT.pom
[JENKINS] Archiving <https://builds.apache.org/job/PDFBox-trunk/ws/trunk/app/pom.xml> to org.apache.pdfbox/pdfbox-app/3.0.0-SNAPSHOT/pdfbox-app-3.0.0-SNAPSHOT.pom
[JENKINS] Archiving <https://builds.apache.org/job/PDFBox-trunk/ws/trunk/examples/pom.xml> to org.apache.pdfbox/pdfbox-examples/3.0.0-SNAPSHOT/pdfbox-examples-3.0.0-SNAPSHOT.pom
[JENKINS] Archiving <https://builds.apache.org/job/PDFBox-trunk/ws/trunk/preflight/pom.xml> to org.apache.pdfbox/preflight/3.0.0-SNAPSHOT/preflight-3.0.0-SNAPSHOT.pom
[Fast Archiver] No artifacts from PDFBox-trunk » Apache Preflight #3520 to compare, so performing full copy of artifacts
[JENKINS] Archiving <https://builds.apache.org/job/PDFBox-trunk/ws/trunk/pom.xml> to org.apache.pdfbox/pdfbox-reactor/3.0.0-SNAPSHOT/pdfbox-reactor-3.0.0-SNAPSHOT.pom
[JENKINS] Archiving <https://builds.apache.org/job/PDFBox-trunk/ws/trunk/parent/pom.xml> to org.apache.pdfbox/pdfbox-parent/3.0.0-SNAPSHOT/pdfbox-parent-3.0.0-SNAPSHOT.pom
[Fast Archiver] No artifacts from PDFBox-trunk » PDFBox parent #3520 to compare, so performing full copy of artifacts
[JENKINS] Archiving <https://builds.apache.org/job/PDFBox-trunk/ws/trunk/pdfbox/pom.xml> to org.apache.pdfbox/pdfbox/3.0.0-SNAPSHOT/pdfbox-3.0.0-SNAPSHOT.pom
[JENKINS] Archiving <https://builds.apache.org/job/PDFBox-trunk/ws/trunk/pdfbox/target/pdfbox-3.0.0-SNAPSHOT.jar> to org.apache.pdfbox/pdfbox/3.0.0-20170808.181241-204/pdfbox-3.0.0-20170808.181241-204.jar
[JENKINS] Archiving <https://builds.apache.org/job/PDFBox-trunk/ws/trunk/pdfbox/target/pdfbox-3.0.0-SNAPSHOT-sources.jar> to org.apache.pdfbox/pdfbox/3.0.0-20170808.181241-204/pdfbox-3.0.0-20170808.181241-204-sources.jar
[Fast Archiver] No artifacts from PDFBox-trunk » Apache PDFBox #3520 to compare, so performing full copy of artifacts
[JENKINS] Archiving <https://builds.apache.org/job/PDFBox-trunk/ws/trunk/debugger-app/pom.xml> to org.apache.pdfbox/debugger-app/3.0.0-SNAPSHOT/debugger-app-3.0.0-SNAPSHOT.pom
[JENKINS] Archiving <https://builds.apache.org/job/PDFBox-trunk/ws/trunk/fontbox/pom.xml> to org.apache.pdfbox/fontbox/3.0.0-SNAPSHOT/fontbox-3.0.0-SNAPSHOT.pom
[JENKINS] Archiving <https://builds.apache.org/job/PDFBox-trunk/ws/trunk/fontbox/target/fontbox-3.0.0-SNAPSHOT.jar> to org.apache.pdfbox/fontbox/3.0.0-20170808.180941-208/fontbox-3.0.0-20170808.180941-208.jar
[JENKINS] Archiving <https://builds.apache.org/job/PDFBox-trunk/ws/trunk/fontbox/target/fontbox-3.0.0-SNAPSHOT-sources.jar> to org.apache.pdfbox/fontbox/3.0.0-20170808.180941-208/fontbox-3.0.0-20170808.180941-208-sources.jar
[Fast Archiver] No artifacts from PDFBox-trunk » Apache FontBox #3520 to compare, so performing full copy of artifacts
Sending e-mails to: dev@pdfbox.apache.org
channel stopped
Archiving artifacts
---------------------------------------------------------------------
To unsubscribe, e-mail: dev-unsubscribe@pdfbox.apache.org
For additional commands, e-mail: dev-help@pdfbox.apache.org
Re: Build failed in Jenkins: PDFBox-trunk #3521
Posted by Tilman Hausherr <TH...@t-online.de>.
Am 08.08.2017 um 20:13 schrieb Apache Jenkins Server:
> -------------------------------------------------------
> T E S T S
> -------------------------------------------------------
> Error: Could not find or load main class ${addmod}
Sorry about that. Maybe it's the last minute changes I made... I'll
retest locally.
Tilman
---------------------------------------------------------------------
To unsubscribe, e-mail: dev-unsubscribe@pdfbox.apache.org
For additional commands, e-mail: dev-help@pdfbox.apache.org
Jenkins build is back to normal : PDFBox-trunk #3522
Posted by Apache Jenkins Server <je...@builds.apache.org>.
See <https://builds.apache.org/job/PDFBox-trunk/3522/display/redirect?page=changes>
---------------------------------------------------------------------
To unsubscribe, e-mail: dev-unsubscribe@pdfbox.apache.org
For additional commands, e-mail: dev-help@pdfbox.apache.org