You are viewing a plain text version of this content. The canonical link for it is here.
Posted to jetspeed-dev@portals.apache.org by "Theo Filippidis (JIRA)" <je...@jakarta.apache.org> on 2005/01/26 18:54:17 UTC

[jira] Created: (JS2-201) mave allBuild failes with Error reading XML or initializing

mave allBuild failes with Error reading XML or initializing
-----------------------------------------------------------

         Key: JS2-201
         URL: http://issues.apache.org/jira/browse/JS2-201
     Project: Jetspeed 2
        Type: Bug
  Components: Installer  
    Versions: 2.0-M1    
 Environment: Windows 2000, Tomcat 5.5, Oracle 9i
    Reporter: Theo Filippidis
    Priority: Blocker


C:\Program Files\Apache Software Foundation\jetspeed2>maven allBuild
 __  __
|  \/  |__ _Apache__ ___
| |\/| / _` \ V / -_) ' \  ~ intelligent projects ~
|_|  |_\__,_|\_/\___|_||_|  v. 1.0.2

build:start:

allBuild:
check.required.properties:

torque:init:

db.scripts.gen:
    [echo] Generating SQL schema creation scripts for HSQLDB
    [torque-sql] Using classpath
    [torque-sql] Generating to file C:\Program Files\Apache Software Foundation\
jetspeed2\target\src\sql\hsql\report.portal.sql.generation
    [echo] Generating SQL schema creation scripts for MySQL
    [torque-sql] Using classpath
    [torque-sql] Generating to file C:\Program Files\Apache Software Foundation\
jetspeed2\target\src\sql\mysql\report.portal.sql.generation
    [echo] Generating SQL schema creation scripts for Oracle
    [torque-sql] Using classpath
    [torque-sql] Generating to file C:\Program Files\Apache Software Foundation\
jetspeed2\target\src\sql\oracle\report.portal.sql.generation
    [echo] Generating SQL schema creation scripts for MS SQL
    [torque-sql] Using classpath
    [torque-sql] Generating to file C:\Program Files\Apache Software Foundation\
jetspeed2\target\src\sql\mssql\report.portal.sql.generation
    [echo] Generating SQL schema creation scripts for Postgres
    [torque-sql] Using classpath
    [torque-sql] Generating to file C:\Program Files\Apache Software Foundation\
jetspeed2\target\src\sql\postgres\report.portal.sql.generation

db.create.test:
db.test.properties:

db.drop2:

db.create:
db.execute:
    [sql] Executing file: C:\Program Files\Apache Software Foundation\jetspeed2\
target\src\sql\oracle\phase3ojb-schema.sql
    [sql] 24 of 24 SQL statements executed successfully

db.execute:
    [sql] Executing file: C:\Program Files\Apache Software Foundation\jetspeed2\
target\src\sql\oracle\phase1-schema.sql
    [sql] 20 of 20 SQL statements executed successfully

db.execute:
    [sql] Executing file: C:\Program Files\Apache Software Foundation\jetspeed2\
target\src\sql\oracle\phase2-schema.sql
    [sql] 36 of 36 SQL statements executed successfully

db.execute:
    [sql] Executing file: C:\Program Files\Apache Software Foundation\jetspeed2\
target\src\sql\oracle\registry-schema.sql
    [sql] 58 of 58 SQL statements executed successfully

db.execute:
    [sql] Executing file: C:\Program Files\Apache Software Foundation\jetspeed2\
target\src\sql\oracle\prefs-schema.sql
    [sql] 13 of 13 SQL statements executed successfully

db.execute:
    [sql] Executing file: C:\Program Files\Apache Software Foundation\jetspeed2\
target\src\sql\oracle\security-schema.sql
    [sql] 48 of 48 SQL statements executed successfully

db.execute:
    [sql] Executing file: C:\Program Files\Apache Software Foundation\jetspeed2\
src\sql\populate-db-default.sql
    [sql] 180 of 180 SQL statements executed successfully

db.execute:
    [sql] Executing file: C:\Program Files\Apache Software Foundation\jetspeed2\
target\src\sql\oracle\test-persistence-schema.sql
    [sql] 6 of 6 SQL statements executed successfully
Starting the reactor...

BUILD FAILED
File...... C:\Program Files\Apache Software Foundation\jetspeed2\maven.xml
Element... maven:reactor
Line...... 133
Column.... 40
Error reading XML or initializing
Total time: 1 minutes 10 seconds
Finished at: Wed Jan 26 19:20:22 EET 2005

C:\Program Files\Apache Software Foundation\jetspeed2>

-- 
This message is automatically generated by JIRA.
-
If you think it was sent incorrectly contact one of the administrators:
   http://issues.apache.org/jira/secure/Administrators.jspa
-
If you want more information on JIRA, or have a bug to report see:
   http://www.atlassian.com/software/jira


---------------------------------------------------------------------
To unsubscribe, e-mail: jetspeed-dev-unsubscribe@jakarta.apache.org
For additional commands, e-mail: jetspeed-dev-help@jakarta.apache.org


Re: [jira] Created: (JS2-201) mave allBuild failes with Error reading XML or initializing

Posted by mike long <mi...@dataline.com>.
Theo Filippidis (JIRA) wrote:

>mave allBuild failes with Error reading XML or initializing
>-----------------------------------------------------------
>
>         Key: JS2-201
>         URL: http://issues.apache.org/jira/browse/JS2-201
>     Project: Jetspeed 2
>        Type: Bug
>  Components: Installer  
>    Versions: 2.0-M1    
> Environment: Windows 2000, Tomcat 5.5, Oracle 9i
>    Reporter: Theo Filippidis
>    Priority: Blocker
>
>
>C:\Program Files\Apache Software Foundation\jetspeed2>maven allBuild
> __  __
>|  \/  |__ _Apache__ ___
>| |\/| / _` \ V / -_) ' \  ~ intelligent projects ~
>|_|  |_\__,_|\_/\___|_||_|  v. 1.0.2
>
>build:start:
>
>allBuild:
>check.required.properties:
>
>torque:init:
>
>db.scripts.gen:
>    [echo] Generating SQL schema creation scripts for HSQLDB
>    [torque-sql] Using classpath
>    [torque-sql] Generating to file C:\Program Files\Apache Software Foundation\
>jetspeed2\target\src\sql\hsql\report.portal.sql.generation
>    [echo] Generating SQL schema creation scripts for MySQL
>    [torque-sql] Using classpath
>    [torque-sql] Generating to file C:\Program Files\Apache Software Foundation\
>jetspeed2\target\src\sql\mysql\report.portal.sql.generation
>    [echo] Generating SQL schema creation scripts for Oracle
>    [torque-sql] Using classpath
>    [torque-sql] Generating to file C:\Program Files\Apache Software Foundation\
>jetspeed2\target\src\sql\oracle\report.portal.sql.generation
>    [echo] Generating SQL schema creation scripts for MS SQL
>    [torque-sql] Using classpath
>    [torque-sql] Generating to file C:\Program Files\Apache Software Foundation\
>jetspeed2\target\src\sql\mssql\report.portal.sql.generation
>    [echo] Generating SQL schema creation scripts for Postgres
>    [torque-sql] Using classpath
>    [torque-sql] Generating to file C:\Program Files\Apache Software Foundation\
>jetspeed2\target\src\sql\postgres\report.portal.sql.generation
>
>db.create.test:
>db.test.properties:
>
>db.drop2:
>
>db.create:
>db.execute:
>    [sql] Executing file: C:\Program Files\Apache Software Foundation\jetspeed2\
>target\src\sql\oracle\phase3ojb-schema.sql
>    [sql] 24 of 24 SQL statements executed successfully
>
>db.execute:
>    [sql] Executing file: C:\Program Files\Apache Software Foundation\jetspeed2\
>target\src\sql\oracle\phase1-schema.sql
>    [sql] 20 of 20 SQL statements executed successfully
>
>db.execute:
>    [sql] Executing file: C:\Program Files\Apache Software Foundation\jetspeed2\
>target\src\sql\oracle\phase2-schema.sql
>    [sql] 36 of 36 SQL statements executed successfully
>
>db.execute:
>    [sql] Executing file: C:\Program Files\Apache Software Foundation\jetspeed2\
>target\src\sql\oracle\registry-schema.sql
>    [sql] 58 of 58 SQL statements executed successfully
>
>db.execute:
>    [sql] Executing file: C:\Program Files\Apache Software Foundation\jetspeed2\
>target\src\sql\oracle\prefs-schema.sql
>    [sql] 13 of 13 SQL statements executed successfully
>
>db.execute:
>    [sql] Executing file: C:\Program Files\Apache Software Foundation\jetspeed2\
>target\src\sql\oracle\security-schema.sql
>    [sql] 48 of 48 SQL statements executed successfully
>
>db.execute:
>    [sql] Executing file: C:\Program Files\Apache Software Foundation\jetspeed2\
>src\sql\populate-db-default.sql
>    [sql] 180 of 180 SQL statements executed successfully
>
>db.execute:
>    [sql] Executing file: C:\Program Files\Apache Software Foundation\jetspeed2\
>target\src\sql\oracle\test-persistence-schema.sql
>    [sql] 6 of 6 SQL statements executed successfully
>Starting the reactor...
>
>BUILD FAILED
>File...... C:\Program Files\Apache Software Foundation\jetspeed2\maven.xml
>Element... maven:reactor
>Line...... 133
>Column.... 40
>Error reading XML or initializing
>Total time: 1 minutes 10 seconds
>Finished at: Wed Jan 26 19:20:22 EET 2005
>
>C:\Program Files\Apache Software Foundation\jetspeed2>
>
>  
>
We had this same problem this morning on the latest checkout from CVS. 
My associate fixed by prepending an extra forward slash on the file 
paths in the build.properties file in the home directory.  I think the 
problem resulted from spaces in the Windows path name. But I am a Linux 
guy and never had the problem in the first place:)

---------------------------------------------------------------------
To unsubscribe, e-mail: jetspeed-dev-unsubscribe@jakarta.apache.org
For additional commands, e-mail: jetspeed-dev-help@jakarta.apache.org


[jira] Commented: (JS2-201) mave allBuild failes with Error reading XML or initializing

Posted by "rob young (JIRA)" <je...@jakarta.apache.org>.
     [ http://issues.apache.org/jira/browse/JS2-201?page=comments#action_61545 ]
     
rob young commented on JS2-201:
-------------------------------

I have been getting this same issue.  When I comment out lines from %USER_HOME%\build.properties file it contiues with downloading files.

#org.apache.jetspeed.project.home C:\jetspeed2
#org.apache.jetspeed.server.home C:\Program Files\Apache Software Foundation\Tomcat 5.5
#org.apache.jetspeed.catalina.version.major 5
#org.apache.jetspeed.server.shared C:\Program Files\Apache Software Foundation\Tomcat 5.5\shared\lib
#org.apache.jetspeed.deploy.war.dir C:\Program Files\Apache Software Foundation\Tomcat 5.5\webapps


I have changed my absolute path to a relative path and it continues with the build.

org.apache.jetspeed.project.home .\jetspeed2
org.apache.jetspeed.server.home ..\Program Files\Apache Software Foundation\Tomcat 5.5
org.apache.jetspeed.catalina.version.major 5
org.apache.jetspeed.server.shared ..\Program Files\Apache Software Foundation\Tomcat 5.5\shared\lib
org.apache.jetspeed.deploy.war.dir ..\Program Files\Apache Software Foundation\Tomcat 5.5\webapps



> mave allBuild failes with Error reading XML or initializing
> -----------------------------------------------------------
>
>          Key: JS2-201
>          URL: http://issues.apache.org/jira/browse/JS2-201
>      Project: Jetspeed 2
>         Type: Bug
>   Components: Installer
>     Versions: 2.0-M1
>  Environment: Windows 2000, Tomcat 5.5, Oracle 9i
>     Reporter: Theo Filippidis
>     Priority: Blocker

>
> C:\Program Files\Apache Software Foundation\jetspeed2>maven allBuild
>  __  __
> |  \/  |__ _Apache__ ___
> | |\/| / _` \ V / -_) ' \  ~ intelligent projects ~
> |_|  |_\__,_|\_/\___|_||_|  v. 1.0.2
> build:start:
> allBuild:
> check.required.properties:
> torque:init:
> db.scripts.gen:
>     [echo] Generating SQL schema creation scripts for HSQLDB
>     [torque-sql] Using classpath
>     [torque-sql] Generating to file C:\Program Files\Apache Software Foundation\
> jetspeed2\target\src\sql\hsql\report.portal.sql.generation
>     [echo] Generating SQL schema creation scripts for MySQL
>     [torque-sql] Using classpath
>     [torque-sql] Generating to file C:\Program Files\Apache Software Foundation\
> jetspeed2\target\src\sql\mysql\report.portal.sql.generation
>     [echo] Generating SQL schema creation scripts for Oracle
>     [torque-sql] Using classpath
>     [torque-sql] Generating to file C:\Program Files\Apache Software Foundation\
> jetspeed2\target\src\sql\oracle\report.portal.sql.generation
>     [echo] Generating SQL schema creation scripts for MS SQL
>     [torque-sql] Using classpath
>     [torque-sql] Generating to file C:\Program Files\Apache Software Foundation\
> jetspeed2\target\src\sql\mssql\report.portal.sql.generation
>     [echo] Generating SQL schema creation scripts for Postgres
>     [torque-sql] Using classpath
>     [torque-sql] Generating to file C:\Program Files\Apache Software Foundation\
> jetspeed2\target\src\sql\postgres\report.portal.sql.generation
> db.create.test:
> db.test.properties:
> db.drop2:
> db.create:
> db.execute:
>     [sql] Executing file: C:\Program Files\Apache Software Foundation\jetspeed2\
> target\src\sql\oracle\phase3ojb-schema.sql
>     [sql] 24 of 24 SQL statements executed successfully
> db.execute:
>     [sql] Executing file: C:\Program Files\Apache Software Foundation\jetspeed2\
> target\src\sql\oracle\phase1-schema.sql
>     [sql] 20 of 20 SQL statements executed successfully
> db.execute:
>     [sql] Executing file: C:\Program Files\Apache Software Foundation\jetspeed2\
> target\src\sql\oracle\phase2-schema.sql
>     [sql] 36 of 36 SQL statements executed successfully
> db.execute:
>     [sql] Executing file: C:\Program Files\Apache Software Foundation\jetspeed2\
> target\src\sql\oracle\registry-schema.sql
>     [sql] 58 of 58 SQL statements executed successfully
> db.execute:
>     [sql] Executing file: C:\Program Files\Apache Software Foundation\jetspeed2\
> target\src\sql\oracle\prefs-schema.sql
>     [sql] 13 of 13 SQL statements executed successfully
> db.execute:
>     [sql] Executing file: C:\Program Files\Apache Software Foundation\jetspeed2\
> target\src\sql\oracle\security-schema.sql
>     [sql] 48 of 48 SQL statements executed successfully
> db.execute:
>     [sql] Executing file: C:\Program Files\Apache Software Foundation\jetspeed2\
> src\sql\populate-db-default.sql
>     [sql] 180 of 180 SQL statements executed successfully
> db.execute:
>     [sql] Executing file: C:\Program Files\Apache Software Foundation\jetspeed2\
> target\src\sql\oracle\test-persistence-schema.sql
>     [sql] 6 of 6 SQL statements executed successfully
> Starting the reactor...
> BUILD FAILED
> File...... C:\Program Files\Apache Software Foundation\jetspeed2\maven.xml
> Element... maven:reactor
> Line...... 133
> Column.... 40
> Error reading XML or initializing
> Total time: 1 minutes 10 seconds
> Finished at: Wed Jan 26 19:20:22 EET 2005
> C:\Program Files\Apache Software Foundation\jetspeed2>

-- 
This message is automatically generated by JIRA.
-
If you think it was sent incorrectly contact one of the administrators:
   http://issues.apache.org/jira/secure/Administrators.jspa
-
If you want more information on JIRA, or have a bug to report see:
   http://www.atlassian.com/software/jira


---------------------------------------------------------------------
To unsubscribe, e-mail: jetspeed-dev-unsubscribe@jakarta.apache.org
For additional commands, e-mail: jetspeed-dev-help@jakarta.apache.org


[jira] Closed: (JS2-201) mave allBuild failes with Error reading XML or initializing

Posted by "Ate Douma (JIRA)" <je...@jakarta.apache.org>.
     [ http://issues.apache.org/jira/browse/JS2-201?page=history ]
     
Ate Douma closed JS2-201:
-------------------------


> mave allBuild failes with Error reading XML or initializing
> -----------------------------------------------------------
>
>          Key: JS2-201
>          URL: http://issues.apache.org/jira/browse/JS2-201
>      Project: Jetspeed 2
>         Type: Bug
>   Components: Installer
>     Versions: 2.0-M1
>  Environment: Windows 2000, Tomcat 5.5, Oracle 9i
>     Reporter: Theo Filippidis
>     Priority: Blocker

>
> C:\Program Files\Apache Software Foundation\jetspeed2>maven allBuild
>  __  __
> |  \/  |__ _Apache__ ___
> | |\/| / _` \ V / -_) ' \  ~ intelligent projects ~
> |_|  |_\__,_|\_/\___|_||_|  v. 1.0.2
> build:start:
> allBuild:
> check.required.properties:
> torque:init:
> db.scripts.gen:
>     [echo] Generating SQL schema creation scripts for HSQLDB
>     [torque-sql] Using classpath
>     [torque-sql] Generating to file C:\Program Files\Apache Software Foundation\
> jetspeed2\target\src\sql\hsql\report.portal.sql.generation
>     [echo] Generating SQL schema creation scripts for MySQL
>     [torque-sql] Using classpath
>     [torque-sql] Generating to file C:\Program Files\Apache Software Foundation\
> jetspeed2\target\src\sql\mysql\report.portal.sql.generation
>     [echo] Generating SQL schema creation scripts for Oracle
>     [torque-sql] Using classpath
>     [torque-sql] Generating to file C:\Program Files\Apache Software Foundation\
> jetspeed2\target\src\sql\oracle\report.portal.sql.generation
>     [echo] Generating SQL schema creation scripts for MS SQL
>     [torque-sql] Using classpath
>     [torque-sql] Generating to file C:\Program Files\Apache Software Foundation\
> jetspeed2\target\src\sql\mssql\report.portal.sql.generation
>     [echo] Generating SQL schema creation scripts for Postgres
>     [torque-sql] Using classpath
>     [torque-sql] Generating to file C:\Program Files\Apache Software Foundation\
> jetspeed2\target\src\sql\postgres\report.portal.sql.generation
> db.create.test:
> db.test.properties:
> db.drop2:
> db.create:
> db.execute:
>     [sql] Executing file: C:\Program Files\Apache Software Foundation\jetspeed2\
> target\src\sql\oracle\phase3ojb-schema.sql
>     [sql] 24 of 24 SQL statements executed successfully
> db.execute:
>     [sql] Executing file: C:\Program Files\Apache Software Foundation\jetspeed2\
> target\src\sql\oracle\phase1-schema.sql
>     [sql] 20 of 20 SQL statements executed successfully
> db.execute:
>     [sql] Executing file: C:\Program Files\Apache Software Foundation\jetspeed2\
> target\src\sql\oracle\phase2-schema.sql
>     [sql] 36 of 36 SQL statements executed successfully
> db.execute:
>     [sql] Executing file: C:\Program Files\Apache Software Foundation\jetspeed2\
> target\src\sql\oracle\registry-schema.sql
>     [sql] 58 of 58 SQL statements executed successfully
> db.execute:
>     [sql] Executing file: C:\Program Files\Apache Software Foundation\jetspeed2\
> target\src\sql\oracle\prefs-schema.sql
>     [sql] 13 of 13 SQL statements executed successfully
> db.execute:
>     [sql] Executing file: C:\Program Files\Apache Software Foundation\jetspeed2\
> target\src\sql\oracle\security-schema.sql
>     [sql] 48 of 48 SQL statements executed successfully
> db.execute:
>     [sql] Executing file: C:\Program Files\Apache Software Foundation\jetspeed2\
> src\sql\populate-db-default.sql
>     [sql] 180 of 180 SQL statements executed successfully
> db.execute:
>     [sql] Executing file: C:\Program Files\Apache Software Foundation\jetspeed2\
> target\src\sql\oracle\test-persistence-schema.sql
>     [sql] 6 of 6 SQL statements executed successfully
> Starting the reactor...
> BUILD FAILED
> File...... C:\Program Files\Apache Software Foundation\jetspeed2\maven.xml
> Element... maven:reactor
> Line...... 133
> Column.... 40
> Error reading XML or initializing
> Total time: 1 minutes 10 seconds
> Finished at: Wed Jan 26 19:20:22 EET 2005
> C:\Program Files\Apache Software Foundation\jetspeed2>

-- 
This message is automatically generated by JIRA.
-
If you think it was sent incorrectly contact one of the administrators:
   http://issues.apache.org/jira/secure/Administrators.jspa
-
If you want more information on JIRA, or have a bug to report see:
   http://www.atlassian.com/software/jira


---------------------------------------------------------------------
To unsubscribe, e-mail: jetspeed-dev-unsubscribe@jakarta.apache.org
For additional commands, e-mail: jetspeed-dev-help@jakarta.apache.org


[jira] Resolved: (JS2-201) mave allBuild failes with Error reading XML or initializing

Posted by "Ate Douma (JIRA)" <je...@jakarta.apache.org>.
     [ http://issues.apache.org/jira/browse/JS2-201?page=history ]
     
Ate Douma resolved JS2-201:
---------------------------

    Resolution: Invalid

I never had any problems with this and I have build J2 on Linux (Suse), NT4, Windows 2000 and XP.
Most likely your problems with be over if you don't use spaces in your installation directories (as in "Program Files") when running on a Windows platform and also use (forward) slashed and not backslashes in your path definitions like:
  c:/tomcat5.5/shared/lib 

> mave allBuild failes with Error reading XML or initializing
> -----------------------------------------------------------
>
>          Key: JS2-201
>          URL: http://issues.apache.org/jira/browse/JS2-201
>      Project: Jetspeed 2
>         Type: Bug
>   Components: Installer
>     Versions: 2.0-M1
>  Environment: Windows 2000, Tomcat 5.5, Oracle 9i
>     Reporter: Theo Filippidis
>     Priority: Blocker

>
> C:\Program Files\Apache Software Foundation\jetspeed2>maven allBuild
>  __  __
> |  \/  |__ _Apache__ ___
> | |\/| / _` \ V / -_) ' \  ~ intelligent projects ~
> |_|  |_\__,_|\_/\___|_||_|  v. 1.0.2
> build:start:
> allBuild:
> check.required.properties:
> torque:init:
> db.scripts.gen:
>     [echo] Generating SQL schema creation scripts for HSQLDB
>     [torque-sql] Using classpath
>     [torque-sql] Generating to file C:\Program Files\Apache Software Foundation\
> jetspeed2\target\src\sql\hsql\report.portal.sql.generation
>     [echo] Generating SQL schema creation scripts for MySQL
>     [torque-sql] Using classpath
>     [torque-sql] Generating to file C:\Program Files\Apache Software Foundation\
> jetspeed2\target\src\sql\mysql\report.portal.sql.generation
>     [echo] Generating SQL schema creation scripts for Oracle
>     [torque-sql] Using classpath
>     [torque-sql] Generating to file C:\Program Files\Apache Software Foundation\
> jetspeed2\target\src\sql\oracle\report.portal.sql.generation
>     [echo] Generating SQL schema creation scripts for MS SQL
>     [torque-sql] Using classpath
>     [torque-sql] Generating to file C:\Program Files\Apache Software Foundation\
> jetspeed2\target\src\sql\mssql\report.portal.sql.generation
>     [echo] Generating SQL schema creation scripts for Postgres
>     [torque-sql] Using classpath
>     [torque-sql] Generating to file C:\Program Files\Apache Software Foundation\
> jetspeed2\target\src\sql\postgres\report.portal.sql.generation
> db.create.test:
> db.test.properties:
> db.drop2:
> db.create:
> db.execute:
>     [sql] Executing file: C:\Program Files\Apache Software Foundation\jetspeed2\
> target\src\sql\oracle\phase3ojb-schema.sql
>     [sql] 24 of 24 SQL statements executed successfully
> db.execute:
>     [sql] Executing file: C:\Program Files\Apache Software Foundation\jetspeed2\
> target\src\sql\oracle\phase1-schema.sql
>     [sql] 20 of 20 SQL statements executed successfully
> db.execute:
>     [sql] Executing file: C:\Program Files\Apache Software Foundation\jetspeed2\
> target\src\sql\oracle\phase2-schema.sql
>     [sql] 36 of 36 SQL statements executed successfully
> db.execute:
>     [sql] Executing file: C:\Program Files\Apache Software Foundation\jetspeed2\
> target\src\sql\oracle\registry-schema.sql
>     [sql] 58 of 58 SQL statements executed successfully
> db.execute:
>     [sql] Executing file: C:\Program Files\Apache Software Foundation\jetspeed2\
> target\src\sql\oracle\prefs-schema.sql
>     [sql] 13 of 13 SQL statements executed successfully
> db.execute:
>     [sql] Executing file: C:\Program Files\Apache Software Foundation\jetspeed2\
> target\src\sql\oracle\security-schema.sql
>     [sql] 48 of 48 SQL statements executed successfully
> db.execute:
>     [sql] Executing file: C:\Program Files\Apache Software Foundation\jetspeed2\
> src\sql\populate-db-default.sql
>     [sql] 180 of 180 SQL statements executed successfully
> db.execute:
>     [sql] Executing file: C:\Program Files\Apache Software Foundation\jetspeed2\
> target\src\sql\oracle\test-persistence-schema.sql
>     [sql] 6 of 6 SQL statements executed successfully
> Starting the reactor...
> BUILD FAILED
> File...... C:\Program Files\Apache Software Foundation\jetspeed2\maven.xml
> Element... maven:reactor
> Line...... 133
> Column.... 40
> Error reading XML or initializing
> Total time: 1 minutes 10 seconds
> Finished at: Wed Jan 26 19:20:22 EET 2005
> C:\Program Files\Apache Software Foundation\jetspeed2>

-- 
This message is automatically generated by JIRA.
-
If you think it was sent incorrectly contact one of the administrators:
   http://issues.apache.org/jira/secure/Administrators.jspa
-
If you want more information on JIRA, or have a bug to report see:
   http://www.atlassian.com/software/jira


---------------------------------------------------------------------
To unsubscribe, e-mail: jetspeed-dev-unsubscribe@jakarta.apache.org
For additional commands, e-mail: jetspeed-dev-help@jakarta.apache.org