You are viewing a plain text version of this content. The canonical link for it is here.
Posted to dev@activemq.apache.org by Apache Hudson Server <hu...@hudson.zones.apache.org> on 2010/06/29 18:18:06 UTC

Hudson build is unstable: ActiveMQ #392

See <http://hudson.zones.apache.org/hudson/job/ActiveMQ/392/changes>



Build failed in Hudson: ActiveMQ #394

Posted by Apache Hudson Server <hu...@hudson.zones.apache.org>.
See <http://hudson.zones.apache.org/hudson/job/ActiveMQ/394/changes>

Changes:

[dejanb] improving features

[gtully] add trivial boolean selector test

[dejanb] https://issues.apache.org/activemq/browse/AMQ-2453 - improve stop procedure

[rajdavies] Name the BrokerService TaskRunner

------------------------------------------
[...truncated 5374 lines...]
Downloading: http://repository.springsource.com/maven/bundles/external/org/codehaus/plexus/plexus-io/1.0-alpha-4/plexus-io-1.0-alpha-4.jar
Downloading: http://repo1.maven.org/maven2/org/codehaus/plexus/plexus-io/1.0-alpha-4/plexus-io-1.0-alpha-4.jar
[INFO] [jar:jar]
[INFO] Building jar: <http://hudson.zones.apache.org/hudson/job/ActiveMQ/ws/trunk/activemq-openwire-generator/target/activemq-openwire-generator-5.4-SNAPSHOT.jar>
[INFO] [ianal:verify-legal-files {execution: default}]
[INFO] Checking legal files in: activemq-openwire-generator-5.4-SNAPSHOT.jar
[INFO] [install:install]
[INFO] Installing <http://hudson.zones.apache.org/hudson/job/ActiveMQ/ws/trunk/activemq-openwire-generator/target/activemq-openwire-generator-5.4-SNAPSHOT.jar> to <http://hudson.zones.apache.org/hudson/job/ActiveMQ/ws/.repository/org/apache/activemq/activemq-openwire-generator/5.4-SNAPSHOT/activemq-openwire-generator-5.4-SNAPSHOT.jar>
[INFO] Preparing source:jar
[HUDSON] Archiving <http://hudson.zones.apache.org/hudson/job/ActiveMQ/ws/trunk/activemq-openwire-generator/pom.xml> to /export/home/hudson/hudson/jobs/ActiveMQ/modules/org.apache.activemq$activemq-openwire-generator/builds/2010-06-30_17-05-56/archive/org.apache.activemq/activemq-openwire-generator/5.4-SNAPSHOT/pom.xml
[HUDSON] Archiving <http://hudson.zones.apache.org/hudson/job/ActiveMQ/ws/trunk/activemq-openwire-generator/target/activemq-openwire-generator-5.4-SNAPSHOT.jar> to /export/home/hudson/hudson/jobs/ActiveMQ/modules/org.apache.activemq$activemq-openwire-generator/builds/2010-06-30_17-05-56/archive/org.apache.activemq/activemq-openwire-generator/5.4-SNAPSHOT/activemq-openwire-generator-5.4-SNAPSHOT.jar
[INFO] [enforcer:enforce {execution: default}]
[INFO] [bundle:cleanVersions {execution: cleanVersions}]
[INFO] [source:jar]
[INFO] Building jar: <http://hudson.zones.apache.org/hudson/job/ActiveMQ/ws/trunk/activemq-openwire-generator/target/activemq-openwire-generator-5.4-SNAPSHOT-sources.jar>
[HUDSON] Archiving <http://hudson.zones.apache.org/hudson/job/ActiveMQ/ws/trunk/activemq-openwire-generator/target/activemq-openwire-generator-5.4-SNAPSHOT-sources.jar> to /export/home/hudson/hudson/jobs/ActiveMQ/modules/org.apache.activemq$activemq-openwire-generator/builds/2010-06-30_17-05-56/archive/org.apache.activemq/activemq-openwire-generator/5.4-SNAPSHOT/activemq-openwire-generator-5.4-SNAPSHOT-sources.jar
[INFO] ------------------------------------------------------------------------
[INFO] Building ActiveMQ :: jmdns 1.0
[INFO]    task-segment: [clean, install, source:jar]
[INFO] ------------------------------------------------------------------------
[INFO] [clean:clean]
[INFO] [enforcer:enforce {execution: default}]
[INFO] [bundle:cleanVersions {execution: cleanVersions}]
[INFO] [remote-resources:process {execution: default}]
[INFO] [resources:resources]
[INFO] Using 'UTF-8' encoding to copy filtered resources.
[INFO] Copying 1 resource
[INFO] Copying 3 resources
[INFO] [compiler:compile]
[INFO] Compiling 15 source files to <http://hudson.zones.apache.org/hudson/job/ActiveMQ/ws/trunk/activemq-jmdns_1.0/target/classes>
[INFO] [resources:testResources]
[INFO] Using 'UTF-8' encoding to copy filtered resources.
[INFO] skip non existing resourceDirectory <http://hudson.zones.apache.org/hudson/job/ActiveMQ/ws/trunk/activemq-jmdns_1.0/src/test/resources>
[INFO] Copying 3 resources
[INFO] [compiler:testCompile]
[INFO] No sources to compile
[INFO] [surefire:test]
[INFO] Tests are skipped.
[INFO] [jar:jar]
[INFO] Building jar: <http://hudson.zones.apache.org/hudson/job/ActiveMQ/ws/trunk/activemq-jmdns_1.0/target/activemq-jmdns_1.0-5.4-SNAPSHOT.jar>
[INFO] [ianal:verify-legal-files {execution: default}]
[INFO] Checking legal files in: activemq-jmdns_1.0-5.4-SNAPSHOT.jar
[INFO] [install:install]
[INFO] Installing <http://hudson.zones.apache.org/hudson/job/ActiveMQ/ws/trunk/activemq-jmdns_1.0/target/activemq-jmdns_1.0-5.4-SNAPSHOT.jar> to <http://hudson.zones.apache.org/hudson/job/ActiveMQ/ws/.repository/org/apache/activemq/activemq-jmdns_1.0/5.4-SNAPSHOT/activemq-jmdns_1.0-5.4-SNAPSHOT.jar>
[INFO] Preparing source:jar
[HUDSON] Archiving <http://hudson.zones.apache.org/hudson/job/ActiveMQ/ws/trunk/activemq-jmdns_1.0/pom.xml> to /export/home/hudson/hudson/jobs/ActiveMQ/modules/org.apache.activemq$activemq-jmdns_1.0/builds/2010-06-30_17-05-57/archive/org.apache.activemq/activemq-jmdns_1.0/5.4-SNAPSHOT/pom.xml
[HUDSON] Archiving <http://hudson.zones.apache.org/hudson/job/ActiveMQ/ws/trunk/activemq-jmdns_1.0/target/activemq-jmdns_1.0-5.4-SNAPSHOT.jar> to /export/home/hudson/hudson/jobs/ActiveMQ/modules/org.apache.activemq$activemq-jmdns_1.0/builds/2010-06-30_17-05-57/archive/org.apache.activemq/activemq-jmdns_1.0/5.4-SNAPSHOT/activemq-jmdns_1.0-5.4-SNAPSHOT.jar
[INFO] [enforcer:enforce {execution: default}]
[INFO] [bundle:cleanVersions {execution: cleanVersions}]
[INFO] [source:jar]
[INFO] Building jar: <http://hudson.zones.apache.org/hudson/job/ActiveMQ/ws/trunk/activemq-jmdns_1.0/target/activemq-jmdns_1.0-5.4-SNAPSHOT-sources.jar>
[HUDSON] Archiving <http://hudson.zones.apache.org/hudson/job/ActiveMQ/ws/trunk/activemq-jmdns_1.0/target/activemq-jmdns_1.0-5.4-SNAPSHOT-sources.jar> to /export/home/hudson/hudson/jobs/ActiveMQ/modules/org.apache.activemq$activemq-jmdns_1.0/builds/2010-06-30_17-05-57/archive/org.apache.activemq/activemq-jmdns_1.0/5.4-SNAPSHOT/activemq-jmdns_1.0-5.4-SNAPSHOT-sources.jar
[INFO] ------------------------------------------------------------------------
[INFO] Building ActiveMQ :: Core
[INFO]    task-segment: [clean, install, source:jar]
[INFO] ------------------------------------------------------------------------
[INFO] snapshot org.apache.activemq.protobuf:activemq-protobuf:1.1-SNAPSHOT: checking for updates from apache.snapshots
[INFO] snapshot org.apache.activemq.protobuf:activemq-protobuf:1.1-SNAPSHOT: checking for updates from com.springsource.repository.bundles.external
[INFO] snapshot org.apache.activemq.protobuf:activemq-protobuf:1.1-SNAPSHOT: checking for updates from apache.snapshots
Downloading: https://repository.apache.org/content/repositories/snapshots//org/apache/activemq/protobuf/activemq-protobuf/1.1-SNAPSHOT/activemq-protobuf-1.1-SNAPSHOT.pom
2K downloaded
[INFO] snapshot org.apache.activemq.protobuf:activemq-protobuf-pom:1.1-SNAPSHOT: checking for updates from apache.snapshots
[INFO] snapshot org.apache.activemq.protobuf:activemq-protobuf-pom:1.1-SNAPSHOT: checking for updates from com.springsource.repository.bundles.external
[INFO] snapshot org.apache.activemq.protobuf:activemq-protobuf-pom:1.1-SNAPSHOT: checking for updates from apache.snapshots
Downloading: https://repository.apache.org/content/repositories/snapshots//org/apache/activemq/protobuf/activemq-protobuf-pom/1.1-SNAPSHOT/activemq-protobuf-pom-1.1-SNAPSHOT.pom
11K downloaded
Downloading: https://repository.apache.org/content/repositories/snapshots//org/apache/activemq/protobuf/activemq-protobuf/1.1-SNAPSHOT/activemq-protobuf-1.1-SNAPSHOT.jar
144K downloaded
Downloading: https://repository.apache.org/content/repositories/snapshots//org/apache/maven/plugins/maven-antrun-plugin/1.1/maven-antrun-plugin-1.1.pom
Downloading: http://repo1.maven.org/maven2/org/apache/maven/plugins/maven-antrun-plugin/1.1/maven-antrun-plugin-1.1.pom
Downloading: https://repository.apache.org/content/repositories/snapshots//org/apache/maven/plugins/maven-plugin-parent/2.0.1/maven-plugin-parent-2.0.1.pom
Downloading: http://repo1.maven.org/maven2/org/apache/maven/plugins/maven-plugin-parent/2.0.1/maven-plugin-parent-2.0.1.pom
Downloading: https://repository.apache.org/content/repositories/snapshots//org/apache/maven/plugins/maven-antrun-plugin/1.1/maven-antrun-plugin-1.1.jar
Downloading: http://repo1.maven.org/maven2/org/apache/maven/plugins/maven-antrun-plugin/1.1/maven-antrun-plugin-1.1.jar
Downloading: https://repository.apache.org/content/repositories/snapshots//org/codehaus/mojo/javacc-maven-plugin/2.0/javacc-maven-plugin-2.0.pom
Downloading: http://repo1.maven.org/maven2/org/codehaus/mojo/javacc-maven-plugin/2.0/javacc-maven-plugin-2.0.pom
Downloading: https://repository.apache.org/content/repositories/snapshots//org/codehaus/mojo/mojo/6/mojo-6.pom
Downloading: http://repo1.maven.org/maven2/org/codehaus/mojo/mojo/6/mojo-6.pom
Downloading: https://repository.apache.org/content/repositories/snapshots//org/codehaus/mojo/javacc-maven-plugin/2.0/javacc-maven-plugin-2.0.jar
Downloading: http://repo1.maven.org/maven2/org/codehaus/mojo/javacc-maven-plugin/2.0/javacc-maven-plugin-2.0.jar
Downloading: https://repository.apache.org/content/repositories/snapshots//org/apache/xbean/maven-xbean-plugin/3.7/maven-xbean-plugin-3.7.pom
Downloading: http://repo1.maven.org/maven2/org/apache/xbean/maven-xbean-plugin/3.7/maven-xbean-plugin-3.7.pom
Downloading: https://repository.apache.org/content/repositories/snapshots//org/apache/xbean/maven-xbean-plugin/3.7/maven-xbean-plugin-3.7.jar
Downloading: http://repo1.maven.org/maven2/org/apache/xbean/maven-xbean-plugin/3.7/maven-xbean-plugin-3.7.jar
Downloading: https://repository.apache.org/content/repositories/snapshots//org/codehaus/mojo/cobertura-maven-plugin/2.0/cobertura-maven-plugin-2.0.pom
Downloading: http://repo1.maven.org/maven2/org/codehaus/mojo/cobertura-maven-plugin/2.0/cobertura-maven-plugin-2.0.pom
Downloading: https://repository.apache.org/content/repositories/snapshots//org/codehaus/mojo/mojo/7/mojo-7.pom
Downloading: http://repo1.maven.org/maven2/org/codehaus/mojo/mojo/7/mojo-7.pom
Downloading: https://repository.apache.org/content/repositories/snapshots//org/codehaus/mojo/cobertura-maven-plugin/2.0/cobertura-maven-plugin-2.0.jar
Downloading: http://repo1.maven.org/maven2/org/codehaus/mojo/cobertura-maven-plugin/2.0/cobertura-maven-plugin-2.0.jar
[INFO] [clean:clean]
[INFO] Reloading plugin container for: org.apache.activemq.protobuf:activemq-protobuf. The plugin artifact has changed.
Downloading: http://repository.springsource.com/maven/bundles/external/commons-logging/commons-logging-api/1.1/commons-logging-api-1.1.pom
Downloading: http://repo1.maven.org/maven2/commons-logging/commons-logging-api/1.1/commons-logging-api-1.1.pom
Downloading: http://repository.springsource.com/maven/bundles/external/org/apache/geronimo/specs/geronimo-jms_1.1_spec/1.1.1/geronimo-jms_1.1_spec-1.1.1.pom
Downloading: http://repo1.maven.org/maven2/org/apache/geronimo/specs/geronimo-jms_1.1_spec/1.1.1/geronimo-jms_1.1_spec-1.1.1.pom
Downloading: http://repository.springsource.com/maven/bundles/external/org/apache/geronimo/specs/specs/1.4/specs-1.4.pom
Downloading: http://repo1.maven.org/maven2/org/apache/geronimo/specs/specs/1.4/specs-1.4.pom
Downloading: http://repository.springsource.com/maven/bundles/external/org/apache/geronimo/genesis/config/project-config/1.2/project-config-1.2.pom
Downloading: http://repo1.maven.org/maven2/org/apache/geronimo/genesis/config/project-config/1.2/project-config-1.2.pom
Downloading: http://people.apache.org/repo/m2-incubating-repository//org/apache/geronimo/genesis/config/config/1.2/config-1.2.pom
Downloading: http://repository.springsource.com/maven/bundles/external/org/apache/geronimo/genesis/config/config/1.2/config-1.2.pom
Downloading: http://repo1.maven.org/maven2/org/apache/geronimo/genesis/config/config/1.2/config-1.2.pom
Downloading: http://people.apache.org/repo/m2-incubating-repository//org/apache/geronimo/genesis/genesis/1.2/genesis-1.2.pom
Downloading: http://repository.springsource.com/maven/bundles/external/org/apache/geronimo/genesis/genesis/1.2/genesis-1.2.pom
Downloading: http://repo1.maven.org/maven2/org/apache/geronimo/genesis/genesis/1.2/genesis-1.2.pom
Downloading: http://repository.springsource.com/maven/bundles/external/org/apache/activemq/activeio-core/3.1.2/activeio-core-3.1.2.pom
Downloading: http://repo1.maven.org/maven2/org/apache/activemq/activeio-core/3.1.2/activeio-core-3.1.2.pom
Downloading: http://repository.springsource.com/maven/bundles/external/org/apache/activemq/activeio-parent/3.1.2/activeio-parent-3.1.2.pom
Downloading: http://repo1.maven.org/maven2/org/apache/activemq/activeio-parent/3.1.2/activeio-parent-3.1.2.pom
Downloading: http://repository.springsource.com/maven/bundles/external/org/apache/geronimo/specs/geronimo-j2ee-management_1.1_spec/1.0.1/geronimo-j2ee-management_1.1_spec-1.0.1.pom
Downloading: http://repo1.maven.org/maven2/org/apache/geronimo/specs/geronimo-j2ee-management_1.1_spec/1.0.1/geronimo-j2ee-management_1.1_spec-1.0.1.pom
Downloading: http://repository.springsource.com/maven/bundles/external/org/springframework/osgi/spring-osgi-core/1.2.1/spring-osgi-core-1.2.1.pom
Downloading: http://repo1.maven.org/maven2/org/springframework/osgi/spring-osgi-core/1.2.1/spring-osgi-core-1.2.1.pom
Downloading: http://repository.springsource.com/maven/bundles/external/org/springframework/osgi/spring-osgi/1.2.1/spring-osgi-1.2.1.pom
Downloading: http://repo1.maven.org/maven2/org/springframework/osgi/spring-osgi/1.2.1/spring-osgi-1.2.1.pom
Downloading: http://repository.springsource.com/maven/bundles/external/org/springframework/osgi/spring-osgi-io/1.2.1/spring-osgi-io-1.2.1.pom
Downloading: http://repo1.maven.org/eclipse//org/springframework/osgi/spring-osgi-io/1.2.1/spring-osgi-io-1.2.1.pom
Downloading: http://repository.springsource.com/maven/bundles/release/org/springframework/osgi/spring-osgi-io/1.2.1/spring-osgi-io-1.2.1.pom
Downloading: http://maven.springframework.org/release/org/springframework/osgi/spring-osgi-io/1.2.1/spring-osgi-io-1.2.1.pom
Downloading: http://maven.springframework.org/external/org/springframework/osgi/spring-osgi-io/1.2.1/spring-osgi-io-1.2.1.pom
Downloading: http://maven.springframework.org/milestone/org/springframework/osgi/spring-osgi-io/1.2.1/spring-osgi-io-1.2.1.pom
Downloading: http://springframework.svn.sourceforge.net/svnroot/springframework/repos/repo-ext//org/springframework/osgi/spring-osgi-io/1.2.1/spring-osgi-io-1.2.1.pom
Downloading: http://maven.springframework.org/snapshot/org/springframework/osgi/spring-osgi-io/1.2.1/spring-osgi-io-1.2.1.pom
Downloading: http://maven.springframework.org/osgi/org/springframework/osgi/spring-osgi-io/1.2.1/spring-osgi-io-1.2.1.pom
Downloading: http://repo1.maven.org/maven2/org/springframework/osgi/spring-osgi-io/1.2.1/spring-osgi-io-1.2.1.pom
Downloading: http://repository.springsource.com/maven/bundles/external/org/apache/geronimo/specs/geronimo-jta_1.0.1B_spec/1.0.1/geronimo-jta_1.0.1B_spec-1.0.1.pom
Downloading: http://repo1.maven.org/maven2/org/apache/geronimo/specs/geronimo-jta_1.0.1B_spec/1.0.1/geronimo-jta_1.0.1B_spec-1.0.1.pom
Downloading: http://repository.springsource.com/maven/bundles/external/org/apache/geronimo/specs/specs/1.1/specs-1.1.pom
Downloading: http://repo1.maven.org/maven2/org/apache/geronimo/specs/specs/1.1/specs-1.1.pom
Downloading: http://repository.springsource.com/maven/bundles/external/org/apache/apache/1/apache-1.pom
Downloading: http://repo1.maven.org/maven2/org/apache/apache/1/apache-1.pom
Downloading: http://repository.springsource.com/maven/bundles/external/org/apache/geronimo/specs/geronimo-j2ee-management_1.0_spec/1.0/geronimo-j2ee-management_1.0_spec-1.0.pom
Downloading: http://repo1.maven.org/maven2/org/apache/geronimo/specs/geronimo-j2ee-management_1.0_spec/1.0/geronimo-j2ee-management_1.0_spec-1.0.pom
Downloading: http://repository.springsource.com/maven/bundles/external/org/apache/geronimo/specs/geronimo-annotation_1.0_spec/1.1.1/geronimo-annotation_1.0_spec-1.1.1.pom
Downloading: http://repo1.maven.org/maven2/org/apache/geronimo/specs/geronimo-annotation_1.0_spec/1.1.1/geronimo-annotation_1.0_spec-1.1.1.pom
Downloading: http://repository.springsource.com/maven/bundles/external/org/apache/geronimo/specs/geronimo-jacc_1.1_spec/1.0.1/geronimo-jacc_1.1_spec-1.0.1.pom
Downloading: http://repo1.maven.org/maven2/org/apache/geronimo/specs/geronimo-jacc_1.1_spec/1.0.1/geronimo-jacc_1.1_spec-1.0.1.pom
Downloading: http://repository.springsource.com/maven/bundles/external/commons-pool/commons-pool/1.5.4/commons-pool-1.5.4.pom
Downloading: http://repo1.maven.org/maven2/commons-pool/commons-pool/1.5.4/commons-pool-1.5.4.pom
Downloading: http://repository.springsource.com/maven/bundles/external/org/apache/commons/commons-parent/12/commons-parent-12.pom
Downloading: http://repo1.maven.org/maven2/org/apache/commons/commons-parent/12/commons-parent-12.pom
Downloading: http://repository.springsource.com/maven/bundles/external/com/thoughtworks/xstream/xstream/1.3.1/xstream-1.3.1.pom
Downloading: http://repo1.maven.org/maven2/com/thoughtworks/xstream/xstream/1.3.1/xstream-1.3.1.pom
Downloading: http://repository.springsource.com/maven/bundles/external/com/thoughtworks/xstream/xstream-parent/1.3.1/xstream-parent-1.3.1.pom
Downloading: http://repo1.maven.org/maven2/com/thoughtworks/xstream/xstream-parent/1.3.1/xstream-parent-1.3.1.pom
Downloading: http://repository.springsource.com/maven/bundles/external/xpp3/xpp3_min/1.1.4c/xpp3_min-1.1.4c.pom
Downloading: http://repo1.maven.org/maven2/xpp3/xpp3_min/1.1.4c/xpp3_min-1.1.4c.pom
Downloading: http://repository.springsource.com/maven/bundles/external/org/springframework/spring-context/3.0.1.RELEASE/spring-context-3.0.1.RELEASE.pom
Downloading: http://repo1.maven.org/maven2/org/springframework/spring-context/3.0.1.RELEASE/spring-context-3.0.1.RELEASE.pom
Downloading: http://repository.springsource.com/maven/bundles/external/org/springframework/spring-parent/3.0.1.RELEASE/spring-parent-3.0.1.RELEASE.pom
Downloading: http://repo1.maven.org/maven2/org/springframework/spring-parent/3.0.1.RELEASE/spring-parent-3.0.1.RELEASE.pom
Downloading: http://repository.springsource.com/maven/bundles/external/org/springframework/spring-aop/3.0.1.RELEASE/spring-aop-3.0.1.RELEASE.pom
Downloading: http://repo1.maven.org/maven2/org/springframework/spring-aop/3.0.1.RELEASE/spring-aop-3.0.1.RELEASE.pom
Downloading: http://repository.springsource.com/maven/bundles/external/aopalliance/aopalliance/1.0/aopalliance-1.0.pom
Downloading: http://repo1.maven.org/maven2/aopalliance/aopalliance/1.0/aopalliance-1.0.pom
Downloading: http://repository.springsource.com/maven/bundles/external/org/springframework/spring-asm/3.0.1.RELEASE/spring-asm-3.0.1.RELEASE.pom
Downloading: http://repo1.maven.org/maven2/org/springframework/spring-asm/3.0.1.RELEASE/spring-asm-3.0.1.RELEASE.pom
Downloading: http://repository.springsource.com/maven/bundles/external/org/springframework/spring-beans/3.0.1.RELEASE/spring-beans-3.0.1.RELEASE.pom
Downloading: http://repo1.maven.org/maven2/org/springframework/spring-beans/3.0.1.RELEASE/spring-beans-3.0.1.RELEASE.pom
Downloading: http://repository.springsource.com/maven/bundles/external/org/springframework/spring-core/3.0.1.RELEASE/spring-core-3.0.1.RELEASE.pom
Downloading: http://repo1.maven.org/maven2/org/springframework/spring-core/3.0.1.RELEASE/spring-core-3.0.1.RELEASE.pom
Downloading: http://repository.springsource.com/maven/bundles/external/org/springframework/spring-expression/3.0.1.RELEASE/spring-expression-3.0.1.RELEASE.pom
Downloading: http://repo1.maven.org/maven2/org/springframework/spring-expression/3.0.1.RELEASE/spring-expression-3.0.1.RELEASE.pom
Downloading: http://repository.springsource.com/maven/bundles/external/org/apache/derby/derby/10.1.3.1/derby-10.1.3.1.pom
Downloading: http://repo1.maven.org/maven2/org/apache/derby/derby/10.1.3.1/derby-10.1.3.1.pom
Downloading: http://repository.springsource.com/maven/bundles/external/xalan/xalan/2.6.0/xalan-2.6.0.pom
Downloading: http://repo1.maven.org/maven2/xalan/xalan/2.6.0/xalan-2.6.0.pom
Downloading: http://repository.springsource.com/maven/bundles/external/xml-apis/xml-apis/2.0.2/xml-apis-2.0.2.pom
Downloading: http://repo1.maven.org/maven2/xml-apis/xml-apis/2.0.2/xml-apis-2.0.2.pom
Downloading: http://repository.springsource.com/maven/bundles/external/commons-net/commons-net/2.0/commons-net-2.0.pom
Downloading: http://repo1.maven.org/maven2/commons-net/commons-net/2.0/commons-net-2.0.pom
Downloading: http://repository.springsource.com/maven/bundles/external/org/apache/commons/commons-parent/11/commons-parent-11.pom
Downloading: http://repo1.maven.org/maven2/org/apache/commons/commons-parent/11/commons-parent-11.pom
Downloading: http://repository.springsource.com/maven/bundles/external/org/hamcrest/hamcrest-all/1.1/hamcrest-all-1.1.pom
Downloading: http://repo1.maven.org/maven2/org/hamcrest/hamcrest-all/1.1/hamcrest-all-1.1.pom
Downloading: http://repository.springsource.com/maven/bundles/external/org/hamcrest/hamcrest-parent/1.1/hamcrest-parent-1.1.pom
Downloading: http://repo1.maven.org/maven2/org/hamcrest/hamcrest-parent/1.1/hamcrest-parent-1.1.pom
Downloading: http://repository.springsource.com/maven/bundles/external/org/codehaus/jettison/jettison/1.0/jettison-1.0.pom
Downloading: http://repo1.maven.org/maven2/org/codehaus/jettison/jettison/1.0/jettison-1.0.pom
Downloading: http://repository.springsource.com/maven/bundles/external/stax/stax-api/1.0.1/stax-api-1.0.1.pom
Downloading: http://repo1.maven.org/maven2/stax/stax-api/1.0.1/stax-api-1.0.1.pom
Downloading: http://repository.springsource.com/maven/bundles/external/org/springframework/spring-jms/3.0.1.RELEASE/spring-jms-3.0.1.RELEASE.pom
Downloading: http://repo1.maven.org/maven2/org/springframework/spring-jms/3.0.1.RELEASE/spring-jms-3.0.1.RELEASE.pom
Downloading: http://repository.springsource.com/maven/bundles/external/org/springframework/spring-tx/3.0.1.RELEASE/spring-tx-3.0.1.RELEASE.pom
Downloading: http://repo1.maven.org/maven2/org/springframework/spring-tx/3.0.1.RELEASE/spring-tx-3.0.1.RELEASE.pom
Downloading: http://repository.springsource.com/maven/bundles/external/org/springframework/spring-test/3.0.1.RELEASE/spring-test-3.0.1.RELEASE.pom
Downloading: http://repo1.maven.org/maven2/org/springframework/spring-test/3.0.1.RELEASE/spring-test-3.0.1.RELEASE.pom
Downloading: http://repository.springsource.com/maven/bundles/external/commons-primitives/commons-primitives/1.0/commons-primitives-1.0.pom
Downloading: http://repo1.maven.org/maven2/commons-primitives/commons-primitives/1.0/commons-primitives-1.0.pom
Downloading: http://repository.springsource.com/maven/bundles/external/axion/axion/1.0-M3-dev/axion-1.0-M3-dev.pom
Downloading: http://repo1.maven.org/maven2/axion/axion/1.0-M3-dev/axion-1.0-M3-dev.pom
Downloading: http://repository.springsource.com/maven/bundles/external/commons-codec/commons-codec/1.2/commons-codec-1.2.pom
Downloading: http://repo1.maven.org/maven2/commons-codec/commons-codec/1.2/commons-codec-1.2.pom
Downloading: http://repository.springsource.com/maven/bundles/external/javacc/javacc/3.2/javacc-3.2.pom
Downloading: http://repo1.maven.org/maven2/javacc/javacc/3.2/javacc-3.2.pom
Downloading: http://repository.springsource.com/maven/bundles/external/net/java/dev/javacc/javacc/3.2/javacc-3.2.pom
Downloading: http://repo1.maven.org/maven2/net/java/dev/javacc/javacc/3.2/javacc-3.2.pom
Downloading: http://repository.springsource.com/maven/bundles/external/regexp/regexp/1.3/regexp-1.3.pom
Downloading: http://repo1.maven.org/maven2/regexp/regexp/1.3/regexp-1.3.pom
Downloading: http://repository.springsource.com/maven/bundles/external/org/apache/directory/server/apacheds-core/1.0.0/apacheds-core-1.0.0.pom
Downloading: http://repo1.maven.org/maven2/org/apache/directory/server/apacheds-core/1.0.0/apacheds-core-1.0.0.pom
Downloading: http://repository.springsource.com/maven/bundles/external/org/apache/directory/server/build/1.0.0/build-1.0.0.pom
Downloading: http://repo1.maven.org/maven2/org/apache/directory/server/build/1.0.0/build-1.0.0.pom
Downloading: http://repository.springsource.com/maven/bundles/external/org/apache/directory/build/1.0.5/build-1.0.5.pom
Downloading: http://repo1.maven.org/maven2/org/apache/directory/build/1.0.5/build-1.0.5.pom
Downloading: http://repository.springsource.com/maven/bundles/external/jdbm/jdbm/1.0/jdbm-1.0.pom
Downloading: http://m2.safehaus.org/jdbm/jdbm/1.0/jdbm-1.0.pom
Downloading: http://repo1.maven.org/maven2/jdbm/jdbm/1.0/jdbm-1.0.pom
Downloading: http://repository.springsource.com/maven/bundles/external/org/apache/directory/server/apacheds-core-shared/1.0.0/apacheds-core-shared-1.0.0.pom
Downloading: http://m2.safehaus.org/org/apache/directory/server/apacheds-core-shared/1.0.0/apacheds-core-shared-1.0.0.pom
Downloading: http://repo1.maven.org/maven2/org/apache/directory/server/apacheds-core-shared/1.0.0/apacheds-core-shared-1.0.0.pom
Downloading: http://repository.springsource.com/maven/bundles/external/org/apache/directory/shared/shared-ldap/0.9.5.3/shared-ldap-0.9.5.3.pom
Downloading: http://m2.safehaus.org/org/apache/directory/shared/shared-ldap/0.9.5.3/shared-ldap-0.9.5.3.pom
Build timed out. Aborting
[locks-and-latches] Releasing all the locks
[locks-and-latches] All the locks released
ERROR: Failed to parse POMs
hudson.remoting.ChannelClosedException: channel is already closed
	at hudson.remoting.Channel.send(Channel.java:412)
	at hudson.remoting.ProxyOutputStream.write(ProxyOutputStream.java:112)
	at hudson.remoting.ProxyOutputStream.write(ProxyOutputStream.java:100)
	at hudson.remoting.RemoteOutputStream.write(RemoteOutputStream.java:110)
	at java.io.BufferedOutputStream.flushBuffer(BufferedOutputStream.java:65)
	at java.io.BufferedOutputStream.flush(BufferedOutputStream.java:123)
	at java.io.BufferedOutputStream.flush(BufferedOutputStream.java:124)
	at java.io.ObjectOutputStream$BlockDataOutputStream.flush(ObjectOutputStream.java:1784)
	at java.io.ObjectOutputStream.flush(ObjectOutputStream.java:691)
	at hudson.remoting.Channel.send(Channel.java:418)
	at hudson.remoting.Request.call(Request.java:149)
	at hudson.remoting.Channel.call(Channel.java:551)
	at hudson.maven.ProcessCache$MavenProcess.call(ProcessCache.java:156)
	at hudson.maven.MavenModuleSetBuild$RunnerImpl.doRun(MavenModuleSetBuild.java:480)
	at hudson.model.AbstractBuild$AbstractRunner.run(AbstractBuild.java:416)
	at hudson.model.Run.run(Run.java:1243)
	at hudson.maven.MavenModuleSetBuild.run(MavenModuleSetBuild.java:304)
	at hudson.model.ResourceController.execute(ResourceController.java:88)
	at hudson.model.Executor.run(Executor.java:122)
FATAL: channel is already closed
hudson.remoting.ChannelClosedException: channel is already closed
	at hudson.remoting.Channel.send(Channel.java:412)
	at hudson.remoting.Request.call(Request.java:105)
	at hudson.remoting.Channel.call(Channel.java:551)
	at hudson.Launcher$RemoteLauncher.kill(Launcher.java:735)
	at hudson.model.AbstractBuild$AbstractRunner.run(AbstractBuild.java:421)
	at hudson.model.Run.run(Run.java:1243)
	at hudson.maven.MavenModuleSetBuild.run(MavenModuleSetBuild.java:304)
	at hudson.model.ResourceController.execute(ResourceController.java:88)
	at hudson.model.Executor.run(Executor.java:122)


Build failed in Hudson: ActiveMQ #393

Posted by Apache Hudson Server <hu...@hudson.zones.apache.org>.
See <http://hudson.zones.apache.org/hudson/job/ActiveMQ/393/changes>

Changes:

[dejanb] https://issues.apache.org/activemq/browse/AMQ-2453 - some improvements to unix start script

[gtully] even more input to doc comment re pooling: https://issues.apache.org/activemq/browse/AMQ-2806

[gtully] more input to doc comment re pooling: https://issues.apache.org/activemq/browse/AMQ-2806

------------------------------------------
[...truncated 6246 lines...]
Tests run: 131, Failures: 0, Errors: 0, Skipped: 0, Time elapsed: 686.783 sec
Running org.apache.activemq.openwire.v2.ConnectionErrorTest
Tests run: 1, Failures: 0, Errors: 0, Skipped: 0, Time elapsed: 0.176 sec
Running org.apache.activemq.usecases.StartAndStopClientAndBrokerDoesNotLeaveThreadsRunningTest
Tests run: 1, Failures: 0, Errors: 0, Skipped: 0, Time elapsed: 2.666 sec
Running org.apache.activemq.openwire.v2.ResponseTest
Tests run: 1, Failures: 0, Errors: 0, Skipped: 0, Time elapsed: 0.175 sec
Running org.apache.activemq.broker.region.cursors.StoreQueueCursorKahaDBNoDuplicateTest
Tests run: 1, Failures: 0, Errors: 0, Skipped: 0, Time elapsed: 0.843 sec
Running org.apache.activemq.test.message.NestedMapAndListPropertyTest
Tests run: 1, Failures: 0, Errors: 1, Skipped: 0, Time elapsed: 1.969 sec <<< FAILURE!
Running org.apache.activemq.OnePrefetchAsyncConsumerTest
Tests run: 1, Failures: 0, Errors: 0, Skipped: 0, Time elapsed: 6.586 sec
Running org.apache.activemq.network.DemandForwardingBridgeTest
Tests run: 6, Failures: 0, Errors: 0, Skipped: 0, Time elapsed: 4.558 sec
Running org.apache.activemq.broker.scheduler.JobSchedulerStoreTest
Tests run: 1, Failures: 0, Errors: 0, Skipped: 0, Time elapsed: 2.112 sec
Running org.apache.activemq.command.MessageSendTest
Tests run: 2, Failures: 0, Errors: 0, Skipped: 0, Time elapsed: 0.208 sec
Running org.apache.activemq.openwire.v5.RemoveSubscriptionInfoTest
Tests run: 1, Failures: 0, Errors: 0, Skipped: 0, Time elapsed: 0.171 sec
Running org.apache.activemq.JmsClientAckListenerTest
Tests run: 2, Failures: 0, Errors: 0, Skipped: 0, Time elapsed: 21.871 sec
Running org.apache.activemq.bugs.AMQ2314Test
Tests run: 2, Failures: 0, Errors: 0, Skipped: 0, Time elapsed: 55.13 sec
Running org.apache.activemq.broker.DoubleSubscriptionTest
Tests run: 1, Failures: 0, Errors: 0, Skipped: 0, Time elapsed: 2.683 sec
Running org.apache.activemq.thread.TaskRunnerTest
Tests run: 2, Failures: 0, Errors: 0, Skipped: 0, Time elapsed: 0.544 sec
Running org.apache.activemq.openwire.v6.JournalQueueAckTest
Tests run: 1, Failures: 0, Errors: 0, Skipped: 0, Time elapsed: 0.192 sec
Running org.apache.activemq.JmsQueueCompositeSendReceiveTest
Tests run: 2, Failures: 0, Errors: 0, Skipped: 0, Time elapsed: 2.18 sec
Running org.apache.activemq.memory.buffer.SizeBasedMessageBufferTest
Tests run: 1, Failures: 0, Errors: 0, Skipped: 0, Time elapsed: 0.125 sec
Running org.apache.activemq.openwire.v2.ProducerInfoTest
Tests run: 1, Failures: 0, Errors: 0, Skipped: 0, Time elapsed: 0.195 sec
Running org.apache.activemq.openwire.v3.ConsumerControlTest
Tests run: 1, Failures: 0, Errors: 0, Skipped: 0, Time elapsed: 0.175 sec
Running org.apache.activemq.advisory.TempQueueMemoryTest
Tests run: 2, Failures: 0, Errors: 0, Skipped: 0, Time elapsed: 34.826 sec
Running org.apache.activemq.openwire.v3.JournalQueueAckTest
Tests run: 1, Failures: 0, Errors: 0, Skipped: 0, Time elapsed: 0.207 sec
Running org.apache.activemq.test.message.NestedMapMessageTest
Tests run: 1, Failures: 0, Errors: 0, Skipped: 0, Time elapsed: 3.9 sec
Running org.apache.activemq.openwire.v4.MessageDispatchTest
Tests run: 1, Failures: 0, Errors: 0, Skipped: 0, Time elapsed: 0.217 sec
Running org.apache.activemq.broker.policy.DestinationCursorConfigTest
Tests run: 2, Failures: 0, Errors: 0, Skipped: 0, Time elapsed: 1.628 sec
Running org.apache.activemq.transport.tcp.InactivityMonitorTest
Tests run: 3, Failures: 0, Errors: 0, Skipped: 0, Time elapsed: 14.267 sec
Running org.apache.activemq.ActiveMQConnectionFactoryTest
Tests run: 12, Failures: 0, Errors: 0, Skipped: 0, Time elapsed: 7.676 sec
Running org.apache.activemq.openwire.v1.ShutdownInfoTest
Tests run: 1, Failures: 0, Errors: 0, Skipped: 0, Time elapsed: 0.174 sec
Running org.apache.activemq.openwire.v2.MessageDispatchTest
Tests run: 1, Failures: 0, Errors: 0, Skipped: 0, Time elapsed: 0.218 sec
Running org.apache.activemq.usecases.StartAndStopBrokerTest
Tests run: 1, Failures: 0, Errors: 0, Skipped: 0, Time elapsed: 6.51 sec
Running org.apache.activemq.openwire.v3.MessageAckTest
Tests run: 1, Failures: 0, Errors: 0, Skipped: 0, Time elapsed: 0.194 sec
Running org.apache.activemq.store.kahadb.KahaDBStoreOrderTest
Tests run: 1, Failures: 0, Errors: 0, Skipped: 0, Time elapsed: 2.666 sec
Running org.apache.activemq.filter.DestinationFilterTest
Tests run: 3, Failures: 0, Errors: 0, Skipped: 0, Time elapsed: 0.061 sec
Running org.apache.activemq.broker.ft.JDBCQueueMasterSlaveTest
Tests run: 1, Failures: 0, Errors: 0, Skipped: 0, Time elapsed: 23.503 sec
Running org.apache.activemq.openwire.v1.RemoveInfoTest
Tests run: 1, Failures: 0, Errors: 0, Skipped: 0, Time elapsed: 0.185 sec
Running org.apache.activemq.openwire.v3.TransactionInfoTest
Tests run: 1, Failures: 0, Errors: 0, Skipped: 0, Time elapsed: 0.179 sec
Running org.apache.activemq.usecases.ThreeBrokerQueueNetworkTest
Tests run: 13, Failures: 0, Errors: 0, Skipped: 0, Time elapsed: 184.756 sec
Running org.apache.activemq.bugs.ConnectionPerMessageTest
Tests run: 1, Failures: 0, Errors: 0, Skipped: 0, Time elapsed: 18.659 sec
Running org.apache.activemq.command.ActiveMQStreamMessageTest
Tests run: 18, Failures: 0, Errors: 0, Skipped: 0, Time elapsed: 0.493 sec
Running org.apache.activemq.openwire.v5.RemoveInfoTest
Tests run: 1, Failures: 0, Errors: 0, Skipped: 0, Time elapsed: 0.192 sec
Running org.apache.activemq.usecases.TwoMulticastDiscoveryBrokerTopicSendReceiveTest
Tests run: 1, Failures: 0, Errors: 0, Skipped: 0, Time elapsed: 20.217 sec
Running org.apache.activemq.broker.policy.StrictOrderDispatchPolicyTest
Tests run: 8, Failures: 0, Errors: 0, Skipped: 0, Time elapsed: 7.103 sec
Running org.apache.activemq.broker.virtual.VirtualTopicPubSubUsingXBeanTest
Tests run: 2, Failures: 0, Errors: 0, Skipped: 0, Time elapsed: 0.92 sec
Running org.apache.activemq.openwire.v3.DiscoveryEventTest
Tests run: 1, Failures: 0, Errors: 0, Skipped: 0, Time elapsed: 0.167 sec
Running org.apache.activemq.openwire.v3.DataResponseTest
Tests run: 1, Failures: 0, Errors: 0, Skipped: 0, Time elapsed: 0.188 sec
Running org.apache.activemq.broker.region.QueuePurgeTest
Tests run: 4, Failures: 0, Errors: 0, Skipped: 0, Time elapsed: 339.253 sec
Running org.apache.activemq.JMSDurableTopicRedeliverTest
Tests run: 2, Failures: 0, Errors: 0, Skipped: 0, Time elapsed: 1.807 sec
Running org.apache.activemq.MessageEvictionTest
Tests run: 3, Failures: 0, Errors: 0, Skipped: 0, Time elapsed: 118.983 sec
Running org.apache.activemq.xbean.ConnectorXBeanConfigTest
Tests run: 3, Failures: 0, Errors: 0, Skipped: 0, Time elapsed: 14.995 sec
Running org.apache.activemq.openwire.v3.PartialCommandTest
Tests run: 1, Failures: 0, Errors: 0, Skipped: 0, Time elapsed: 0.167 sec
Running org.apache.activemq.RemoveDestinationTest
Tests run: 2, Failures: 0, Errors: 0, Skipped: 0, Time elapsed: 20.096 sec
Running org.apache.activemq.config.BrokerPropertiesTest
Tests run: 1, Failures: 0, Errors: 0, Skipped: 0, Time elapsed: 0.226 sec
Running org.apache.activemq.openwire.v6.FlushCommandTest
Tests run: 1, Failures: 0, Errors: 0, Skipped: 0, Time elapsed: 0.185 sec
Running org.apache.activemq.openwire.v4.ConsumerControlTest
Tests run: 1, Failures: 0, Errors: 0, Skipped: 0, Time elapsed: 0.183 sec
Running org.apache.activemq.network.DemandForwardingBridgeFilterTest
Tests run: 5, Failures: 0, Errors: 0, Skipped: 0, Time elapsed: 24.823 sec
Running org.apache.activemq.bugs.AMQ2356Test
Tests run: 1, Failures: 0, Errors: 0, Skipped: 0, Time elapsed: 18.694 sec
Running org.apache.activemq.JmsQueueBrowserTest
Tests run: 3, Failures: 0, Errors: 0, Skipped: 0, Time elapsed: 2.292 sec
Running org.apache.activemq.command.ActiveMQObjectMessageTest
Tests run: 5, Failures: 0, Errors: 0, Skipped: 0, Time elapsed: 0.074 sec
Running org.apache.activemq.bugs.AMQ2084Test
Tests run: 2, Failures: 0, Errors: 0, Skipped: 0, Time elapsed: 8.913 sec
Running org.apache.activemq.openwire.v6.SessionIdTest
Tests run: 1, Failures: 0, Errors: 0, Skipped: 0, Time elapsed: 0.182 sec
Running org.apache.activemq.openwire.v2.MessageIdTest
Tests run: 1, Failures: 0, Errors: 0, Skipped: 0, Time elapsed: 0.191 sec
Running org.apache.activemq.xbean.JDBCPersistenceXBeanConfigTest
Tests run: 1, Failures: 0, Errors: 0, Skipped: 0, Time elapsed: 2.994 sec
Running org.apache.activemq.openwire.v1.RemoveSubscriptionInfoTest
Tests run: 1, Failures: 0, Errors: 0, Skipped: 0, Time elapsed: 0.195 sec
Running org.apache.activemq.transport.failover.FailoverTimeoutTest
Tests run: 1, Failures: 0, Errors: 0, Skipped: 0, Time elapsed: 7.401 sec
Running org.apache.activemq.JmsQueueTransactionTest
Tests run: 17, Failures: 0, Errors: 0, Skipped: 0, Time elapsed: 12.603 sec
Running org.apache.activemq.JmsTopicWildcardSendReceiveTest
Tests run: 4, Failures: 0, Errors: 0, Skipped: 0, Time elapsed: 2.104 sec
Running org.apache.activemq.test.JmsTopicSendReceiveWithTwoConnectionsTest
Tests run: 1, Failures: 0, Errors: 0, Skipped: 0, Time elapsed: 1.817 sec
Running org.apache.activemq.openwire.v6.ConsumerInfoTest
Tests run: 1, Failures: 0, Errors: 0, Skipped: 0, Time elapsed: 0.206 sec
Running org.apache.activemq.JmsAutoAckTest
Tests run: 1, Failures: 0, Errors: 0, Skipped: 0, Time elapsed: 1.852 sec
Running org.apache.activemq.usecases.ObjectMessageNotSerializableTest
Tests run: 1, Failures: 0, Errors: 0, Skipped: 0, Time elapsed: 1.502 sec
Running org.apache.activemq.openwire.v6.ProducerInfoTest
Tests run: 1, Failures: 0, Errors: 0, Skipped: 0, Time elapsed: 0.185 sec
Running org.apache.activemq.usecases.UnlimitedEnqueueTest
Tests run: 1, Failures: 0, Errors: 0, Skipped: 0, Time elapsed: 55.753 sec
Running org.apache.activemq.xbean.MultipleTestsWithEmbeddedBrokerTest
Tests run: 2, Failures: 0, Errors: 0, Skipped: 0, Time elapsed: 0.735 sec
Running org.apache.activemq.management.BoundaryStatisticTest
Tests run: 1, Failures: 0, Errors: 0, Skipped: 0, Time elapsed: 0.134 sec
Running org.apache.activemq.openwire.v3.ProducerAckTest
Tests run: 1, Failures: 0, Errors: 0, Skipped: 0, Time elapsed: 0.193 sec
Running org.apache.activemq.transport.vm.VMTransportEmbeddedBrokerTest
Tests run: 1, Failures: 0, Errors: 0, Skipped: 0, Time elapsed: 0.627 sec
Running org.apache.activemq.openwire.v5.LastPartialCommandTest
Tests run: 1, Failures: 0, Errors: 0, Skipped: 0, Time elapsed: 0.166 sec
Running org.apache.activemq.test.JmsTopicSendReceiveWithTwoConnectionsAndByteSelectorTest
Tests run: 1, Failures: 0, Errors: 0, Skipped: 0, Time elapsed: 1.764 sec
Running org.apache.activemq.broker.ReconnectWithJMXEnabledTest
Tests run: 1, Failures: 0, Errors: 0, Skipped: 0, Time elapsed: 4.611 sec
Running org.apache.activemq.xbean.XBeanConfigTest
Tests run: 1, Failures: 0, Errors: 0, Skipped: 0, Time elapsed: 1.506 sec
Running org.apache.activemq.util.BitArrayBinTest
Tests run: 3, Failures: 0, Errors: 0, Skipped: 0, Time elapsed: 0.218 sec
Running org.apache.activemq.openwire.v3.ConsumerInfoTest
Tests run: 1, Failures: 0, Errors: 0, Skipped: 0, Time elapsed: 0.203 sec
Running org.apache.activemq.broker.region.cursors.NegativeQueueTest
Tests run: 7, Failures: 0, Errors: 0, Skipped: 0, Time elapsed: 303.784 sec
Running org.apache.activemq.openwire.v1.MessageAckTest
Tests run: 1, Failures: 0, Errors: 0, Skipped: 0, Time elapsed: 0.196 sec
Running org.apache.activemq.JmsSessionRecoverTest
Tests run: 6, Failures: 0, Errors: 0, Skipped: 0, Time elapsed: 1.038 sec
Running org.apache.activemq.openwire.v2.ConnectionInfoTest
Tests run: 1, Failures: 0, Errors: 0, Skipped: 0, Time elapsed: 0.172 sec
Running org.apache.activemq.broker.scheduler.JmsSchedulerTest
Tests run: 4, Failures: 0, Errors: 0, Skipped: 0, Time elapsed: 82.318 sec
Running org.apache.activemq.openwire.v6.ConnectionControlTest
Tests run: 1, Failures: 0, Errors: 0, Skipped: 0, Time elapsed: 0.17 sec
Running org.apache.activemq.broker.region.cursors.StoreQueueCursorNoDuplicateTest
Tests run: 1, Failures: 0, Errors: 0, Skipped: 0, Time elapsed: 1.519 sec
Running org.apache.activemq.openwire.v3.JournalTransactionTest
Tests run: 1, Failures: 0, Errors: 0, Skipped: 0, Time elapsed: 0.168 sec
Running org.apache.activemq.openwire.v3.ResponseTest
Tests run: 1, Failures: 0, Errors: 0, Skipped: 0, Time elapsed: 0.179 sec
Running org.apache.activemq.usecases.MessageGroupNewConsumerTest
Tests run: 1, Failures: 0, Errors: 0, Skipped: 0, Time elapsed: 4.128 sec
Running org.apache.activemq.openwire.v1.ConsumerControlTest
Tests run: 1, Failures: 0, Errors: 0, Skipped: 0, Time elapsed: 0.181 sec
Running org.apache.activemq.openwire.v4.MessageAckTest
Tests run: 1, Failures: 0, Errors: 0, Skipped: 0, Time elapsed: 0.193 sec
Running org.apache.activemq.openwire.v4.ProducerIdTest
Tests run: 1, Failures: 0, Errors: 0, Skipped: 0, Time elapsed: 0.186 sec
Running org.apache.activemq.JmsQueueTopicCompositeSendReceiveTest
Tests run: 1, Failures: 0, Errors: 0, Skipped: 0, Time elapsed: 1.788 sec
Running org.apache.activemq.transport.discovery.DiscoveryNetworkReconnectTest
Tests run: 2, Failures: 0, Errors: 0, Skipped: 0, Time elapsed: 37.199 sec
Running org.apache.activemq.bugs.AMQ2102Test
Tests run: 2, Failures: 0, Errors: 0, Skipped: 0, Time elapsed: 250.066 sec
Running org.apache.activemq.broker.BrokerServiceTest
Tests run: 5, Failures: 0, Errors: 0, Skipped: 0, Time elapsed: 4.604 sec
Running org.apache.activemq.ProducerFlowControlSendFailTest
Tests run: 7, Failures: 0, Errors: 0, Skipped: 0, Time elapsed: 14.557 sec
Running org.apache.activemq.ProducerFlowControlTest
Tests run: 6, Failures: 0, Errors: 0, Skipped: 0, Time elapsed: 25.688 sec
Running org.apache.activemq.broker.virtual.VirtualTopicsAndDurableSubsTest
Tests run: 7, Failures: 0, Errors: 0, Skipped: 0, Time elapsed: 14.75 sec
Running org.apache.activemq.openwire.v5.MessageDispatchTest
Tests run: 1, Failures: 0, Errors: 0, Skipped: 0, Time elapsed: 0.207 sec
Running org.apache.activemq.network.DuplexNetworkMBeanTest
Tests run: 2, Failures: 0, Errors: 0, Skipped: 0, Time elapsed: 23.746 sec
Running org.apache.activemq.openwire.v1.JournalTransactionTest
Tests run: 1, Failures: 0, Errors: 0, Skipped: 0, Time elapsed: 0.179 sec
Running org.apache.activemq.management.BoundedRangeStatisticTest
Tests run: 1, Failures: 0, Errors: 0, Skipped: 0, Time elapsed: 0.619 sec
Running org.apache.activemq.JmsSendReceiveWithMessageExpirationTest
Tests run: 4, Failures: 0, Errors: 0, Skipped: 0, Time elapsed: 15.069 sec
Running org.apache.activemq.transport.TopicClusterTest
Build timed out. Aborting
[locks-and-latches] Releasing all the locks
[locks-and-latches] All the locks released
ERROR: Failed to parse POMs
hudson.remoting.ChannelClosedException: channel is already closed
	at hudson.remoting.Channel.send(Channel.java:412)
	at hudson.remoting.ProxyOutputStream.write(ProxyOutputStream.java:112)
	at hudson.remoting.ProxyOutputStream.write(ProxyOutputStream.java:100)
	at hudson.remoting.RemoteOutputStream.write(RemoteOutputStream.java:110)
	at java.io.BufferedOutputStream.flushBuffer(BufferedOutputStream.java:65)
	at java.io.BufferedOutputStream.flush(BufferedOutputStream.java:123)
	at java.io.BufferedOutputStream.flush(BufferedOutputStream.java:124)
	at java.io.ObjectOutputStream$BlockDataOutputStream.flush(ObjectOutputStream.java:1784)
	at java.io.ObjectOutputStream.flush(ObjectOutputStream.java:691)
	at hudson.remoting.Channel.send(Channel.java:418)
	at hudson.remoting.Request.call(Request.java:149)
	at hudson.remoting.Channel.call(Channel.java:551)
	at hudson.maven.ProcessCache$MavenProcess.call(ProcessCache.java:156)
	at hudson.maven.MavenModuleSetBuild$RunnerImpl.doRun(MavenModuleSetBuild.java:480)
	at hudson.model.AbstractBuild$AbstractRunner.run(AbstractBuild.java:416)
	at hudson.model.Run.run(Run.java:1243)
	at hudson.maven.MavenModuleSetBuild.run(MavenModuleSetBuild.java:304)
	at hudson.model.ResourceController.execute(ResourceController.java:88)
	at hudson.model.Executor.run(Executor.java:122)
FATAL: channel is already closed
hudson.remoting.ChannelClosedException: channel is already closed
	at hudson.remoting.Channel.send(Channel.java:412)
	at hudson.remoting.Request.call(Request.java:105)
	at hudson.remoting.Channel.call(Channel.java:551)
	at hudson.Launcher$RemoteLauncher.kill(Launcher.java:735)
	at hudson.model.AbstractBuild$AbstractRunner.run(AbstractBuild.java:421)
	at hudson.model.Run.run(Run.java:1243)
	at hudson.maven.MavenModuleSetBuild.run(MavenModuleSetBuild.java:304)
	at hudson.model.ResourceController.execute(ResourceController.java:88)
	at hudson.model.Executor.run(Executor.java:122)