You are viewing a plain text version of this content. The canonical link for it is here.
Posted to notifications@maven.apache.org by Apache Jenkins Server <je...@builds.apache.org> on 2018/08/08 18:27:17 UTC

Build failed in Jenkins: Maven TLP » maven-release » MRELEASE-1010 #8

See https://builds.apache.org/job/maven-box/job/maven-release/job/MRELEASE-1010/8/

No changes.

All tests passed

Build log:
[...truncated 8.44 MB...]
[linux-jdk10] [INFO] 
[linux-jdk10] [INFO] --- maven-checkstyle-plugin:3.0.0:check (checkstyle-check) @ maven-release-plugin ---
[linux-jdk10] [INFO] 
[linux-jdk10] [INFO] ------------------------------------------------------------------------
[linux-jdk10] [INFO] Building Maven Release Odd-Even Policy 3.0.0-SNAPSHOT
[linux-jdk10] [INFO] ------------------------------------------------------------------------
[linux-jdk10] [INFO] 
[linux-jdk10] [INFO] --- maven-clean-plugin:3.1.0:clean (default-clean) @ maven-release-oddeven-policy ---
[linux-jdk10] [INFO] 
[linux-jdk10] [INFO] --- maven-enforcer-plugin:1.4.1:enforce (enforce-maven-version) @ maven-release-oddeven-policy ---
[linux-jdk10] [INFO] 
[linux-jdk10] [INFO] --- maven-enforcer-plugin:1.4.1:enforce (enforce-bytecode-version) @ maven-release-oddeven-policy ---
[linux-jdk10] [INFO] 
[linux-jdk10] [INFO] --- maven-enforcer-plugin:1.4.1:enforce (ban-known-bad-maven-versions) @ maven-release-oddeven-policy ---
[linux-jdk10] [INFO] 
[linux-jdk10] [INFO] --- apache-rat-plugin:0.12:check (rat-check) @ maven-release-oddeven-policy ---
[linux-jdk10] [INFO] Enabled default license matchers.
[linux-jdk10] [INFO] Will parse SCM ignores for exclusions...
[linux-jdk10] [INFO] Finished adding exclusions from SCM ignore files.
[linux-jdk10] [INFO] 61 implicit excludes (use -debug for more details).
[linux-jdk10] [INFO] Exclude: .repository
[linux-jdk10] [INFO] Exclude: Jenkinsfile
[linux-jdk10] [INFO] Exclude: .repository/**
[linux-jdk10] [INFO] Exclude: .maven/spy.log
[linux-jdk10] [INFO] Exclude: dependency-reduced-pom.xml
[linux-jdk10] [INFO] Exclude: .java-version
[linux-jdk10] [INFO] 4 resources included (use -debug for more details)
[linux-jdk10] [INFO] Rat check: Summary over all files. Unapproved: 0, unknown: 0, generated: 0, approved: 4 licenses.
[linux-jdk10] [INFO] 
[linux-jdk10] [INFO] --- maven-remote-resources-plugin:1.5:process (process-resource-bundles) @ maven-release-oddeven-policy ---
[linux-jdk10] [INFO] 
[linux-jdk10] [INFO] --- maven-resources-plugin:3.1.0:resources (default-resources) @ maven-release-oddeven-policy ---
[linux-jdk10] [INFO] Using 'UTF-8' encoding to copy filtered resources.
[linux-jdk10] [INFO] skip non existing resourceDirectory /home/jenkins/jenkins-slave/workspace/maven-release_MRELEASE-1010-EJSYEVM3Q5HW74P3YIOC3F6GPYCS3YZJ4IRX7EIB245MHT4XH6FQ/m/maven-release-policies/maven-release-oddeven-policy/src/main/resources
[linux-jdk10] [INFO] Copying 3 resources
[linux-jdk10] [INFO] 
[linux-jdk10] [INFO] --- maven-compiler-plugin:3.7.0:compile (default-compile) @ maven-release-oddeven-policy ---
[linux-jdk10] [INFO] Changes detected - recompiling the module!
[linux-jdk10] [INFO] Compiling 2 source files to /home/jenkins/jenkins-slave/workspace/maven-release_MRELEASE-1010-EJSYEVM3Q5HW74P3YIOC3F6GPYCS3YZJ4IRX7EIB245MHT4XH6FQ/m/maven-release-policies/maven-release-oddeven-policy/target/classes
[linux-jdk10] [INFO] 
[linux-jdk10] [INFO] --- plexus-component-metadata:1.7.1:generate-metadata (process-classes) @ maven-release-oddeven-policy ---
[linux-jdk10] [INFO] Discovered 1 component descriptors(s)
[linux-jdk10] [INFO] 
[linux-jdk10] [INFO] --- maven-resources-plugin:3.1.0:testResources (default-testResources) @ maven-release-oddeven-policy ---
[linux-jdk10] [INFO] Using 'UTF-8' encoding to copy filtered resources.
[linux-jdk10] [INFO] skip non existing resourceDirectory /home/jenkins/jenkins-slave/workspace/maven-release_MRELEASE-1010-EJSYEVM3Q5HW74P3YIOC3F6GPYCS3YZJ4IRX7EIB245MHT4XH6FQ/m/maven-release-policies/maven-release-oddeven-policy/src/test/resources
[linux-jdk10] [INFO] Copying 3 resources
[linux-jdk10] [INFO] 
[linux-jdk10] [INFO] --- maven-compiler-plugin:3.7.0:testCompile (default-testCompile) @ maven-release-oddeven-policy ---
[linux-jdk10] [INFO] Changes detected - recompiling the module!
[linux-jdk10] [INFO] Compiling 1 source file to /home/jenkins/jenkins-slave/workspace/maven-release_MRELEASE-1010-EJSYEVM3Q5HW74P3YIOC3F6GPYCS3YZJ4IRX7EIB245MHT4XH6FQ/m/maven-release-policies/maven-release-oddeven-policy/target/test-classes
[linux-jdk10] [INFO] 
[linux-jdk10] [INFO] --- maven-surefire-plugin:2.22.0:test (default-test) @ maven-release-oddeven-policy ---
[linux-jdk10] [INFO] 
[linux-jdk10] [INFO] -------------------------------------------------------
[linux-jdk10] [INFO]  T E S T S
[linux-jdk10] [INFO] -------------------------------------------------------
[linux-jdk10] [INFO] Running org.apache.maven.shared.release.policy.oddeven.OddEvenVersionPolicyTestCase
[linux-jdk10] [INFO] Tests run: 3, Failures: 0, Errors: 0, Skipped: 0, Time elapsed: 0.312 s - in org.apache.maven.shared.release.policy.oddeven.OddEvenVersionPolicyTestCase
[linux-jdk10] [INFO] 
[linux-jdk10] [INFO] Results:
[linux-jdk10] [INFO] 
[linux-jdk10] [INFO] Tests run: 3, Failures: 0, Errors: 0, Skipped: 0
[linux-jdk10] [INFO] 
[linux-jdk10] [INFO] 
[linux-jdk10] [INFO] --- maven-jar-plugin:3.1.0:jar (default-jar) @ maven-release-oddeven-policy ---
[linux-jdk10] [INFO] Building jar: /home/jenkins/jenkins-slave/workspace/maven-release_MRELEASE-1010-EJSYEVM3Q5HW74P3YIOC3F6GPYCS3YZJ4IRX7EIB245MHT4XH6FQ/m/maven-release-policies/maven-release-oddeven-policy/target/maven-release-oddeven-policy-3.0.0-SNAPSHOT.jar
[linux-jdk10] [INFO] 
[linux-jdk10] [INFO] --- maven-site-plugin:3.7.1:attach-descriptor (attach-descriptor) @ maven-release-oddeven-policy ---
[linux-jdk10] [INFO] Skipping because packaging 'jar' is not pom.
[linux-jdk10] [INFO] 
[linux-jdk10] [INFO] --- maven-checkstyle-plugin:3.0.0:check (checkstyle-check) @ maven-release-oddeven-policy ---
[linux-jdk10] [INFO] 
[linux-jdk10] [INFO] ------------------------------------------------------------------------
[linux-jdk10] [INFO] Building Maven Release SemVer Policy 3.0.0-SNAPSHOT
[linux-jdk10] [INFO] ------------------------------------------------------------------------
[linux-jdk10] [INFO] Downloading from central: https://repo.maven.apache.org/maven2/org/semver/api/0.9.33/api-0.9.33.pom
[linux-jdk10] [INFO] Downloaded from central: https://repo.maven.apache.org/maven2/org/semver/api/0.9.33/api-0.9.33.pom (2.8 kB at 189 kB/s)
[linux-jdk10] [INFO] Downloading from central: https://repo.maven.apache.org/maven2/org/semver/parent/0.9.33/parent-0.9.33.pom
[linux-jdk10] [INFO] Downloaded from central: https://repo.maven.apache.org/maven2/org/semver/parent/0.9.33/parent-0.9.33.pom (1.3 kB at 105 kB/s)
[linux-jdk10] [INFO] Downloading from central: https://repo.maven.apache.org/maven2/com/github/jeluard/oss-parent/9/oss-parent-9.pom
[linux-jdk10] [INFO] Downloaded from central: https://repo.maven.apache.org/maven2/com/github/jeluard/oss-parent/9/oss-parent-9.pom (12 kB at 890 kB/s)
[linux-jdk10] [INFO] Downloading from central: https://repo.maven.apache.org/maven2/com/google/code/findbugs/jsr305/2.0.0/jsr305-2.0.0.pom
[linux-jdk10] [INFO] Downloaded from central: https://repo.maven.apache.org/maven2/com/google/code/findbugs/jsr305/2.0.0/jsr305-2.0.0.pom (965 B at 64 kB/s)
[linux-jdk10] [INFO] Downloading from central: https://repo.maven.apache.org/maven2/org/ow2/asm/asm/5.0.3/asm-5.0.3.pom
[linux-jdk10] [INFO] Downloaded from central: https://repo.maven.apache.org/maven2/org/ow2/asm/asm/5.0.3/asm-5.0.3.pom (1.9 kB at 176 kB/s)
[linux-jdk10] [INFO] Downloading from central: https://repo.maven.apache.org/maven2/org/ow2/asm/asm-parent/5.0.3/asm-parent-5.0.3.pom
[linux-jdk10] [INFO] Downloaded from central: https://repo.maven.apache.org/maven2/org/ow2/asm/asm-parent/5.0.3/asm-parent-5.0.3.pom (5.5 kB at 458 kB/s)
[linux-jdk10] [INFO] Downloading from central: https://repo.maven.apache.org/maven2/org/ow2/asm/asm-commons/5.0.3/asm-commons-5.0.3.pom
[linux-jdk10] [INFO] Downloaded from central: https://repo.maven.apache.org/maven2/org/ow2/asm/asm-commons/5.0.3/asm-commons-5.0.3.pom (2.1 kB at 150 kB/s)
[linux-jdk10] [INFO] Downloading from central: https://repo.maven.apache.org/maven2/org/ow2/asm/asm-tree/5.0.3/asm-tree-5.0.3.pom
[linux-jdk10] [INFO] Downloaded from central: https://repo.maven.apache.org/maven2/org/ow2/asm/asm-tree/5.0.3/asm-tree-5.0.3.pom (2.1 kB at 123 kB/s)
[linux-jdk10] [INFO] Downloading from central: https://repo.maven.apache.org/maven2/commons-lang/commons-lang/1.0/commons-lang-1.0.pom
[linux-jdk10] [INFO] Downloaded from central: https://repo.maven.apache.org/maven2/commons-lang/commons-lang/1.0/commons-lang-1.0.pom (2.5 kB at 223 kB/s)
[linux-jdk10] [INFO] Downloading from central: https://repo.maven.apache.org/maven2/de/tototec/de.tototec.cmdoption/0.2.0/de.tototec.cmdoption-0.2.0.pom
[linux-jdk10] [INFO] Downloaded from central: https://repo.maven.apache.org/maven2/de/tototec/de.tototec.cmdoption/0.2.0/de.tototec.cmdoption-0.2.0.pom (956 B at 80 kB/s)
[linux-jdk10] [INFO] Downloading from central: https://repo.maven.apache.org/maven2/org/semver/api/0.9.33/api-0.9.33.jar
[linux-jdk10] [INFO] Downloading from central: https://repo.maven.apache.org/maven2/com/google/code/findbugs/jsr305/2.0.0/jsr305-2.0.0.jar
[linux-jdk10] [INFO] Downloading from central: https://repo.maven.apache.org/maven2/org/ow2/asm/asm/5.0.3/asm-5.0.3.jar
[linux-jdk10] [INFO] Downloading from central: https://repo.maven.apache.org/maven2/org/ow2/asm/asm-commons/5.0.3/asm-commons-5.0.3.jar
[linux-jdk10] [INFO] Downloading from central: https://repo.maven.apache.org/maven2/org/ow2/asm/asm-tree/5.0.3/asm-tree-5.0.3.jar
[linux-jdk10] [INFO] Downloaded from central: https://repo.maven.apache.org/maven2/org/semver/api/0.9.33/api-0.9.33.jar (64 kB at 878 kB/s)
[linux-jdk10] [INFO] Downloading from central: https://repo.maven.apache.org/maven2/commons-lang/commons-lang/1.0/commons-lang-1.0.jar
[linux-jdk10] [INFO] Downloaded from central: https://repo.maven.apache.org/maven2/org/ow2/asm/asm-commons/5.0.3/asm-commons-5.0.3.jar (42 kB at 927 kB/s)
[linux-jdk10] [INFO] Downloading from central: https://repo.maven.apache.org/maven2/de/tototec/de.tototec.cmdoption/0.2.0/de.tototec.cmdoption-0.2.0.jar
[linux-jdk10] [INFO] Downloaded from central: https://repo.maven.apache.org/maven2/com/google/code/findbugs/jsr305/2.0.0/jsr305-2.0.0.jar (32 kB at 462 kB/s)
[linux-jdk10] [INFO] Downloaded from central: https://repo.maven.apache.org/maven2/org/ow2/asm/asm-tree/5.0.3/asm-tree-5.0.3.jar (29 kB at 631 kB/s)
[linux-jdk10] [INFO] Downloaded from central: https://repo.maven.apache.org/maven2/de/tototec/de.tototec.cmdoption/0.2.0/de.tototec.cmdoption-0.2.0.jar (42 kB at 1.2 MB/s)
[linux-jdk10] [INFO] Downloaded from central: https://repo.maven.apache.org/maven2/org/ow2/asm/asm/5.0.3/asm-5.0.3.jar (53 kB at 783 kB/s)
[linux-jdk10] [INFO] Downloaded from central: https://repo.maven.apache.org/maven2/commons-lang/commons-lang/1.0/commons-lang-1.0.jar (64 kB at 1.7 MB/s)
[linux-jdk10] [INFO] 
[linux-jdk10] [INFO] --- maven-clean-plugin:3.1.0:clean (default-clean) @ maven-release-semver-policy ---
[linux-jdk10] [INFO] 
[linux-jdk10] [INFO] --- maven-enforcer-plugin:1.4.1:enforce (enforce-maven-version) @ maven-release-semver-policy ---
[linux-jdk10] [INFO] 
[linux-jdk10] [INFO] --- maven-enforcer-plugin:1.4.1:enforce (enforce-bytecode-version) @ maven-release-semver-policy ---
[linux-jdk10] [INFO] 
[linux-jdk10] [INFO] --- maven-enforcer-plugin:1.4.1:enforce (ban-known-bad-maven-versions) @ maven-release-semver-policy ---
[linux-jdk10] [INFO] 
[linux-jdk10] [INFO] --- apache-rat-plugin:0.12:check (rat-check) @ maven-release-semver-policy ---
[linux-jdk10] [INFO] Enabled default license matchers.
[linux-jdk10] [INFO] Will parse SCM ignores for exclusions...
[linux-jdk10] [INFO] Finished adding exclusions from SCM ignore files.
[linux-jdk10] [INFO] 61 implicit excludes (use -debug for more details).
[linux-jdk10] [INFO] Exclude: .repository
[linux-jdk10] [INFO] Exclude: Jenkinsfile
[linux-jdk10] [INFO] Exclude: .repository/**
[linux-jdk10] [INFO] Exclude: .maven/spy.log
[linux-jdk10] [INFO] Exclude: dependency-reduced-pom.xml
[linux-jdk10] [INFO] Exclude: .java-version
[linux-jdk10] [INFO] 3 resources included (use -debug for more details)
[linux-jdk10] [INFO] Rat check: Summary over all files. Unapproved: 0, unknown: 0, generated: 0, approved: 3 licenses.
[linux-jdk10] [INFO] 
[linux-jdk10] [INFO] --- maven-remote-resources-plugin:1.5:process (process-resource-bundles) @ maven-release-semver-policy ---
[linux-jdk10] [INFO] 
[linux-jdk10] [INFO] --- maven-resources-plugin:3.1.0:resources (default-resources) @ maven-release-semver-policy ---
[linux-jdk10] [INFO] Using 'UTF-8' encoding to copy filtered resources.
[linux-jdk10] [INFO] skip non existing resourceDirectory /home/jenkins/jenkins-slave/workspace/maven-release_MRELEASE-1010-EJSYEVM3Q5HW74P3YIOC3F6GPYCS3YZJ4IRX7EIB245MHT4XH6FQ/m/maven-release-policies/maven-release-semver-policy/src/main/resources
[linux-jdk10] [INFO] Copying 3 resources
[linux-jdk10] [INFO] 
[linux-jdk10] [INFO] --- maven-compiler-plugin:3.7.0:compile (default-compile) @ maven-release-semver-policy ---
[linux-jdk10] [INFO] Changes detected - recompiling the module!
[linux-jdk10] [INFO] Compiling 1 source file to /home/jenkins/jenkins-slave/workspace/maven-release_MRELEASE-1010-EJSYEVM3Q5HW74P3YIOC3F6GPYCS3YZJ4IRX7EIB245MHT4XH6FQ/m/maven-release-policies/maven-release-semver-policy/target/classes
[linux-jdk10] [INFO] 
[linux-jdk10] [INFO] --- plexus-component-metadata:1.7.1:generate-metadata (process-classes) @ maven-release-semver-policy ---
[linux-jdk10] [INFO] Discovered 1 component descriptors(s)
[linux-jdk10] [INFO] 
[linux-jdk10] [INFO] --- maven-resources-plugin:3.1.0:testResources (default-testResources) @ maven-release-semver-policy ---
[linux-jdk10] [INFO] Using 'UTF-8' encoding to copy filtered resources.
[linux-jdk10] [INFO] skip non existing resourceDirectory /home/jenkins/jenkins-slave/workspace/maven-release_MRELEASE-1010-EJSYEVM3Q5HW74P3YIOC3F6GPYCS3YZJ4IRX7EIB245MHT4XH6FQ/m/maven-release-policies/maven-release-semver-policy/src/test/resources
[linux-jdk10] [INFO] Copying 3 resources
[linux-jdk10] [INFO] 
[linux-jdk10] [INFO] --- maven-compiler-plugin:3.7.0:testCompile (default-testCompile) @ maven-release-semver-policy ---
[linux-jdk10] [INFO] Changes detected - recompiling the module!
[linux-jdk10] [INFO] Compiling 1 source file to /home/jenkins/jenkins-slave/workspace/maven-release_MRELEASE-1010-EJSYEVM3Q5HW74P3YIOC3F6GPYCS3YZJ4IRX7EIB245MHT4XH6FQ/m/maven-release-policies/maven-release-semver-policy/target/test-classes
[linux-jdk10] [INFO] 
[linux-jdk10] [INFO] --- maven-surefire-plugin:2.22.0:test (default-test) @ maven-release-semver-policy ---
[linux-jdk10] [INFO] 
[linux-jdk10] [INFO] -------------------------------------------------------
[linux-jdk10] [INFO]  T E S T S
[linux-jdk10] [INFO] -------------------------------------------------------
[linux-jdk10] [INFO] Running org.apache.maven.shared.release.policy.semver.SemVerVersionPolicyTest
[linux-jdk10] [INFO] Tests run: 2, Failures: 0, Errors: 0, Skipped: 0, Time elapsed: 0.384 s - in org.apache.maven.shared.release.policy.semver.SemVerVersionPolicyTest
[linux-jdk10] [INFO] 
[linux-jdk10] [INFO] Results:
[linux-jdk10] [INFO] 
[linux-jdk10] [INFO] Tests run: 2, Failures: 0, Errors: 0, Skipped: 0
[linux-jdk10] [INFO] 
[linux-jdk10] [INFO] 
[linux-jdk10] [INFO] --- maven-jar-plugin:3.1.0:jar (default-jar) @ maven-release-semver-policy ---
[linux-jdk10] [INFO] Building jar: /home/jenkins/jenkins-slave/workspace/maven-release_MRELEASE-1010-EJSYEVM3Q5HW74P3YIOC3F6GPYCS3YZJ4IRX7EIB245MHT4XH6FQ/m/maven-release-policies/maven-release-semver-policy/target/maven-release-semver-policy-3.0.0-SNAPSHOT.jar
[linux-jdk10] [INFO] 
[linux-jdk10] [INFO] --- maven-site-plugin:3.7.1:attach-descriptor (attach-descriptor) @ maven-release-semver-policy ---
[linux-jdk10] [INFO] Skipping because packaging 'jar' is not pom.
[linux-jdk10] [INFO] 
[linux-jdk10] [INFO] --- maven-checkstyle-plugin:3.0.0:check (checkstyle-check) @ maven-release-semver-policy ---
[linux-jdk10] [INFO] ------------------------------------------------------------------------
[linux-jdk10] [INFO] Reactor Summary:
[linux-jdk10] [INFO] 
[linux-jdk10] [INFO] Maven Release ...................................... SUCCESS [ 17.755 s]
[linux-jdk10] [INFO] Maven Release APIs ................................. SUCCESS [  3.740 s]
[linux-jdk10] [INFO] Maven Release Manager .............................. SUCCESS [01:50 min]
[linux-jdk10] [INFO] Maven Release Plugin ............................... SUCCESS [05:03 min]
[linux-jdk10] [INFO] Maven Release Odd-Even Policy ...................... SUCCESS [  3.053 s]
[linux-jdk10] [INFO] Maven Release SemVer Policy ........................ SUCCESS [  4.264 s]
[linux-jdk10] [INFO] ------------------------------------------------------------------------
[linux-jdk10] [INFO] BUILD SUCCESS
[linux-jdk10] [INFO] ------------------------------------------------------------------------
[linux-jdk10] [INFO] Total time: 07:24 min
[linux-jdk10] [INFO] Finished at: 2018-08-08T18:26:28Z
[linux-jdk10] [INFO] Final Memory: 62M/296M
[linux-jdk10] [INFO] ------------------------------------------------------------------------
[linux-jdk10] [INFO] [jenkins-event-spy] Generated /home/jenkins/jenkins-slave/workspace/maven-release_MRELEASE-1010-EJSYEVM3Q5HW74P3YIOC3F6GPYCS3YZJ4IRX7EIB245MHT4XH6FQ@tmp/withMavene027965c/maven-spy-20180808-181903-51016855934172129849933.log
[Pipeline] [linux-jdk10] }
[Pipeline] [linux-jdk10] // dir
[Pipeline] [linux-jdk10] }
[linux-jdk10] [withMaven] invokerPublisher - Archive invoker results for Maven artifact MavenArtifact{org.apache.maven.plugins:maven-release-plugin::3.0.0-SNAPSHOT(version: 3.0.0-SNAPSHOT, snapshot:false) } generated by PluginInvocation{org.apache.maven.plugins:maven-invoker-plugin:3.1.0@run  integration-test-prepare}: m/maven-release-plugin/target/invoker-reports/*.xml
[linux-jdk10] performing MavenInvokerRecorder, reportsFilenamePattern:'**/m/maven-release-plugin/target/invoker-reports/BUILD*.xml', invokerBuildDir:'**/m/maven-release-plugin/target/it'
[linux-jdk10] Found reports:[/home/jenkins/jenkins-slave/workspace/maven-release_MRELEASE-1010-EJSYEVM3Q5HW74P3YIOC3F6GPYCS3YZJ4IRX7EIB245MHT4XH6FQ/m/maven-release-plugin/target/invoker-reports/BUILD-projects_update-versions_MRELEASE-555.xml, /home/jenkins/jenkins-slave/workspace/maven-release_MRELEASE-1010-EJSYEVM3Q5HW74P3YIOC3F6GPYCS3YZJ4IRX7EIB245MHT4XH6FQ/m/maven-release-plugin/target/invoker-reports/BUILD-projects_update-versions_MRELEASE-611.xml, /home/jenkins/jenkins-slave/workspace/maven-release_MRELEASE-1010-EJSYEVM3Q5HW74P3YIOC3F6GPYCS3YZJ4IRX7EIB245MHT4XH6FQ/m/maven-release-plugin/target/invoker-reports/BUILD-projects_update-versions_MRELEASE-783.xml, /home/jenkins/jenkins-slave/workspace/maven-release_MRELEASE-1010-EJSYEVM3Q5HW74P3YIOC3F6GPYCS3YZJ4IRX7EIB245MHT4XH6FQ/m/maven-release-plugin/target/invoker-reports/BUILD-projects_update-versions_MRELEASE-976.xml]
[linux-jdk10] Found logs:[/home/jenkins/jenkins-slave/workspace/maven-release_MRELEASE-1010-EJSYEVM3Q5HW74P3YIOC3F6GPYCS3YZJ4IRX7EIB245MHT4XH6FQ/m/maven-release-plugin/target/it/projects/update-versions/MRELEASE-555/build.log, /home/jenkins/jenkins-slave/workspace/maven-release_MRELEASE-1010-EJSYEVM3Q5HW74P3YIOC3F6GPYCS3YZJ4IRX7EIB245MHT4XH6FQ/m/maven-release-plugin/target/it/projects/update-versions/MRELEASE-611/build.log, /home/jenkins/jenkins-slave/workspace/maven-release_MRELEASE-1010-EJSYEVM3Q5HW74P3YIOC3F6GPYCS3YZJ4IRX7EIB245MHT4XH6FQ/m/maven-release-plugin/target/it/projects/update-versions/MRELEASE-783/build.log, /home/jenkins/jenkins-slave/workspace/maven-release_MRELEASE-1010-EJSYEVM3Q5HW74P3YIOC3F6GPYCS3YZJ4IRX7EIB245MHT4XH6FQ/m/maven-release-plugin/target/it/projects/update-versions/MRELEASE-976/build.log]
[linux-jdk10] Finished parsing Maven Invoker results (found 4)
[linux-jdk10] [withMaven] invokerPublisher - Archive invoker results for Maven artifact MavenArtifact{org.apache.maven.plugins:maven-release-plugin::3.0.0-SNAPSHOT(version: 3.0.0-SNAPSHOT, snapshot:false) } generated by PluginInvocation{org.apache.maven.plugins:maven-invoker-plugin:3.1.0@run  integration-test-prepare-with-pom}: m/maven-release-plugin/target/invoker-reports/*.xml
[linux-jdk10] performing MavenInvokerRecorder, reportsFilenamePattern:'**/m/maven-release-plugin/target/invoker-reports/BUILD*.xml', invokerBuildDir:'**/m/maven-release-plugin/target/it'
[linux-jdk10] Found reports:[/home/jenkins/jenkins-slave/workspace/maven-release_MRELEASE-1010-EJSYEVM3Q5HW74P3YIOC3F6GPYCS3YZJ4IRX7EIB245MHT4XH6FQ/m/maven-release-plugin/target/invoker-reports/BUILD-projects_update-versions_MRELEASE-555.xml, /home/jenkins/jenkins-slave/workspace/maven-release_MRELEASE-1010-EJSYEVM3Q5HW74P3YIOC3F6GPYCS3YZJ4IRX7EIB245MHT4XH6FQ/m/maven-release-plugin/target/invoker-reports/BUILD-projects_update-versions_MRELEASE-611.xml, /home/jenkins/jenkins-slave/workspace/maven-release_MRELEASE-1010-EJSYEVM3Q5HW74P3YIOC3F6GPYCS3YZJ4IRX7EIB245MHT4XH6FQ/m/maven-release-plugin/target/invoker-reports/BUILD-projects_update-versions_MRELEASE-783.xml, /home/jenkins/jenkins-slave/workspace/maven-release_MRELEASE-1010-EJSYEVM3Q5HW74P3YIOC3F6GPYCS3YZJ4IRX7EIB245MHT4XH6FQ/m/maven-release-plugin/target/invoker-reports/BUILD-projects_update-versions_MRELEASE-976.xml]
[linux-jdk10] Found logs:[/home/jenkins/jenkins-slave/workspace/maven-release_MRELEASE-1010-EJSYEVM3Q5HW74P3YIOC3F6GPYCS3YZJ4IRX7EIB245MHT4XH6FQ/m/maven-release-plugin/target/it/projects/update-versions/MRELEASE-555/build.log, /home/jenkins/jenkins-slave/workspace/maven-release_MRELEASE-1010-EJSYEVM3Q5HW74P3YIOC3F6GPYCS3YZJ4IRX7EIB245MHT4XH6FQ/m/maven-release-plugin/target/it/projects/update-versions/MRELEASE-611/build.log, /home/jenkins/jenkins-slave/workspace/maven-release_MRELEASE-1010-EJSYEVM3Q5HW74P3YIOC3F6GPYCS3YZJ4IRX7EIB245MHT4XH6FQ/m/maven-release-plugin/target/it/projects/update-versions/MRELEASE-783/build.log, /home/jenkins/jenkins-slave/workspace/maven-release_MRELEASE-1010-EJSYEVM3Q5HW74P3YIOC3F6GPYCS3YZJ4IRX7EIB245MHT4XH6FQ/m/maven-release-plugin/target/it/projects/update-versions/MRELEASE-976/build.log]
[linux-jdk10] Finished parsing Maven Invoker results (found 4)
[linux-jdk10] [withMaven] invokerPublisher - Archive invoker results for Maven artifact MavenArtifact{org.apache.maven.plugins:maven-release-plugin::3.0.0-SNAPSHOT(version: 3.0.0-SNAPSHOT, snapshot:false) } generated by PluginInvocation{org.apache.maven.plugins:maven-invoker-plugin:3.1.0@run  integration-test-branch}: m/maven-release-plugin/target/invoker-reports/*.xml
[linux-jdk10] performing MavenInvokerRecorder, reportsFilenamePattern:'**/m/maven-release-plugin/target/invoker-reports/BUILD*.xml', invokerBuildDir:'**/m/maven-release-plugin/target/it'
[linux-jdk10] Found reports:[/home/jenkins/jenkins-slave/workspace/maven-release_MRELEASE-1010-EJSYEVM3Q5HW74P3YIOC3F6GPYCS3YZJ4IRX7EIB245MHT4XH6FQ/m/maven-release-plugin/target/invoker-reports/BUILD-projects_update-versions_MRELEASE-555.xml, /home/jenkins/jenkins-slave/workspace/maven-release_MRELEASE-1010-EJSYEVM3Q5HW74P3YIOC3F6GPYCS3YZJ4IRX7EIB245MHT4XH6FQ/m/maven-release-plugin/target/invoker-reports/BUILD-projects_update-versions_MRELEASE-611.xml, /home/jenkins/jenkins-slave/workspace/maven-release_MRELEASE-1010-EJSYEVM3Q5HW74P3YIOC3F6GPYCS3YZJ4IRX7EIB245MHT4XH6FQ/m/maven-release-plugin/target/invoker-reports/BUILD-projects_update-versions_MRELEASE-783.xml, /home/jenkins/jenkins-slave/workspace/maven-release_MRELEASE-1010-EJSYEVM3Q5HW74P3YIOC3F6GPYCS3YZJ4IRX7EIB245MHT4XH6FQ/m/maven-release-plugin/target/invoker-reports/BUILD-projects_update-versions_MRELEASE-976.xml]
[linux-jdk10] Found logs:[/home/jenkins/jenkins-slave/workspace/maven-release_MRELEASE-1010-EJSYEVM3Q5HW74P3YIOC3F6GPYCS3YZJ4IRX7EIB245MHT4XH6FQ/m/maven-release-plugin/target/it/projects/update-versions/MRELEASE-555/build.log, /home/jenkins/jenkins-slave/workspace/maven-release_MRELEASE-1010-EJSYEVM3Q5HW74P3YIOC3F6GPYCS3YZJ4IRX7EIB245MHT4XH6FQ/m/maven-release-plugin/target/it/projects/update-versions/MRELEASE-611/build.log, /home/jenkins/jenkins-slave/workspace/maven-release_MRELEASE-1010-EJSYEVM3Q5HW74P3YIOC3F6GPYCS3YZJ4IRX7EIB245MHT4XH6FQ/m/maven-release-plugin/target/it/projects/update-versions/MRELEASE-783/build.log, /home/jenkins/jenkins-slave/workspace/maven-release_MRELEASE-1010-EJSYEVM3Q5HW74P3YIOC3F6GPYCS3YZJ4IRX7EIB245MHT4XH6FQ/m/maven-release-plugin/target/it/projects/update-versions/MRELEASE-976/build.log]
[linux-jdk10] Finished parsing Maven Invoker results (found 4)
[linux-jdk10] [withMaven] invokerPublisher - Archive invoker results for Maven artifact MavenArtifact{org.apache.maven.plugins:maven-release-plugin::3.0.0-SNAPSHOT(version: 3.0.0-SNAPSHOT, snapshot:false) } generated by PluginInvocation{org.apache.maven.plugins:maven-invoker-plugin:3.1.0@run  integration-test-perform}: m/maven-release-plugin/target/invoker-reports/*.xml
[linux-jdk10] performing MavenInvokerRecorder, reportsFilenamePattern:'**/m/maven-release-plugin/target/invoker-reports/BUILD*.xml', invokerBuildDir:'**/m/maven-release-plugin/target/it'
[linux-jdk10] Found reports:[/home/jenkins/jenkins-slave/workspace/maven-release_MRELEASE-1010-EJSYEVM3Q5HW74P3YIOC3F6GPYCS3YZJ4IRX7EIB245MHT4XH6FQ/m/maven-release-plugin/target/invoker-reports/BUILD-projects_update-versions_MRELEASE-555.xml, /home/jenkins/jenkins-slave/workspace/maven-release_MRELEASE-1010-EJSYEVM3Q5HW74P3YIOC3F6GPYCS3YZJ4IRX7EIB245MHT4XH6FQ/m/maven-release-plugin/target/invoker-reports/BUILD-projects_update-versions_MRELEASE-611.xml, /home/jenkins/jenkins-slave/workspace/maven-release_MRELEASE-1010-EJSYEVM3Q5HW74P3YIOC3F6GPYCS3YZJ4IRX7EIB245MHT4XH6FQ/m/maven-release-plugin/target/invoker-reports/BUILD-projects_update-versions_MRELEASE-783.xml, /home/jenkins/jenkins-slave/workspace/maven-release_MRELEASE-1010-EJSYEVM3Q5HW74P3YIOC3F6GPYCS3YZJ4IRX7EIB245MHT4XH6FQ/m/maven-release-plugin/target/invoker-reports/BUILD-projects_update-versions_MRELEASE-976.xml]
[linux-jdk10] Found logs:[/home/jenkins/jenkins-slave/workspace/maven-release_MRELEASE-1010-EJSYEVM3Q5HW74P3YIOC3F6GPYCS3YZJ4IRX7EIB245MHT4XH6FQ/m/maven-release-plugin/target/it/projects/update-versions/MRELEASE-555/build.log, /home/jenkins/jenkins-slave/workspace/maven-release_MRELEASE-1010-EJSYEVM3Q5HW74P3YIOC3F6GPYCS3YZJ4IRX7EIB245MHT4XH6FQ/m/maven-release-plugin/target/it/projects/update-versions/MRELEASE-611/build.log, /home/jenkins/jenkins-slave/workspace/maven-release_MRELEASE-1010-EJSYEVM3Q5HW74P3YIOC3F6GPYCS3YZJ4IRX7EIB245MHT4XH6FQ/m/maven-release-plugin/target/it/projects/update-versions/MRELEASE-783/build.log, /home/jenkins/jenkins-slave/workspace/maven-release_MRELEASE-1010-EJSYEVM3Q5HW74P3YIOC3F6GPYCS3YZJ4IRX7EIB245MHT4XH6FQ/m/maven-release-plugin/target/it/projects/update-versions/MRELEASE-976/build.log]
[linux-jdk10] Finished parsing Maven Invoker results (found 4)
[linux-jdk10] [withMaven] invokerPublisher - Archive invoker results for Maven artifact MavenArtifact{org.apache.maven.plugins:maven-release-plugin::3.0.0-SNAPSHOT(version: 3.0.0-SNAPSHOT, snapshot:false) } generated by PluginInvocation{org.apache.maven.plugins:maven-invoker-plugin:3.1.0@run  integration-test-update-versions}: m/maven-release-plugin/target/invoker-reports/*.xml
[linux-jdk10] performing MavenInvokerRecorder, reportsFilenamePattern:'**/m/maven-release-plugin/target/invoker-reports/BUILD*.xml', invokerBuildDir:'**/m/maven-release-plugin/target/it'
[linux-jdk10] Found reports:[/home/jenkins/jenkins-slave/workspace/maven-release_MRELEASE-1010-EJSYEVM3Q5HW74P3YIOC3F6GPYCS3YZJ4IRX7EIB245MHT4XH6FQ/m/maven-release-plugin/target/invoker-reports/BUILD-projects_update-versions_MRELEASE-555.xml, /home/jenkins/jenkins-slave/workspace/maven-release_MRELEASE-1010-EJSYEVM3Q5HW74P3YIOC3F6GPYCS3YZJ4IRX7EIB245MHT4XH6FQ/m/maven-release-plugin/target/invoker-reports/BUILD-projects_update-versions_MRELEASE-611.xml, /home/jenkins/jenkins-slave/workspace/maven-release_MRELEASE-1010-EJSYEVM3Q5HW74P3YIOC3F6GPYCS3YZJ4IRX7EIB245MHT4XH6FQ/m/maven-release-plugin/target/invoker-reports/BUILD-projects_update-versions_MRELEASE-783.xml, /home/jenkins/jenkins-slave/workspace/maven-release_MRELEASE-1010-EJSYEVM3Q5HW74P3YIOC3F6GPYCS3YZJ4IRX7EIB245MHT4XH6FQ/m/maven-release-plugin/target/invoker-reports/BUILD-projects_update-versions_MRELEASE-976.xml]
[linux-jdk10] Found logs:[/home/jenkins/jenkins-slave/workspace/maven-release_MRELEASE-1010-EJSYEVM3Q5HW74P3YIOC3F6GPYCS3YZJ4IRX7EIB245MHT4XH6FQ/m/maven-release-plugin/target/it/projects/update-versions/MRELEASE-555/build.log, /home/jenkins/jenkins-slave/workspace/maven-release_MRELEASE-1010-EJSYEVM3Q5HW74P3YIOC3F6GPYCS3YZJ4IRX7EIB245MHT4XH6FQ/m/maven-release-plugin/target/it/projects/update-versions/MRELEASE-611/build.log, /home/jenkins/jenkins-slave/workspace/maven-release_MRELEASE-1010-EJSYEVM3Q5HW74P3YIOC3F6GPYCS3YZJ4IRX7EIB245MHT4XH6FQ/m/maven-release-plugin/target/it/projects/update-versions/MRELEASE-783/build.log, /home/jenkins/jenkins-slave/workspace/maven-release_MRELEASE-1010-EJSYEVM3Q5HW74P3YIOC3F6GPYCS3YZJ4IRX7EIB245MHT4XH6FQ/m/maven-release-plugin/target/it/projects/update-versions/MRELEASE-976/build.log]
[linux-jdk10] Finished parsing Maven Invoker results (found 4)
[linux-jdk10] [withMaven] junitPublisher - Archive test results for Maven artifact org.apache.maven.release:maven-release-api:3.0.0-SNAPSHOT generated by maven-surefire-plugin:test (default-test): m/maven-release-api/target/surefire-reports/*.xml
[linux-jdk10] Recording test results
[linux-jdk10] None of the test reports contained any result
[linux-jdk10] [withMaven] junitPublisher - Archive test results for Maven artifact org.apache.maven.release:maven-release-manager:3.0.0-SNAPSHOT generated by maven-surefire-plugin:test (default-test): m/maven-release-manager/target/surefire-reports/*.xml
[linux-jdk10] Recording test results
[linux-jdk10] [withMaven] junitPublisher - Archive test results for Maven artifact org.apache.maven.plugins:maven-release-plugin:3.0.0-SNAPSHOT generated by maven-surefire-plugin:test (default-test): m/maven-release-plugin/target/surefire-reports/*.xml
[linux-jdk10] Recording test results
[linux-jdk10] [withMaven] junitPublisher - Archive test results for Maven artifact org.apache.maven.release:maven-release-oddeven-policy:3.0.0-SNAPSHOT generated by maven-surefire-plugin:test (default-test): m/maven-release-policies/maven-release-oddeven-policy/target/surefire-reports/*.xml
[linux-jdk10] Recording test results
[linux-jdk10] [withMaven] junitPublisher - Archive test results for Maven artifact org.apache.maven.release:maven-release-semver-policy:3.0.0-SNAPSHOT generated by maven-surefire-plugin:test (default-test): m/maven-release-policies/maven-release-semver-policy/target/surefire-reports/*.xml
[linux-jdk10] Recording test results
[linux-jdk10] [withMaven] junitPublisher - Archive test results for Maven artifact org.apache.maven.release:maven-release-manager:3.0.0-SNAPSHOT generated by maven-failsafe-plugin:integration-test (default): m/maven-release-manager/target/failsafe-reports/*.xml
[linux-jdk10] Recording test results
[Pipeline] [linux-jdk10] // withMaven
[Pipeline] [linux-jdk10] cleanWs
[linux-jdk10] [WS-CLEANUP] Deleting project workspace...[WS-CLEANUP] done
[Pipeline] [linux-jdk10] }
[Pipeline] [linux-jdk10] // stage
[Pipeline] [linux-jdk10] }
[Pipeline] [linux-jdk10] // node
[Pipeline] [linux-jdk10] }
[Pipeline] // parallel
[Pipeline] stage
[Pipeline] { (Notifications)
[Pipeline] echo
Build result: FAILURE
[Pipeline] jiraIssueSelector
[Pipeline] emailext

Build failed in Jenkins: Maven TLP » maven-release » MRELEASE-1010 #10

Posted by Apache Jenkins Server <je...@builds.apache.org>.
See https://builds.apache.org/job/maven-box/job/maven-release/job/MRELEASE-1010/10/

No changes.

All tests passed

Build log:
[...truncated 8.86 MB...]
[linux-jdk10] [WARNING] Ignoring that 4 builds failed.
[linux-jdk10] [INFO] 
[linux-jdk10] [INFO] --- maven-checkstyle-plugin:3.0.0:check (checkstyle-check) @ maven-release-plugin ---
[linux-jdk10] [INFO] 
[linux-jdk10] [INFO] -------< org.apache.maven.release:maven-release-oddeven-policy >--------
[linux-jdk10] [INFO] Building Maven Release Odd-Even Policy 3.0.0-SNAPSHOT              [5/6]
[linux-jdk10] [INFO] --------------------------------[ jar ]---------------------------------
[linux-jdk10] [INFO] 
[linux-jdk10] [INFO] --- maven-clean-plugin:3.1.0:clean (default-clean) @ maven-release-oddeven-policy ---
[linux-jdk10] [INFO] 
[linux-jdk10] [INFO] --- maven-enforcer-plugin:1.4.1:enforce (enforce-maven-version) @ maven-release-oddeven-policy ---
[linux-jdk10] [INFO] 
[linux-jdk10] [INFO] --- maven-enforcer-plugin:1.4.1:enforce (enforce-bytecode-version) @ maven-release-oddeven-policy ---
[linux-jdk10] [INFO] 
[linux-jdk10] [INFO] --- maven-enforcer-plugin:1.4.1:enforce (ban-known-bad-maven-versions) @ maven-release-oddeven-policy ---
[linux-jdk10] [INFO] 
[linux-jdk10] [INFO] --- apache-rat-plugin:0.12:check (rat-check) @ maven-release-oddeven-policy ---
[linux-jdk10] [INFO] Enabled default license matchers.
[linux-jdk10] [INFO] Will parse SCM ignores for exclusions...
[linux-jdk10] [INFO] Finished adding exclusions from SCM ignore files.
[linux-jdk10] [INFO] 61 implicit excludes (use -debug for more details).
[linux-jdk10] [INFO] Exclude: .repository
[linux-jdk10] [INFO] Exclude: Jenkinsfile
[linux-jdk10] [INFO] Exclude: .repository/**
[linux-jdk10] [INFO] Exclude: .maven/spy.log
[linux-jdk10] [INFO] Exclude: dependency-reduced-pom.xml
[linux-jdk10] [INFO] Exclude: .java-version
[linux-jdk10] [INFO] 4 resources included (use -debug for more details)
[linux-jdk10] [INFO] Rat check: Summary over all files. Unapproved: 0, unknown: 0, generated: 0, approved: 4 licenses.
[linux-jdk10] [INFO] 
[linux-jdk10] [INFO] --- maven-remote-resources-plugin:1.5:process (process-resource-bundles) @ maven-release-oddeven-policy ---
[linux-jdk10] [INFO] 
[linux-jdk10] [INFO] --- maven-resources-plugin:3.1.0:resources (default-resources) @ maven-release-oddeven-policy ---
[linux-jdk10] [INFO] Using 'UTF-8' encoding to copy filtered resources.
[linux-jdk10] [INFO] skip non existing resourceDirectory /home/jenkins/jenkins-slave/workspace/maven-release_MRELEASE-1010-EJSYEVM3Q5HW74P3YIOC3F6GPYCS3YZJ4IRX7EIB245MHT4XH6FQ@2/m/maven-release-policies/maven-release-oddeven-policy/src/main/resources
[linux-jdk10] [INFO] Copying 3 resources
[linux-jdk10] [INFO] 
[linux-jdk10] [INFO] --- maven-compiler-plugin:3.7.0:compile (default-compile) @ maven-release-oddeven-policy ---
[linux-jdk10] [INFO] Changes detected - recompiling the module!
[linux-jdk10] [INFO] Compiling 2 source files to /home/jenkins/jenkins-slave/workspace/maven-release_MRELEASE-1010-EJSYEVM3Q5HW74P3YIOC3F6GPYCS3YZJ4IRX7EIB245MHT4XH6FQ@2/m/maven-release-policies/maven-release-oddeven-policy/target/classes
[linux-jdk10] [INFO] 
[linux-jdk10] [INFO] --- plexus-component-metadata:1.7.1:generate-metadata (process-classes) @ maven-release-oddeven-policy ---
[linux-jdk10] [INFO] Discovered 1 component descriptors(s)
[linux-jdk10] [INFO] 
[linux-jdk10] [INFO] --- maven-resources-plugin:3.1.0:testResources (default-testResources) @ maven-release-oddeven-policy ---
[linux-jdk10] [INFO] Using 'UTF-8' encoding to copy filtered resources.
[linux-jdk10] [INFO] skip non existing resourceDirectory /home/jenkins/jenkins-slave/workspace/maven-release_MRELEASE-1010-EJSYEVM3Q5HW74P3YIOC3F6GPYCS3YZJ4IRX7EIB245MHT4XH6FQ@2/m/maven-release-policies/maven-release-oddeven-policy/src/test/resources
[linux-jdk10] [INFO] Copying 3 resources
[linux-jdk10] [INFO] 
[linux-jdk10] [INFO] --- maven-compiler-plugin:3.7.0:testCompile (default-testCompile) @ maven-release-oddeven-policy ---
[linux-jdk10] [INFO] Changes detected - recompiling the module!
[linux-jdk10] [INFO] Compiling 1 source file to /home/jenkins/jenkins-slave/workspace/maven-release_MRELEASE-1010-EJSYEVM3Q5HW74P3YIOC3F6GPYCS3YZJ4IRX7EIB245MHT4XH6FQ@2/m/maven-release-policies/maven-release-oddeven-policy/target/test-classes
[linux-jdk10] [INFO] 
[linux-jdk10] [INFO] --- maven-surefire-plugin:2.22.0:test (default-test) @ maven-release-oddeven-policy ---
[linux-jdk10] [INFO] 
[linux-jdk10] [INFO] -------------------------------------------------------
[linux-jdk10] [INFO]  T E S T S
[linux-jdk10] [INFO] -------------------------------------------------------
[linux-jdk10] [INFO] Running org.apache.maven.shared.release.policy.oddeven.OddEvenVersionPolicyTestCase
[linux-jdk10] [INFO] Tests run: 3, Failures: 0, Errors: 0, Skipped: 0, Time elapsed: 0.084 s - in org.apache.maven.shared.release.policy.oddeven.OddEvenVersionPolicyTestCase
[linux-jdk10] [INFO] 
[linux-jdk10] [INFO] Results:
[linux-jdk10] [INFO] 
[linux-jdk10] [INFO] Tests run: 3, Failures: 0, Errors: 0, Skipped: 0
[linux-jdk10] [INFO] 
[linux-jdk10] [INFO] 
[linux-jdk10] [INFO] --- maven-jar-plugin:3.1.0:jar (default-jar) @ maven-release-oddeven-policy ---
[linux-jdk10] [INFO] Building jar: /home/jenkins/jenkins-slave/workspace/maven-release_MRELEASE-1010-EJSYEVM3Q5HW74P3YIOC3F6GPYCS3YZJ4IRX7EIB245MHT4XH6FQ@2/m/maven-release-policies/maven-release-oddeven-policy/target/maven-release-oddeven-policy-3.0.0-SNAPSHOT.jar
[linux-jdk10] [INFO] 
[linux-jdk10] [INFO] --- maven-site-plugin:3.7.1:attach-descriptor (attach-descriptor) @ maven-release-oddeven-policy ---
[linux-jdk10] [INFO] Skipping because packaging 'jar' is not pom.
[linux-jdk10] [INFO] 
[linux-jdk10] [INFO] --- maven-checkstyle-plugin:3.0.0:check (checkstyle-check) @ maven-release-oddeven-policy ---
[linux-jdk10] [INFO] 
[linux-jdk10] [INFO] --------< org.apache.maven.release:maven-release-semver-policy >--------
[linux-jdk10] [INFO] Building Maven Release SemVer Policy 3.0.0-SNAPSHOT                [6/6]
[linux-jdk10] [INFO] --------------------------------[ jar ]---------------------------------
[linux-jdk10] [INFO] Downloading from central: https://repo.maven.apache.org/maven2/org/semver/api/0.9.33/api-0.9.33.pom
[linux-jdk10] [INFO] Downloaded from central: https://repo.maven.apache.org/maven2/org/semver/api/0.9.33/api-0.9.33.pom (2.8 kB at 189 kB/s)
[linux-jdk10] [INFO] Downloading from central: https://repo.maven.apache.org/maven2/org/semver/parent/0.9.33/parent-0.9.33.pom
[linux-jdk10] [INFO] Downloaded from central: https://repo.maven.apache.org/maven2/org/semver/parent/0.9.33/parent-0.9.33.pom (1.3 kB at 105 kB/s)
[linux-jdk10] [INFO] Downloading from central: https://repo.maven.apache.org/maven2/com/github/jeluard/oss-parent/9/oss-parent-9.pom
[linux-jdk10] [INFO] Downloaded from central: https://repo.maven.apache.org/maven2/com/github/jeluard/oss-parent/9/oss-parent-9.pom (12 kB at 1.0 MB/s)
[linux-jdk10] [INFO] Downloading from central: https://repo.maven.apache.org/maven2/com/google/code/findbugs/jsr305/2.0.0/jsr305-2.0.0.pom
[linux-jdk10] [INFO] Downloaded from central: https://repo.maven.apache.org/maven2/com/google/code/findbugs/jsr305/2.0.0/jsr305-2.0.0.pom (965 B at 88 kB/s)
[linux-jdk10] [INFO] Downloading from central: https://repo.maven.apache.org/maven2/org/ow2/asm/asm/5.0.3/asm-5.0.3.pom
[linux-jdk10] [INFO] Downloaded from central: https://repo.maven.apache.org/maven2/org/ow2/asm/asm/5.0.3/asm-5.0.3.pom (1.9 kB at 176 kB/s)
[linux-jdk10] [INFO] Downloading from central: https://repo.maven.apache.org/maven2/org/ow2/asm/asm-parent/5.0.3/asm-parent-5.0.3.pom
[linux-jdk10] [INFO] Downloaded from central: https://repo.maven.apache.org/maven2/org/ow2/asm/asm-parent/5.0.3/asm-parent-5.0.3.pom (5.5 kB at 500 kB/s)
[linux-jdk10] [INFO] Downloading from central: https://repo.maven.apache.org/maven2/org/ow2/asm/asm-commons/5.0.3/asm-commons-5.0.3.pom
[linux-jdk10] [INFO] Downloaded from central: https://repo.maven.apache.org/maven2/org/ow2/asm/asm-commons/5.0.3/asm-commons-5.0.3.pom (2.1 kB at 150 kB/s)
[linux-jdk10] [INFO] Downloading from central: https://repo.maven.apache.org/maven2/org/ow2/asm/asm-tree/5.0.3/asm-tree-5.0.3.pom
[linux-jdk10] [INFO] Downloaded from central: https://repo.maven.apache.org/maven2/org/ow2/asm/asm-tree/5.0.3/asm-tree-5.0.3.pom (2.1 kB at 174 kB/s)
[linux-jdk10] [INFO] Downloading from central: https://repo.maven.apache.org/maven2/commons-lang/commons-lang/1.0/commons-lang-1.0.pom
[linux-jdk10] [INFO] Downloaded from central: https://repo.maven.apache.org/maven2/commons-lang/commons-lang/1.0/commons-lang-1.0.pom (2.5 kB at 205 kB/s)
[linux-jdk10] [INFO] Downloading from central: https://repo.maven.apache.org/maven2/de/tototec/de.tototec.cmdoption/0.2.0/de.tototec.cmdoption-0.2.0.pom
[linux-jdk10] [INFO] Downloaded from central: https://repo.maven.apache.org/maven2/de/tototec/de.tototec.cmdoption/0.2.0/de.tototec.cmdoption-0.2.0.pom (956 B at 2.8 kB/s)
[linux-jdk10] [INFO] Downloading from central: https://repo.maven.apache.org/maven2/org/semver/api/0.9.33/api-0.9.33.jar
[linux-jdk10] [INFO] Downloading from central: https://repo.maven.apache.org/maven2/com/google/code/findbugs/jsr305/2.0.0/jsr305-2.0.0.jar
[linux-jdk10] [INFO] Downloading from central: https://repo.maven.apache.org/maven2/org/ow2/asm/asm-tree/5.0.3/asm-tree-5.0.3.jar
[linux-jdk10] [INFO] Downloading from central: https://repo.maven.apache.org/maven2/org/ow2/asm/asm-commons/5.0.3/asm-commons-5.0.3.jar
[linux-jdk10] [INFO] Downloading from central: https://repo.maven.apache.org/maven2/org/ow2/asm/asm/5.0.3/asm-5.0.3.jar
[linux-jdk10] [INFO] Downloaded from central: https://repo.maven.apache.org/maven2/org/semver/api/0.9.33/api-0.9.33.jar (64 kB at 4.3 MB/s)
[linux-jdk10] [INFO] Downloading from central: https://repo.maven.apache.org/maven2/commons-lang/commons-lang/1.0/commons-lang-1.0.jar
[linux-jdk10] [INFO] Downloaded from central: https://repo.maven.apache.org/maven2/org/ow2/asm/asm-tree/5.0.3/asm-tree-5.0.3.jar (29 kB at 2.1 MB/s)
[linux-jdk10] [INFO] Downloading from central: https://repo.maven.apache.org/maven2/de/tototec/de.tototec.cmdoption/0.2.0/de.tototec.cmdoption-0.2.0.jar
[linux-jdk10] [INFO] Downloaded from central: https://repo.maven.apache.org/maven2/org/ow2/asm/asm-commons/5.0.3/asm-commons-5.0.3.jar (42 kB at 3.0 MB/s)
[linux-jdk10] [INFO] Downloaded from central: https://repo.maven.apache.org/maven2/com/google/code/findbugs/jsr305/2.0.0/jsr305-2.0.0.jar (32 kB at 2.0 MB/s)
[linux-jdk10] [INFO] Downloaded from central: https://repo.maven.apache.org/maven2/org/ow2/asm/asm/5.0.3/asm-5.0.3.jar (53 kB at 3.5 MB/s)
[linux-jdk10] [INFO] Downloaded from central: https://repo.maven.apache.org/maven2/commons-lang/commons-lang/1.0/commons-lang-1.0.jar (64 kB at 2.3 MB/s)
[linux-jdk10] [INFO] Downloaded from central: https://repo.maven.apache.org/maven2/de/tototec/de.tototec.cmdoption/0.2.0/de.tototec.cmdoption-0.2.0.jar (42 kB at 1.5 MB/s)
[linux-jdk10] [INFO] 
[linux-jdk10] [INFO] --- maven-clean-plugin:3.1.0:clean (default-clean) @ maven-release-semver-policy ---
[linux-jdk10] [INFO] 
[linux-jdk10] [INFO] --- maven-enforcer-plugin:1.4.1:enforce (enforce-maven-version) @ maven-release-semver-policy ---
[linux-jdk10] [INFO] 
[linux-jdk10] [INFO] --- maven-enforcer-plugin:1.4.1:enforce (enforce-bytecode-version) @ maven-release-semver-policy ---
[linux-jdk10] [INFO] 
[linux-jdk10] [INFO] --- maven-enforcer-plugin:1.4.1:enforce (ban-known-bad-maven-versions) @ maven-release-semver-policy ---
[linux-jdk10] [INFO] 
[linux-jdk10] [INFO] --- apache-rat-plugin:0.12:check (rat-check) @ maven-release-semver-policy ---
[linux-jdk10] [INFO] Enabled default license matchers.
[linux-jdk10] [INFO] Will parse SCM ignores for exclusions...
[linux-jdk10] [INFO] Finished adding exclusions from SCM ignore files.
[linux-jdk10] [INFO] 61 implicit excludes (use -debug for more details).
[linux-jdk10] [INFO] Exclude: .repository
[linux-jdk10] [INFO] Exclude: Jenkinsfile
[linux-jdk10] [INFO] Exclude: .repository/**
[linux-jdk10] [INFO] Exclude: .maven/spy.log
[linux-jdk10] [INFO] Exclude: dependency-reduced-pom.xml
[linux-jdk10] [INFO] Exclude: .java-version
[linux-jdk10] [INFO] 3 resources included (use -debug for more details)
[linux-jdk10] [INFO] Rat check: Summary over all files. Unapproved: 0, unknown: 0, generated: 0, approved: 3 licenses.
[linux-jdk10] [INFO] 
[linux-jdk10] [INFO] --- maven-remote-resources-plugin:1.5:process (process-resource-bundles) @ maven-release-semver-policy ---
[linux-jdk10] [INFO] 
[linux-jdk10] [INFO] --- maven-resources-plugin:3.1.0:resources (default-resources) @ maven-release-semver-policy ---
[linux-jdk10] [INFO] Using 'UTF-8' encoding to copy filtered resources.
[linux-jdk10] [INFO] skip non existing resourceDirectory /home/jenkins/jenkins-slave/workspace/maven-release_MRELEASE-1010-EJSYEVM3Q5HW74P3YIOC3F6GPYCS3YZJ4IRX7EIB245MHT4XH6FQ@2/m/maven-release-policies/maven-release-semver-policy/src/main/resources
[linux-jdk10] [INFO] Copying 3 resources
[linux-jdk10] [INFO] 
[linux-jdk10] [INFO] --- maven-compiler-plugin:3.7.0:compile (default-compile) @ maven-release-semver-policy ---
[linux-jdk10] [INFO] Changes detected - recompiling the module!
[linux-jdk10] [INFO] Compiling 1 source file to /home/jenkins/jenkins-slave/workspace/maven-release_MRELEASE-1010-EJSYEVM3Q5HW74P3YIOC3F6GPYCS3YZJ4IRX7EIB245MHT4XH6FQ@2/m/maven-release-policies/maven-release-semver-policy/target/classes
[linux-jdk10] [INFO] 
[linux-jdk10] [INFO] --- plexus-component-metadata:1.7.1:generate-metadata (process-classes) @ maven-release-semver-policy ---
[linux-jdk10] [INFO] Discovered 1 component descriptors(s)
[linux-jdk10] [INFO] 
[linux-jdk10] [INFO] --- maven-resources-plugin:3.1.0:testResources (default-testResources) @ maven-release-semver-policy ---
[linux-jdk10] [INFO] Using 'UTF-8' encoding to copy filtered resources.
[linux-jdk10] [INFO] skip non existing resourceDirectory /home/jenkins/jenkins-slave/workspace/maven-release_MRELEASE-1010-EJSYEVM3Q5HW74P3YIOC3F6GPYCS3YZJ4IRX7EIB245MHT4XH6FQ@2/m/maven-release-policies/maven-release-semver-policy/src/test/resources
[linux-jdk10] [INFO] Copying 3 resources
[linux-jdk10] [INFO] 
[linux-jdk10] [INFO] --- maven-compiler-plugin:3.7.0:testCompile (default-testCompile) @ maven-release-semver-policy ---
[linux-jdk10] [INFO] Changes detected - recompiling the module!
[linux-jdk10] [INFO] Compiling 1 source file to /home/jenkins/jenkins-slave/workspace/maven-release_MRELEASE-1010-EJSYEVM3Q5HW74P3YIOC3F6GPYCS3YZJ4IRX7EIB245MHT4XH6FQ@2/m/maven-release-policies/maven-release-semver-policy/target/test-classes
[linux-jdk10] [INFO] 
[linux-jdk10] [INFO] --- maven-surefire-plugin:2.22.0:test (default-test) @ maven-release-semver-policy ---
[linux-jdk10] [INFO] 
[linux-jdk10] [INFO] -------------------------------------------------------
[linux-jdk10] [INFO]  T E S T S
[linux-jdk10] [INFO] -------------------------------------------------------
[linux-jdk10] [INFO] Running org.apache.maven.shared.release.policy.semver.SemVerVersionPolicyTest
[linux-jdk10] [INFO] Tests run: 2, Failures: 0, Errors: 0, Skipped: 0, Time elapsed: 0.079 s - in org.apache.maven.shared.release.policy.semver.SemVerVersionPolicyTest
[linux-jdk10] [INFO] 
[linux-jdk10] [INFO] Results:
[linux-jdk10] [INFO] 
[linux-jdk10] [INFO] Tests run: 2, Failures: 0, Errors: 0, Skipped: 0
[linux-jdk10] [INFO] 
[linux-jdk10] [INFO] 
[linux-jdk10] [INFO] --- maven-jar-plugin:3.1.0:jar (default-jar) @ maven-release-semver-policy ---
[linux-jdk10] [INFO] Building jar: /home/jenkins/jenkins-slave/workspace/maven-release_MRELEASE-1010-EJSYEVM3Q5HW74P3YIOC3F6GPYCS3YZJ4IRX7EIB245MHT4XH6FQ@2/m/maven-release-policies/maven-release-semver-policy/target/maven-release-semver-policy-3.0.0-SNAPSHOT.jar
[linux-jdk10] [INFO] 
[linux-jdk10] [INFO] --- maven-site-plugin:3.7.1:attach-descriptor (attach-descriptor) @ maven-release-semver-policy ---
[linux-jdk10] [INFO] Skipping because packaging 'jar' is not pom.
[linux-jdk10] [INFO] 
[linux-jdk10] [INFO] --- maven-checkstyle-plugin:3.0.0:check (checkstyle-check) @ maven-release-semver-policy ---
[linux-jdk10] [INFO] ------------------------------------------------------------------------
[linux-jdk10] [INFO] Reactor Summary:
[linux-jdk10] [INFO] 
[linux-jdk10] [INFO] Maven Release 3.0.0-SNAPSHOT ....................... SUCCESS [ 16.265 s]
[linux-jdk10] [INFO] Maven Release APIs ................................. SUCCESS [  5.620 s]
[linux-jdk10] [INFO] Maven Release Manager .............................. SUCCESS [01:45 min]
[linux-jdk10] [INFO] Maven Release Plugin ............................... SUCCESS [02:42 min]
[linux-jdk10] [INFO] Maven Release Odd-Even Policy ...................... SUCCESS [  1.466 s]
[linux-jdk10] [INFO] Maven Release SemVer Policy 3.0.0-SNAPSHOT ......... SUCCESS [  2.117 s]
[linux-jdk10] [INFO] ------------------------------------------------------------------------
[linux-jdk10] [INFO] BUILD SUCCESS
[linux-jdk10] [INFO] ------------------------------------------------------------------------
[linux-jdk10] [INFO] Total time: 04:56 min
[linux-jdk10] [INFO] Finished at: 2018-08-20T18:31:41Z
[linux-jdk10] [INFO] ------------------------------------------------------------------------
[linux-jdk10] [INFO] [jenkins-event-spy] Generated /home/jenkins/jenkins-slave/workspace/maven-release_MRELEASE-1010-EJSYEVM3Q5HW74P3YIOC3F6GPYCS3YZJ4IRX7EIB245MHT4XH6FQ@2@tmp/withMaven17b24eaf/maven-spy-20180820-182645-41617697747978116606627.log
[Pipeline] [linux-jdk10] }
[Pipeline] [linux-jdk10] // dir
[Pipeline] [linux-jdk10] }
[linux-jdk10] [withMaven] invokerPublisher - Archive invoker results for Maven artifact MavenArtifact{org.apache.maven.plugins:maven-release-plugin::3.0.0-SNAPSHOT(version: 3.0.0-SNAPSHOT, snapshot:false) } generated by PluginInvocation{org.apache.maven.plugins:maven-invoker-plugin:3.1.0@run  integration-test-prepare}: m/maven-release-plugin/target/invoker-reports/*.xml
[linux-jdk10] performing MavenInvokerRecorder, reportsFilenamePattern:'**/m/maven-release-plugin/target/invoker-reports/BUILD*.xml', invokerBuildDir:'**/m/maven-release-plugin/target/it'
[linux-jdk10] Found reports:[/home/jenkins/jenkins-slave/workspace/maven-release_MRELEASE-1010-EJSYEVM3Q5HW74P3YIOC3F6GPYCS3YZJ4IRX7EIB245MHT4XH6FQ@2/m/maven-release-plugin/target/invoker-reports/BUILD-projects_update-versions_MRELEASE-555.xml, /home/jenkins/jenkins-slave/workspace/maven-release_MRELEASE-1010-EJSYEVM3Q5HW74P3YIOC3F6GPYCS3YZJ4IRX7EIB245MHT4XH6FQ@2/m/maven-release-plugin/target/invoker-reports/BUILD-projects_update-versions_MRELEASE-611.xml, /home/jenkins/jenkins-slave/workspace/maven-release_MRELEASE-1010-EJSYEVM3Q5HW74P3YIOC3F6GPYCS3YZJ4IRX7EIB245MHT4XH6FQ@2/m/maven-release-plugin/target/invoker-reports/BUILD-projects_update-versions_MRELEASE-783.xml, /home/jenkins/jenkins-slave/workspace/maven-release_MRELEASE-1010-EJSYEVM3Q5HW74P3YIOC3F6GPYCS3YZJ4IRX7EIB245MHT4XH6FQ@2/m/maven-release-plugin/target/invoker-reports/BUILD-projects_update-versions_MRELEASE-976.xml]
[linux-jdk10] Found logs:[/home/jenkins/jenkins-slave/workspace/maven-release_MRELEASE-1010-EJSYEVM3Q5HW74P3YIOC3F6GPYCS3YZJ4IRX7EIB245MHT4XH6FQ@2/m/maven-release-plugin/target/it/projects/update-versions/MRELEASE-555/build.log, /home/jenkins/jenkins-slave/workspace/maven-release_MRELEASE-1010-EJSYEVM3Q5HW74P3YIOC3F6GPYCS3YZJ4IRX7EIB245MHT4XH6FQ@2/m/maven-release-plugin/target/it/projects/update-versions/MRELEASE-611/build.log, /home/jenkins/jenkins-slave/workspace/maven-release_MRELEASE-1010-EJSYEVM3Q5HW74P3YIOC3F6GPYCS3YZJ4IRX7EIB245MHT4XH6FQ@2/m/maven-release-plugin/target/it/projects/update-versions/MRELEASE-783/build.log, /home/jenkins/jenkins-slave/workspace/maven-release_MRELEASE-1010-EJSYEVM3Q5HW74P3YIOC3F6GPYCS3YZJ4IRX7EIB245MHT4XH6FQ@2/m/maven-release-plugin/target/it/projects/update-versions/MRELEASE-976/build.log]
[linux-jdk10] Finished parsing Maven Invoker results (found 4)
[linux-jdk10] [withMaven] invokerPublisher - Archive invoker results for Maven artifact MavenArtifact{org.apache.maven.plugins:maven-release-plugin::3.0.0-SNAPSHOT(version: 3.0.0-SNAPSHOT, snapshot:false) } generated by PluginInvocation{org.apache.maven.plugins:maven-invoker-plugin:3.1.0@run  integration-test-prepare-with-pom}: m/maven-release-plugin/target/invoker-reports/*.xml
[linux-jdk10] performing MavenInvokerRecorder, reportsFilenamePattern:'**/m/maven-release-plugin/target/invoker-reports/BUILD*.xml', invokerBuildDir:'**/m/maven-release-plugin/target/it'
[linux-jdk10] Found reports:[/home/jenkins/jenkins-slave/workspace/maven-release_MRELEASE-1010-EJSYEVM3Q5HW74P3YIOC3F6GPYCS3YZJ4IRX7EIB245MHT4XH6FQ@2/m/maven-release-plugin/target/invoker-reports/BUILD-projects_update-versions_MRELEASE-555.xml, /home/jenkins/jenkins-slave/workspace/maven-release_MRELEASE-1010-EJSYEVM3Q5HW74P3YIOC3F6GPYCS3YZJ4IRX7EIB245MHT4XH6FQ@2/m/maven-release-plugin/target/invoker-reports/BUILD-projects_update-versions_MRELEASE-611.xml, /home/jenkins/jenkins-slave/workspace/maven-release_MRELEASE-1010-EJSYEVM3Q5HW74P3YIOC3F6GPYCS3YZJ4IRX7EIB245MHT4XH6FQ@2/m/maven-release-plugin/target/invoker-reports/BUILD-projects_update-versions_MRELEASE-783.xml, /home/jenkins/jenkins-slave/workspace/maven-release_MRELEASE-1010-EJSYEVM3Q5HW74P3YIOC3F6GPYCS3YZJ4IRX7EIB245MHT4XH6FQ@2/m/maven-release-plugin/target/invoker-reports/BUILD-projects_update-versions_MRELEASE-976.xml]
[linux-jdk10] Found logs:[/home/jenkins/jenkins-slave/workspace/maven-release_MRELEASE-1010-EJSYEVM3Q5HW74P3YIOC3F6GPYCS3YZJ4IRX7EIB245MHT4XH6FQ@2/m/maven-release-plugin/target/it/projects/update-versions/MRELEASE-555/build.log, /home/jenkins/jenkins-slave/workspace/maven-release_MRELEASE-1010-EJSYEVM3Q5HW74P3YIOC3F6GPYCS3YZJ4IRX7EIB245MHT4XH6FQ@2/m/maven-release-plugin/target/it/projects/update-versions/MRELEASE-611/build.log, /home/jenkins/jenkins-slave/workspace/maven-release_MRELEASE-1010-EJSYEVM3Q5HW74P3YIOC3F6GPYCS3YZJ4IRX7EIB245MHT4XH6FQ@2/m/maven-release-plugin/target/it/projects/update-versions/MRELEASE-783/build.log, /home/jenkins/jenkins-slave/workspace/maven-release_MRELEASE-1010-EJSYEVM3Q5HW74P3YIOC3F6GPYCS3YZJ4IRX7EIB245MHT4XH6FQ@2/m/maven-release-plugin/target/it/projects/update-versions/MRELEASE-976/build.log]
[linux-jdk10] Finished parsing Maven Invoker results (found 4)
[linux-jdk10] [withMaven] invokerPublisher - Archive invoker results for Maven artifact MavenArtifact{org.apache.maven.plugins:maven-release-plugin::3.0.0-SNAPSHOT(version: 3.0.0-SNAPSHOT, snapshot:false) } generated by PluginInvocation{org.apache.maven.plugins:maven-invoker-plugin:3.1.0@run  integration-test-branch}: m/maven-release-plugin/target/invoker-reports/*.xml
[linux-jdk10] performing MavenInvokerRecorder, reportsFilenamePattern:'**/m/maven-release-plugin/target/invoker-reports/BUILD*.xml', invokerBuildDir:'**/m/maven-release-plugin/target/it'
[linux-jdk10] Found reports:[/home/jenkins/jenkins-slave/workspace/maven-release_MRELEASE-1010-EJSYEVM3Q5HW74P3YIOC3F6GPYCS3YZJ4IRX7EIB245MHT4XH6FQ@2/m/maven-release-plugin/target/invoker-reports/BUILD-projects_update-versions_MRELEASE-555.xml, /home/jenkins/jenkins-slave/workspace/maven-release_MRELEASE-1010-EJSYEVM3Q5HW74P3YIOC3F6GPYCS3YZJ4IRX7EIB245MHT4XH6FQ@2/m/maven-release-plugin/target/invoker-reports/BUILD-projects_update-versions_MRELEASE-611.xml, /home/jenkins/jenkins-slave/workspace/maven-release_MRELEASE-1010-EJSYEVM3Q5HW74P3YIOC3F6GPYCS3YZJ4IRX7EIB245MHT4XH6FQ@2/m/maven-release-plugin/target/invoker-reports/BUILD-projects_update-versions_MRELEASE-783.xml, /home/jenkins/jenkins-slave/workspace/maven-release_MRELEASE-1010-EJSYEVM3Q5HW74P3YIOC3F6GPYCS3YZJ4IRX7EIB245MHT4XH6FQ@2/m/maven-release-plugin/target/invoker-reports/BUILD-projects_update-versions_MRELEASE-976.xml]
[linux-jdk10] Found logs:[/home/jenkins/jenkins-slave/workspace/maven-release_MRELEASE-1010-EJSYEVM3Q5HW74P3YIOC3F6GPYCS3YZJ4IRX7EIB245MHT4XH6FQ@2/m/maven-release-plugin/target/it/projects/update-versions/MRELEASE-555/build.log, /home/jenkins/jenkins-slave/workspace/maven-release_MRELEASE-1010-EJSYEVM3Q5HW74P3YIOC3F6GPYCS3YZJ4IRX7EIB245MHT4XH6FQ@2/m/maven-release-plugin/target/it/projects/update-versions/MRELEASE-611/build.log, /home/jenkins/jenkins-slave/workspace/maven-release_MRELEASE-1010-EJSYEVM3Q5HW74P3YIOC3F6GPYCS3YZJ4IRX7EIB245MHT4XH6FQ@2/m/maven-release-plugin/target/it/projects/update-versions/MRELEASE-783/build.log, /home/jenkins/jenkins-slave/workspace/maven-release_MRELEASE-1010-EJSYEVM3Q5HW74P3YIOC3F6GPYCS3YZJ4IRX7EIB245MHT4XH6FQ@2/m/maven-release-plugin/target/it/projects/update-versions/MRELEASE-976/build.log]
[linux-jdk10] Finished parsing Maven Invoker results (found 4)
[linux-jdk10] [withMaven] invokerPublisher - Archive invoker results for Maven artifact MavenArtifact{org.apache.maven.plugins:maven-release-plugin::3.0.0-SNAPSHOT(version: 3.0.0-SNAPSHOT, snapshot:false) } generated by PluginInvocation{org.apache.maven.plugins:maven-invoker-plugin:3.1.0@run  integration-test-perform}: m/maven-release-plugin/target/invoker-reports/*.xml
[linux-jdk10] performing MavenInvokerRecorder, reportsFilenamePattern:'**/m/maven-release-plugin/target/invoker-reports/BUILD*.xml', invokerBuildDir:'**/m/maven-release-plugin/target/it'
[linux-jdk10] Found reports:[/home/jenkins/jenkins-slave/workspace/maven-release_MRELEASE-1010-EJSYEVM3Q5HW74P3YIOC3F6GPYCS3YZJ4IRX7EIB245MHT4XH6FQ@2/m/maven-release-plugin/target/invoker-reports/BUILD-projects_update-versions_MRELEASE-555.xml, /home/jenkins/jenkins-slave/workspace/maven-release_MRELEASE-1010-EJSYEVM3Q5HW74P3YIOC3F6GPYCS3YZJ4IRX7EIB245MHT4XH6FQ@2/m/maven-release-plugin/target/invoker-reports/BUILD-projects_update-versions_MRELEASE-611.xml, /home/jenkins/jenkins-slave/workspace/maven-release_MRELEASE-1010-EJSYEVM3Q5HW74P3YIOC3F6GPYCS3YZJ4IRX7EIB245MHT4XH6FQ@2/m/maven-release-plugin/target/invoker-reports/BUILD-projects_update-versions_MRELEASE-783.xml, /home/jenkins/jenkins-slave/workspace/maven-release_MRELEASE-1010-EJSYEVM3Q5HW74P3YIOC3F6GPYCS3YZJ4IRX7EIB245MHT4XH6FQ@2/m/maven-release-plugin/target/invoker-reports/BUILD-projects_update-versions_MRELEASE-976.xml]
[linux-jdk10] Found logs:[/home/jenkins/jenkins-slave/workspace/maven-release_MRELEASE-1010-EJSYEVM3Q5HW74P3YIOC3F6GPYCS3YZJ4IRX7EIB245MHT4XH6FQ@2/m/maven-release-plugin/target/it/projects/update-versions/MRELEASE-555/build.log, /home/jenkins/jenkins-slave/workspace/maven-release_MRELEASE-1010-EJSYEVM3Q5HW74P3YIOC3F6GPYCS3YZJ4IRX7EIB245MHT4XH6FQ@2/m/maven-release-plugin/target/it/projects/update-versions/MRELEASE-611/build.log, /home/jenkins/jenkins-slave/workspace/maven-release_MRELEASE-1010-EJSYEVM3Q5HW74P3YIOC3F6GPYCS3YZJ4IRX7EIB245MHT4XH6FQ@2/m/maven-release-plugin/target/it/projects/update-versions/MRELEASE-783/build.log, /home/jenkins/jenkins-slave/workspace/maven-release_MRELEASE-1010-EJSYEVM3Q5HW74P3YIOC3F6GPYCS3YZJ4IRX7EIB245MHT4XH6FQ@2/m/maven-release-plugin/target/it/projects/update-versions/MRELEASE-976/build.log]
[linux-jdk10] Finished parsing Maven Invoker results (found 4)
[linux-jdk10] [withMaven] invokerPublisher - Archive invoker results for Maven artifact MavenArtifact{org.apache.maven.plugins:maven-release-plugin::3.0.0-SNAPSHOT(version: 3.0.0-SNAPSHOT, snapshot:false) } generated by PluginInvocation{org.apache.maven.plugins:maven-invoker-plugin:3.1.0@run  integration-test-update-versions}: m/maven-release-plugin/target/invoker-reports/*.xml
[linux-jdk10] performing MavenInvokerRecorder, reportsFilenamePattern:'**/m/maven-release-plugin/target/invoker-reports/BUILD*.xml', invokerBuildDir:'**/m/maven-release-plugin/target/it'
[linux-jdk10] Found reports:[/home/jenkins/jenkins-slave/workspace/maven-release_MRELEASE-1010-EJSYEVM3Q5HW74P3YIOC3F6GPYCS3YZJ4IRX7EIB245MHT4XH6FQ@2/m/maven-release-plugin/target/invoker-reports/BUILD-projects_update-versions_MRELEASE-555.xml, /home/jenkins/jenkins-slave/workspace/maven-release_MRELEASE-1010-EJSYEVM3Q5HW74P3YIOC3F6GPYCS3YZJ4IRX7EIB245MHT4XH6FQ@2/m/maven-release-plugin/target/invoker-reports/BUILD-projects_update-versions_MRELEASE-611.xml, /home/jenkins/jenkins-slave/workspace/maven-release_MRELEASE-1010-EJSYEVM3Q5HW74P3YIOC3F6GPYCS3YZJ4IRX7EIB245MHT4XH6FQ@2/m/maven-release-plugin/target/invoker-reports/BUILD-projects_update-versions_MRELEASE-783.xml, /home/jenkins/jenkins-slave/workspace/maven-release_MRELEASE-1010-EJSYEVM3Q5HW74P3YIOC3F6GPYCS3YZJ4IRX7EIB245MHT4XH6FQ@2/m/maven-release-plugin/target/invoker-reports/BUILD-projects_update-versions_MRELEASE-976.xml]
[linux-jdk10] Found logs:[/home/jenkins/jenkins-slave/workspace/maven-release_MRELEASE-1010-EJSYEVM3Q5HW74P3YIOC3F6GPYCS3YZJ4IRX7EIB245MHT4XH6FQ@2/m/maven-release-plugin/target/it/projects/update-versions/MRELEASE-555/build.log, /home/jenkins/jenkins-slave/workspace/maven-release_MRELEASE-1010-EJSYEVM3Q5HW74P3YIOC3F6GPYCS3YZJ4IRX7EIB245MHT4XH6FQ@2/m/maven-release-plugin/target/it/projects/update-versions/MRELEASE-611/build.log, /home/jenkins/jenkins-slave/workspace/maven-release_MRELEASE-1010-EJSYEVM3Q5HW74P3YIOC3F6GPYCS3YZJ4IRX7EIB245MHT4XH6FQ@2/m/maven-release-plugin/target/it/projects/update-versions/MRELEASE-783/build.log, /home/jenkins/jenkins-slave/workspace/maven-release_MRELEASE-1010-EJSYEVM3Q5HW74P3YIOC3F6GPYCS3YZJ4IRX7EIB245MHT4XH6FQ@2/m/maven-release-plugin/target/it/projects/update-versions/MRELEASE-976/build.log]
[linux-jdk10] Finished parsing Maven Invoker results (found 4)
[linux-jdk10] [withMaven] junitPublisher - Archive test results for Maven artifact org.apache.maven.release:maven-release-api:3.0.0-SNAPSHOT generated by maven-surefire-plugin:test (default-test): m/maven-release-api/target/surefire-reports/*.xml
[linux-jdk10] Recording test results
[linux-jdk10] None of the test reports contained any result
[linux-jdk10] [withMaven] junitPublisher - Archive test results for Maven artifact org.apache.maven.release:maven-release-manager:3.0.0-SNAPSHOT generated by maven-surefire-plugin:test (default-test): m/maven-release-manager/target/surefire-reports/*.xml
[linux-jdk10] Recording test results
[linux-jdk10] [withMaven] junitPublisher - Archive test results for Maven artifact org.apache.maven.plugins:maven-release-plugin:3.0.0-SNAPSHOT generated by maven-surefire-plugin:test (default-test): m/maven-release-plugin/target/surefire-reports/*.xml
[linux-jdk10] Recording test results
[linux-jdk10] [withMaven] junitPublisher - Archive test results for Maven artifact org.apache.maven.release:maven-release-oddeven-policy:3.0.0-SNAPSHOT generated by maven-surefire-plugin:test (default-test): m/maven-release-policies/maven-release-oddeven-policy/target/surefire-reports/*.xml
[linux-jdk10] Recording test results
[linux-jdk10] [withMaven] junitPublisher - Archive test results for Maven artifact org.apache.maven.release:maven-release-semver-policy:3.0.0-SNAPSHOT generated by maven-surefire-plugin:test (default-test): m/maven-release-policies/maven-release-semver-policy/target/surefire-reports/*.xml
[linux-jdk10] Recording test results
[linux-jdk10] [withMaven] junitPublisher - Archive test results for Maven artifact org.apache.maven.release:maven-release-manager:3.0.0-SNAPSHOT generated by maven-failsafe-plugin:integration-test (default): m/maven-release-manager/target/failsafe-reports/*.xml
[linux-jdk10] Recording test results
[Pipeline] [linux-jdk10] // withMaven
[Pipeline] [linux-jdk10] cleanWs
[linux-jdk10] [WS-CLEANUP] Deleting project workspace...[WS-CLEANUP] done
[Pipeline] [linux-jdk10] }
[Pipeline] [linux-jdk10] // stage
[Pipeline] [linux-jdk10] }
[Pipeline] [linux-jdk10] // node
[Pipeline] [linux-jdk10] }
[Pipeline] // parallel
[Pipeline] stage
[Pipeline] { (Notifications)
[Pipeline] echo
Build result: FAILURE
[Pipeline] jiraIssueSelector
[Pipeline] emailext

Build failed in Jenkins: Maven TLP » maven-release » MRELEASE-1010 #9

Posted by Apache Jenkins Server <je...@builds.apache.org>.
See https://builds.apache.org/job/maven-box/job/maven-release/job/MRELEASE-1010/9/

Changes:

* Upgrade latest version of Maven
* [INFRA-16893] set Windows to windows-2016-1 node
* Back to Windows label
* Windows + M3.5.x = M3.5.2
* [INFRA-16893] Trying workaround
* Revert "[INFRA-16893] Trying workaround"
* Try to display PATH value

All tests passed

Build log:
[...truncated 8.85 MB...]
[windows-jdk10]          |  |        urls[55] = file:/F:/jenkins/jenkins-slave/workspace/maven-release_MRELEASE-1010-EJSYEVM3Q5HW74P3YIOC3F6GPYCS3YZJ4IRX7EIB245MHT4XH6FQ@2/m/maven-release-plugin/target/local-repo/org/jdom/jdom/1.1/jdom-1.1.jar
[windows-jdk10]          |  |        Number of foreign imports: 1
[windows-jdk10]          |  |        import: Entry[import  from realm ClassRealm[maven.api, parent: null]]
[windows-jdk10]          |  |         
[windows-jdk10]          |  |        -----------------------------------------------------
[windows-jdk10]          |  |         
[windows-jdk10]          |  |            at org.apache.maven.plugin.DefaultBuildPluginManager.executeMojo (DefaultBuildPluginManager.java:166)
[windows-jdk10]          |  |            at org.apache.maven.lifecycle.internal.MojoExecutor.execute (MojoExecutor.java:208)
[windows-jdk10]          |  |            at org.apache.maven.lifecycle.internal.MojoExecutor.execute (MojoExecutor.java:154)
[windows-jdk10]          |  |            at org.apache.maven.lifecycle.internal.MojoExecutor.execute (MojoExecutor.java:146)
[windows-jdk10]          |  |            at org.apache.maven.lifecycle.internal.LifecycleModuleBuilder.buildProject (LifecycleModuleBuilder.java:117)
[windows-jdk10]          |  |            at org.apache.maven.lifecycle.internal.LifecycleModuleBuilder.buildProject (LifecycleModuleBuilder.java:81)
[windows-jdk10]          |  |            at org.apache.maven.lifecycle.internal.builder.singlethreaded.SingleThreadedBuilder.build (SingleThreadedBuilder.java:51)
[windows-jdk10]          |  |            at org.apache.maven.lifecycle.internal.LifecycleStarter.execute (LifecycleStarter.java:128)
[windows-jdk10]          |  |            at org.apache.maven.DefaultMaven.doExecute (DefaultMaven.java:309)
[windows-jdk10]          |  |            at org.apache.maven.DefaultMaven.doExecute (DefaultMaven.java:194)
[windows-jdk10]          |  |            at org.apache.maven.DefaultMaven.execute (DefaultMaven.java:107)
[windows-jdk10]          |  |            at org.apache.maven.cli.MavenCli.execute (MavenCli.java:955)
[windows-jdk10]          |  |            at org.apache.maven.cli.MavenCli.doMain (MavenCli.java:290)
[windows-jdk10]          |  |            at org.apache.maven.cli.MavenCli.main (MavenCli.java:194)
[windows-jdk10]          |  |            at jdk.internal.reflect.NativeMethodAccessorImpl.invoke0 (Native Method)
[windows-jdk10]          |  |            at jdk.internal.reflect.NativeMethodAccessorImpl.invoke (NativeMethodAccessorImpl.java:62)
[windows-jdk10]          |  |            at jdk.internal.reflect.DelegatingMethodAccessorImpl.invoke (DelegatingMethodAccessorImpl.java:43)
[windows-jdk10]          |  |            at java.lang.reflect.Method.invoke (Method.java:564)
[windows-jdk10]          |  |            at org.codehaus.plexus.classworlds.launcher.Launcher.launchEnhanced (Launcher.java:289)
[windows-jdk10]          |  |            at org.codehaus.plexus.classworlds.launcher.Launcher.launch (Launcher.java:229)
[windows-jdk10]          |  |            at org.codehaus.plexus.classworlds.launcher.Launcher.mainWithExitCode (Launcher.java:415)
[windows-jdk10]          |  |            at org.codehaus.plexus.classworlds.launcher.Launcher.main (Launcher.java:356)
[windows-jdk10]          |  |        Caused by: java.lang.NoClassDefFoundError: org/apache/maven/shared/release/env/ReleaseEnvironment
[windows-jdk10]          |  |            at java.lang.Class.getDeclaredConstructors0 (Native Method)
[windows-jdk10]          |  |            at java.lang.Class.privateGetDeclaredConstructors (Class.java:3090)
[windows-jdk10]          |  |            at java.lang.Class.getDeclaredConstructors (Class.java:2316)
[windows-jdk10]          |  |            at com.google.inject.spi.InjectionPoint.forConstructorOf (InjectionPoint.java:245)
[windows-jdk10]          |  |            at com.google.inject.internal.ConstructorBindingImpl.create (ConstructorBindingImpl.java:99)
[windows-jdk10]          |  |            at com.google.inject.internal.InjectorImpl.createUninitializedBinding (InjectorImpl.java:658)
[windows-jdk10]          |  |            at com.google.inject.internal.InjectorImpl.createJustInTimeBinding (InjectorImpl.java:882)
[windows-jdk10]          |  |            at com.google.inject.internal.InjectorImpl.createJustInTimeBindingRecursive (InjectorImpl.java:805)
[windows-jdk10]          |  |            at com.google.inject.internal.InjectorImpl.getJustInTimeBinding (InjectorImpl.java:282)
[windows-jdk10]          |  |            at com.google.inject.internal.InjectorImpl.getBindingOrThrow (InjectorImpl.java:214)
[windows-jdk10]          |  |            at com.google.inject.internal.InjectorImpl.getProviderOrThrow (InjectorImpl.java:1006)
[windows-jdk10]          |  |            at com.google.inject.internal.InjectorImpl.getProvider (InjectorImpl.java:1038)
[windows-jdk10]          |  |            at com.google.inject.internal.InjectorImpl.getProvider (InjectorImpl.java:1001)
[windows-jdk10]          |  |            at com.google.inject.internal.InjectorImpl.getInstance (InjectorImpl.java:1051)
[windows-jdk10]          |  |            at org.eclipse.sisu.space.AbstractDeferredClass.get (AbstractDeferredClass.java:48)
[windows-jdk10]          |  |            at com.google.inject.internal.ProviderInternalFactory.provision (ProviderInternalFactory.java:81)
[windows-jdk10]          |  |            at com.google.inject.internal.InternalFactoryToInitializableAdapter.provision (InternalFactoryToInitializableAdapter.java:53)
[windows-jdk10]          |  |            at com.google.inject.internal.ProviderInternalFactory$1.call (ProviderInternalFactory.java:65)
[windows-jdk10]          |  |            at com.google.inject.internal.ProvisionListenerStackCallback$Provision.provision (ProvisionListenerStackCallback.java:115)
[windows-jdk10]          |  |            at com.google.inject.internal.ProvisionListenerStackCallback$Provision.provision (ProvisionListenerStackCallback.java:133)
[windows-jdk10]          |  |            at com.google.inject.internal.ProvisionListenerStackCallback.provision (ProvisionListenerStackCallback.java:68)
[windows-jdk10]          |  |            at com.google.inject.internal.ProviderInternalFactory.circularGet (ProviderInternalFactory.java:63)
[windows-jdk10]          |  |            at com.google.inject.internal.InternalFactoryToInitializableAdapter.get (InternalFactoryToInitializableAdapter.java:45)
[windows-jdk10]          |  |            at com.google.inject.internal.InjectorImpl$2$1.call (InjectorImpl.java:1016)
[windows-jdk10]          |  |            at com.google.inject.internal.InjectorImpl.callInContext (InjectorImpl.java:1092)
[windows-jdk10]          |  |            at com.google.inject.internal.InjectorImpl$2.get (InjectorImpl.java:1012)
[windows-jdk10]          |  |            at org.eclipse.sisu.inject.Guice4$1.get (Guice4.java:162)
[windows-jdk10]          |  |            at org.eclipse.sisu.inject.LazyBeanEntry.getValue (LazyBeanEntry.java:81)
[windows-jdk10]          |  |            at org.eclipse.sisu.plexus.LazyPlexusBean.getValue (LazyPlexusBean.java:51)
[windows-jdk10]          |  |            at org.codehaus.plexus.DefaultPlexusContainer.lookup (DefaultPlexusContainer.java:263)
[windows-jdk10]          |  |            at org.codehaus.plexus.DefaultPlexusContainer.lookup (DefaultPlexusContainer.java:255)
[windows-jdk10]          |  |            at org.apache.maven.plugin.internal.DefaultMavenPluginManager.getConfiguredMojo (DefaultMavenPluginManager.java:519)
[windows-jdk10]          |  |            at org.apache.maven.plugin.DefaultBuildPluginManager.executeMojo (DefaultBuildPluginManager.java:121)
[windows-jdk10]          |  |            at org.apache.maven.lifecycle.internal.MojoExecutor.execute (MojoExecutor.java:208)
[windows-jdk10]          |  |            at org.apache.maven.lifecycle.internal.MojoExecutor.execute (MojoExecutor.java:154)
[windows-jdk10]          |  |            at org.apache.maven.lifecycle.internal.MojoExecutor.execute (MojoExecutor.java:146)
[windows-jdk10]          |  |            at org.apache.maven.lifecycle.internal.LifecycleModuleBuilder.buildProject (LifecycleModuleBuilder.java:117)
[windows-jdk10]          |  |            at org.apache.maven.lifecycle.internal.LifecycleModuleBuilder.buildProject (LifecycleModuleBuilder.java:81)
[windows-jdk10]          |  |            at org.apache.maven.lifecycle.internal.builder.singlethreaded.SingleThreadedBuilder.build (SingleThreadedBuilder.java:51)
[windows-jdk10]          |  |            at org.apache.maven.lifecycle.internal.LifecycleStarter.execute (LifecycleStarter.java:128)
[windows-jdk10]          |  |            at org.apache.maven.DefaultMaven.doExecute (DefaultMaven.java:309)
[windows-jdk10]          |  |            at org.apache.maven.DefaultMaven.doExecute (DefaultMaven.java:194)
[windows-jdk10]          |  |            at org.apache.maven.DefaultMaven.execute (DefaultMaven.java:107)
[windows-jdk10]          |  |            at org.apache.maven.cli.MavenCli.execute (MavenCli.java:955)
[windows-jdk10]          |  |            at org.apache.maven.cli.MavenCli.doMain (MavenCli.java:290)
[windows-jdk10]          |  |            at org.apache.maven.cli.MavenCli.main (MavenCli.java:194)
[windows-jdk10]          |  |            at jdk.internal.reflect.NativeMethodAccessorImpl.invoke0 (Native Method)
[windows-jdk10]          |  |            at jdk.internal.reflect.NativeMethodAccessorImpl.invoke (NativeMethodAccessorImpl.java:62)
[windows-jdk10]          |  |            at jdk.internal.reflect.DelegatingMethodAccessorImpl.invoke (DelegatingMethodAccessorImpl.java:43)
[windows-jdk10]          |  |            at java.lang.reflect.Method.invoke (Method.java:564)
[windows-jdk10]          |  |            at org.codehaus.plexus.classworlds.launcher.Launcher.launchEnhanced (Launcher.java:289)
[windows-jdk10]          |  |            at org.codehaus.plexus.classworlds.launcher.Launcher.launch (Launcher.java:229)
[windows-jdk10]          |  |            at org.codehaus.plexus.classworlds.launcher.Launcher.mainWithExitCode (Launcher.java:415)
[windows-jdk10]          |  |            at org.codehaus.plexus.classworlds.launcher.Launcher.main (Launcher.java:356)
[windows-jdk10]          |  |        Caused by: java.lang.ClassNotFoundException: org.apache.maven.shared.release.env.ReleaseEnvironment
[windows-jdk10]          |  |            at org.codehaus.plexus.classworlds.strategy.SelfFirstStrategy.loadClass (SelfFirstStrategy.java:50)
[windows-jdk10]          |  |            at org.codehaus.plexus.classworlds.realm.ClassRealm.unsynchronizedLoadClass (ClassRealm.java:271)
[windows-jdk10]          |  |            at org.codehaus.plexus.classworlds.realm.ClassRealm.loadClass (ClassRealm.java:247)
[windows-jdk10]          |  |            at org.codehaus.plexus.classworlds.realm.ClassRealm.loadClass (ClassRealm.java:239)
[windows-jdk10]          |  |            at java.lang.Class.getDeclaredConstructors0 (Native Method)
[windows-jdk10]          |  |            at java.lang.Class.privateGetDeclaredConstructors (Class.java:3090)
[windows-jdk10]          |  |            at java.lang.Class.getDeclaredConstructors (Class.java:2316)
[windows-jdk10]          |  |            at com.google.inject.spi.InjectionPoint.forConstructorOf (InjectionPoint.java:245)
[windows-jdk10]          |  |            at com.google.inject.internal.ConstructorBindingImpl.create (ConstructorBindingImpl.java:99)
[windows-jdk10]          |  |            at com.google.inject.internal.InjectorImpl.createUninitializedBinding (InjectorImpl.java:658)
[windows-jdk10]          |  |            at com.google.inject.internal.InjectorImpl.createJustInTimeBinding (InjectorImpl.java:882)
[windows-jdk10]          |  |            at com.google.inject.internal.InjectorImpl.createJustInTimeBindingRecursive (InjectorImpl.java:805)
[windows-jdk10]          |  |            at com.google.inject.internal.InjectorImpl.getJustInTimeBinding (InjectorImpl.java:282)
[windows-jdk10]          |  |            at com.google.inject.internal.InjectorImpl.getBindingOrThrow (InjectorImpl.java:214)
[windows-jdk10]          |  |            at com.google.inject.internal.InjectorImpl.getProviderOrThrow (InjectorImpl.java:1006)
[windows-jdk10]          |  |            at com.google.inject.internal.InjectorImpl.getProvider (InjectorImpl.java:1038)
[windows-jdk10]          |  |            at com.google.inject.internal.InjectorImpl.getProvider (InjectorImpl.java:1001)
[windows-jdk10]          |  |            at com.google.inject.internal.InjectorImpl.getInstance (InjectorImpl.java:1051)
[windows-jdk10]          |  |            at org.eclipse.sisu.space.AbstractDeferredClass.get (AbstractDeferredClass.java:48)
[windows-jdk10]          |  |            at com.google.inject.internal.ProviderInternalFactory.provision (ProviderInternalFactory.java:81)
[windows-jdk10]          |  |            at com.google.inject.internal.InternalFactoryToInitializableAdapter.provision (InternalFactoryToInitializableAdapter.java:53)
[windows-jdk10]          |  |            at com.google.inject.internal.ProviderInternalFactory$1.call (ProviderInternalFactory.java:65)
[windows-jdk10]          |  |            at com.google.inject.internal.ProvisionListenerStackCallback$Provision.provision (ProvisionListenerStackCallback.java:115)
[windows-jdk10]          |  |            at com.google.inject.internal.ProvisionListenerStackCallback$Provision.provision (ProvisionListenerStackCallback.java:133)
[windows-jdk10]          |  |            at com.google.inject.internal.ProvisionListenerStackCallback.provision (ProvisionListenerStackCallback.java:68)
[windows-jdk10]          |  |            at com.google.inject.internal.ProviderInternalFactory.circularGet (ProviderInternalFactory.java:63)
[windows-jdk10]          |  |            at com.google.inject.internal.InternalFactoryToInitializableAdapter.get (InternalFactoryToInitializableAdapter.java:45)
[windows-jdk10]          |  |            at com.google.inject.internal.InjectorImpl$2$1.call (InjectorImpl.java:1016)
[windows-jdk10]          |  |            at com.google.inject.internal.InjectorImpl.callInContext (InjectorImpl.java:1092)
[windows-jdk10]          |  |            at com.google.inject.internal.InjectorImpl$2.get (InjectorImpl.java:1012)
[windows-jdk10]          |  |            at org.eclipse.sisu.inject.Guice4$1.get (Guice4.java:162)
[windows-jdk10]          |  |            at org.eclipse.sisu.inject.LazyBeanEntry.getValue (LazyBeanEntry.java:81)
[windows-jdk10]          |  |            at org.eclipse.sisu.plexus.LazyPlexusBean.getValue (LazyPlexusBean.java:51)
[windows-jdk10]          |  |            at org.codehaus.plexus.DefaultPlexusContainer.lookup (DefaultPlexusContainer.java:263)
[windows-jdk10]          |  |            at org.codehaus.plexus.DefaultPlexusContainer.lookup (DefaultPlexusContainer.java:255)
[windows-jdk10]          |  |            at org.apache.maven.plugin.internal.DefaultMavenPluginManager.getConfiguredMojo (DefaultMavenPluginManager.java:519)
[windows-jdk10]          |  |            at org.apache.maven.plugin.DefaultBuildPluginManager.executeMojo (DefaultBuildPluginManager.java:121)
[windows-jdk10]          |  |            at org.apache.maven.lifecycle.internal.MojoExecutor.execute (MojoExecutor.java:208)
[windows-jdk10]          |  |            at org.apache.maven.lifecycle.internal.MojoExecutor.execute (MojoExecutor.java:154)
[windows-jdk10]          |  |            at org.apache.maven.lifecycle.internal.MojoExecutor.execute (MojoExecutor.java:146)
[windows-jdk10]          |  |            at org.apache.maven.lifecycle.internal.LifecycleModuleBuilder.buildProject (LifecycleModuleBuilder.java:117)
[windows-jdk10]          |  |            at org.apache.maven.lifecycle.internal.LifecycleModuleBuilder.buildProject (LifecycleModuleBuilder.java:81)
[windows-jdk10]          |  |            at org.apache.maven.lifecycle.internal.builder.singlethreaded.SingleThreadedBuilder.build (SingleThreadedBuilder.java:51)
[windows-jdk10]          |  |            at org.apache.maven.lifecycle.internal.LifecycleStarter.execute (LifecycleStarter.java:128)
[windows-jdk10]          |  |            at org.apache.maven.DefaultMaven.doExecute (DefaultMaven.java:309)
[windows-jdk10]          |  |            at org.apache.maven.DefaultMaven.doExecute (DefaultMaven.java:194)
[windows-jdk10]          |  |            at org.apache.maven.DefaultMaven.execute (DefaultMaven.java:107)
[windows-jdk10]          |  |            at org.apache.maven.cli.MavenCli.execute (MavenCli.java:955)
[windows-jdk10]          |  |            at org.apache.maven.cli.MavenCli.doMain (MavenCli.java:290)
[windows-jdk10]          |  |            at org.apache.maven.cli.MavenCli.main (MavenCli.java:194)
[windows-jdk10]          |  |            at jdk.internal.reflect.NativeMethodAccessorImpl.invoke0 (Native Method)
[windows-jdk10]          |  |            at jdk.internal.reflect.NativeMethodAccessorImpl.invoke (NativeMethodAccessorImpl.java:62)
[windows-jdk10]          |  |            at jdk.internal.reflect.DelegatingMethodAccessorImpl.invoke (DelegatingMethodAccessorImpl.java:43)
[windows-jdk10]          |  |            at java.lang.reflect.Method.invoke (Method.java:564)
[windows-jdk10]          |  |            at org.codehaus.plexus.classworlds.launcher.Launcher.launchEnhanced (Launcher.java:289)
[windows-jdk10]          |  |            at org.codehaus.plexus.classworlds.launcher.Launcher.launch (Launcher.java:229)
[windows-jdk10]          |  |            at org.codehaus.plexus.classworlds.launcher.Launcher.mainWithExitCode (Launcher.java:415)
[windows-jdk10]          |  |            at org.codehaus.plexus.classworlds.launcher.Launcher.main (Launcher.java:356)
[windows-jdk10]          |  |        [ERROR] 
[windows-jdk10]          |  |        [ERROR] 
[windows-jdk10]          |  |        [ERROR] For more information about the errors and possible solutions, please read the following articles:
[windows-jdk10]          |  |        [ERROR] [Help 1] http://cwiki.apache.org/confluence/display/MAVEN/PluginContainerException
[windows-jdk10]          |  |        Running post-build script: F:\jenkins\jenkins-slave\workspace\maven-release_MRELEASE-1010-EJSYEVM3Q5HW74P3YIOC3F6GPYCS3YZJ4IRX7EIB245MHT4XH6FQ@2\m\maven-release-plugin\target\it\projects\prepare\MRELEASE-966\verify.groovy
[windows-jdk10]          |  F:\jenkins\jenkins-slave\workspace\maven-release_MRELEASE-1010-EJSYEVM3Q5HW74P3YIOC3F6GPYCS3YZJ4IRX7EIB245MHT4XH6FQ@2\m\maven-release-plugin\target\it\projects\prepare\MRELEASE-966\build.log
[windows-jdk10]          false
[windows-jdk10] [INFO] Building: projects\prepare\MRELEASE-976\pom.xml
[windows-jdk10] [INFO] run post-build script verify.groovy
[windows-jdk10] [INFO]           projects\prepare\MRELEASE-976\pom.xml ............ FAILED (4.3 s)
[windows-jdk10] [INFO]   The post-build script did not succeed. F:\jenkins\jenkins-slave\workspace\maven-release_MRELEASE-1010-EJSYEVM3Q5HW74P3YIOC3F6GPYCS3YZJ4IRX7EIB245MHT4XH6FQ@2\m\maven-release-plugin\target\it\projects\prepare\MRELEASE-976\pom.xml.tag (The system cannot find the file specified)
[windows-jdk10] [INFO] Building: projects\prepare\regular-multi-module\pom.xml
[windows-jdk10] [INFO] run post-build script verify.bsh
[windows-jdk10] [INFO]           projects\prepare\regular-multi-module\pom.xml .... FAILED (3.7 s)
[windows-jdk10] [INFO]   The post-build script returned false.
[windows-jdk10] [INFO] -------------------------------------------------
[windows-jdk10] [INFO] Build Summary:
[windows-jdk10] [INFO]   Passed: 0, Failed: 16, Errors: 0, Skipped: 0
[windows-jdk10] [INFO] -------------------------------------------------
[windows-jdk10] [WARNING] The following builds failed:
[windows-jdk10] [WARNING] *  projects\prepare\completion-goals\pom.xml
[windows-jdk10] [WARNING] *  projects\prepare\flat-multi-module\parent-project\pom.xml
[windows-jdk10] [WARNING] *  projects\prepare\forked-basic\pom.xml
[windows-jdk10] [WARNING] *  projects\prepare\invoker-basic\pom.xml
[windows-jdk10] [WARNING] *  projects\prepare\MRELEASE-128\pom.xml
[windows-jdk10] [WARNING] *  projects\prepare\MRELEASE-156\pom.xml
[windows-jdk10] [WARNING] *  projects\prepare\MRELEASE-420\pom.xml
[windows-jdk10] [WARNING] *  projects\prepare\MRELEASE-483\pom.xml
[windows-jdk10] [WARNING] *  projects\prepare\MRELEASE-533\other-pom.xml
[windows-jdk10] [WARNING] *  projects\prepare\MRELEASE-571_M3\pom.xml
[windows-jdk10] [WARNING] *  projects\prepare\MRELEASE-618\my-pom.xml
[windows-jdk10] [WARNING] *  projects\prepare\MRELEASE-667\pom.xml
[windows-jdk10] [WARNING] *  projects\prepare\MRELEASE-834\pom.xml
[windows-jdk10] [WARNING] *  projects\prepare\MRELEASE-966\my-pom.xml
[windows-jdk10] [WARNING] *  projects\prepare\MRELEASE-976\pom.xml
[windows-jdk10] [WARNING] *  projects\prepare\regular-multi-module\pom.xml
[windows-jdk10] [INFO] -------------------------------------------------
[windows-jdk10] [WARNING] Ignoring that 16 builds failed.
[windows-jdk10] [INFO] 
[windows-jdk10] [INFO] --- maven-invoker-plugin:3.1.0:run (integration-test-prepare-with-pom) @ maven-release-plugin ---
[windows-jdk10] [INFO] ------------------------------------------------------------------------
[windows-jdk10] [INFO] Reactor Summary:
[windows-jdk10] [INFO] 
[windows-jdk10] [INFO] Maven Release ...................................... SUCCESS [ 17.560 s]
[windows-jdk10] [INFO] Maven Release APIs ................................. SUCCESS [  6.828 s]
[windows-jdk10] [INFO] Maven Release Manager .............................. SUCCESS [01:58 min]
[windows-jdk10] [INFO] Maven Release Plugin ............................... FAILURE [01:57 min]
[windows-jdk10] [INFO] Maven Release Odd-Even Policy ...................... SKIPPED
[windows-jdk10] [INFO] Maven Release SemVer Policy ........................ SKIPPED
[windows-jdk10] [INFO] ------------------------------------------------------------------------
[windows-jdk10] [INFO] BUILD FAILURE
[windows-jdk10] [INFO] ------------------------------------------------------------------------
[windows-jdk10] [INFO] Total time: 04:21 min
[windows-jdk10] [INFO] Finished at: 2018-08-16T19:09:32Z
[windows-jdk10] [INFO] Final Memory: 52M/177M
[windows-jdk10] [INFO] ------------------------------------------------------------------------
[windows-jdk10] [INFO] [jenkins-event-spy] Generated F:\jenkins\jenkins-slave\workspace\maven-release_MRELEASE-1010-EJSYEVM3Q5HW74P3YIOC3F6GPYCS3YZJ4IRX7EIB245MHT4XH6FQ@2@tmp\withMaven9548e508\maven-spy-20180816-190510-66215593428936852046154.log
[windows-jdk10] [ERROR] Failed to execute goal org.apache.maven.plugins:maven-invoker-plugin:3.1.0:run (integration-test-prepare-with-pom) on project maven-release-plugin: Could not clean the cloneProjectsTo directory. Reason: File F:\jenkins\jenkins-slave\workspace\maven-release_MRELEASE-1010-EJSYEVM3Q5HW74P3YIOC3F6GPYCS3YZJ4IRX7EIB245MHT4XH6FQ@2\m\maven-release-plugin\target\it\projects\prepare\regular-multi-module\build.log unable to be deleted. -> [Help 1]
[windows-jdk10] [ERROR] 
[windows-jdk10] [ERROR] To see the full stack trace of the errors, re-run Maven with the -e switch.
[windows-jdk10] [ERROR] Re-run Maven using the -X switch to enable full debug logging.
[windows-jdk10] [ERROR] 
[windows-jdk10] [ERROR] For more information about the errors and possible solutions, please read the following articles:
[windows-jdk10] [ERROR] [Help 1] http://cwiki.apache.org/confluence/display/MAVEN/MojoExecutionException
[windows-jdk10] [ERROR] 
[windows-jdk10] [ERROR] After correcting the problems, you can resume the build with the command
[windows-jdk10] [ERROR]   mvn <goals> -rf :maven-release-plugin
[Pipeline] [windows-jdk10] }
[Pipeline] [windows-jdk10] // dir
[Pipeline] [windows-jdk10] }
[windows-jdk10] [withMaven] invokerPublisher - Archive invoker results for Maven artifact MavenArtifact{org.apache.maven.plugins:maven-release-plugin::3.0.0-SNAPSHOT(version: 3.0.0-SNAPSHOT, snapshot:false) } generated by PluginInvocation{org.apache.maven.plugins:maven-invoker-plugin:3.1.0@run  integration-test-prepare}: m\maven-release-plugin\target\invoker-reports\*.xml
[windows-jdk10] performing MavenInvokerRecorder, reportsFilenamePattern:'**/m\maven-release-plugin\target\invoker-reports/BUILD*.xml', invokerBuildDir:'**/m\maven-release-plugin\target\it'
[windows-jdk10] Found reports:[]
[windows-jdk10] Found logs:[f:\jenkins\jenkins-slave\workspace\maven-release_MRELEASE-1010-EJSYEVM3Q5HW74P3YIOC3F6GPYCS3YZJ4IRX7EIB245MHT4XH6FQ@2\m\maven-release-plugin\target\it\projects\prepare\MRELEASE-128\build.log, f:\jenkins\jenkins-slave\workspace\maven-release_MRELEASE-1010-EJSYEVM3Q5HW74P3YIOC3F6GPYCS3YZJ4IRX7EIB245MHT4XH6FQ@2\m\maven-release-plugin\target\it\projects\prepare\MRELEASE-156\build.log, f:\jenkins\jenkins-slave\workspace\maven-release_MRELEASE-1010-EJSYEVM3Q5HW74P3YIOC3F6GPYCS3YZJ4IRX7EIB245MHT4XH6FQ@2\m\maven-release-plugin\target\it\projects\prepare\MRELEASE-420\build.log, f:\jenkins\jenkins-slave\workspace\maven-release_MRELEASE-1010-EJSYEVM3Q5HW74P3YIOC3F6GPYCS3YZJ4IRX7EIB245MHT4XH6FQ@2\m\maven-release-plugin\target\it\projects\prepare\MRELEASE-483\build.log, f:\jenkins\jenkins-slave\workspace\maven-release_MRELEASE-1010-EJSYEVM3Q5HW74P3YIOC3F6GPYCS3YZJ4IRX7EIB245MHT4XH6FQ@2\m\maven-release-plugin\target\it\projects\prepare\MRELEASE-533\build.log, f:\jenkins\jenkins-slave\workspace\maven-release_MRELEASE-1010-EJSYEVM3Q5HW74P3YIOC3F6GPYCS3YZJ4IRX7EIB245MHT4XH6FQ@2\m\maven-release-plugin\target\it\projects\prepare\MRELEASE-571_M3\build.log, f:\jenkins\jenkins-slave\workspace\maven-release_MRELEASE-1010-EJSYEVM3Q5HW74P3YIOC3F6GPYCS3YZJ4IRX7EIB245MHT4XH6FQ@2\m\maven-release-plugin\target\it\projects\prepare\MRELEASE-618\build.log, f:\jenkins\jenkins-slave\workspace\maven-release_MRELEASE-1010-EJSYEVM3Q5HW74P3YIOC3F6GPYCS3YZJ4IRX7EIB245MHT4XH6FQ@2\m\maven-release-plugin\target\it\projects\prepare\MRELEASE-667\build.log, f:\jenkins\jenkins-slave\workspace\maven-release_MRELEASE-1010-EJSYEVM3Q5HW74P3YIOC3F6GPYCS3YZJ4IRX7EIB245MHT4XH6FQ@2\m\maven-release-plugin\target\it\projects\prepare\MRELEASE-966\build.log, f:\jenkins\jenkins-slave\workspace\maven-release_MRELEASE-1010-EJSYEVM3Q5HW74P3YIOC3F6GPYCS3YZJ4IRX7EIB245MHT4XH6FQ@2\m\maven-release-plugin\target\it\projects\prepare\MRELEASE-976\build.log, f:\jenkins\jenkins-slave\workspace\maven-release_MRELEASE-1010-EJSYEVM3Q5HW74P3YIOC3F6GPYCS3YZJ4IRX7EIB245MHT4XH6FQ@2\m\maven-release-plugin\target\it\projects\prepare\completion-goals\build.log, f:\jenkins\jenkins-slave\workspace\maven-release_MRELEASE-1010-EJSYEVM3Q5HW74P3YIOC3F6GPYCS3YZJ4IRX7EIB245MHT4XH6FQ@2\m\maven-release-plugin\target\it\projects\prepare\flat-multi-module\parent-project\build.log, f:\jenkins\jenkins-slave\workspace\maven-release_MRELEASE-1010-EJSYEVM3Q5HW74P3YIOC3F6GPYCS3YZJ4IRX7EIB245MHT4XH6FQ@2\m\maven-release-plugin\target\it\projects\prepare\regular-multi-module\build.log]
[windows-jdk10] Finished parsing Maven Invoker results (found 0)
[windows-jdk10] [withMaven] invokerPublisher - Archive invoker results for Maven artifact MavenArtifact{org.apache.maven.plugins:maven-release-plugin::3.0.0-SNAPSHOT(version: 3.0.0-SNAPSHOT, snapshot:false) } generated by PluginInvocation{org.apache.maven.plugins:maven-invoker-plugin:3.1.0@run  integration-test-prepare-with-pom}: m\maven-release-plugin\target\invoker-reports\*.xml
[windows-jdk10] performing MavenInvokerRecorder, reportsFilenamePattern:'**/m\maven-release-plugin\target\invoker-reports/BUILD*.xml', invokerBuildDir:'**/m\maven-release-plugin\target\it'
[windows-jdk10] Found reports:[]
[windows-jdk10] Found logs:[f:\jenkins\jenkins-slave\workspace\maven-release_MRELEASE-1010-EJSYEVM3Q5HW74P3YIOC3F6GPYCS3YZJ4IRX7EIB245MHT4XH6FQ@2\m\maven-release-plugin\target\it\projects\prepare\MRELEASE-128\build.log, f:\jenkins\jenkins-slave\workspace\maven-release_MRELEASE-1010-EJSYEVM3Q5HW74P3YIOC3F6GPYCS3YZJ4IRX7EIB245MHT4XH6FQ@2\m\maven-release-plugin\target\it\projects\prepare\MRELEASE-156\build.log, f:\jenkins\jenkins-slave\workspace\maven-release_MRELEASE-1010-EJSYEVM3Q5HW74P3YIOC3F6GPYCS3YZJ4IRX7EIB245MHT4XH6FQ@2\m\maven-release-plugin\target\it\projects\prepare\MRELEASE-420\build.log, f:\jenkins\jenkins-slave\workspace\maven-release_MRELEASE-1010-EJSYEVM3Q5HW74P3YIOC3F6GPYCS3YZJ4IRX7EIB245MHT4XH6FQ@2\m\maven-release-plugin\target\it\projects\prepare\MRELEASE-483\build.log, f:\jenkins\jenkins-slave\workspace\maven-release_MRELEASE-1010-EJSYEVM3Q5HW74P3YIOC3F6GPYCS3YZJ4IRX7EIB245MHT4XH6FQ@2\m\maven-release-plugin\target\it\projects\prepare\MRELEASE-533\build.log, f:\jenkins\jenkins-slave\workspace\maven-release_MRELEASE-1010-EJSYEVM3Q5HW74P3YIOC3F6GPYCS3YZJ4IRX7EIB245MHT4XH6FQ@2\m\maven-release-plugin\target\it\projects\prepare\MRELEASE-571_M3\build.log, f:\jenkins\jenkins-slave\workspace\maven-release_MRELEASE-1010-EJSYEVM3Q5HW74P3YIOC3F6GPYCS3YZJ4IRX7EIB245MHT4XH6FQ@2\m\maven-release-plugin\target\it\projects\prepare\MRELEASE-618\build.log, f:\jenkins\jenkins-slave\workspace\maven-release_MRELEASE-1010-EJSYEVM3Q5HW74P3YIOC3F6GPYCS3YZJ4IRX7EIB245MHT4XH6FQ@2\m\maven-release-plugin\target\it\projects\prepare\MRELEASE-667\build.log, f:\jenkins\jenkins-slave\workspace\maven-release_MRELEASE-1010-EJSYEVM3Q5HW74P3YIOC3F6GPYCS3YZJ4IRX7EIB245MHT4XH6FQ@2\m\maven-release-plugin\target\it\projects\prepare\MRELEASE-966\build.log, f:\jenkins\jenkins-slave\workspace\maven-release_MRELEASE-1010-EJSYEVM3Q5HW74P3YIOC3F6GPYCS3YZJ4IRX7EIB245MHT4XH6FQ@2\m\maven-release-plugin\target\it\projects\prepare\MRELEASE-976\build.log, f:\jenkins\jenkins-slave\workspace\maven-release_MRELEASE-1010-EJSYEVM3Q5HW74P3YIOC3F6GPYCS3YZJ4IRX7EIB245MHT4XH6FQ@2\m\maven-release-plugin\target\it\projects\prepare\completion-goals\build.log, f:\jenkins\jenkins-slave\workspace\maven-release_MRELEASE-1010-EJSYEVM3Q5HW74P3YIOC3F6GPYCS3YZJ4IRX7EIB245MHT4XH6FQ@2\m\maven-release-plugin\target\it\projects\prepare\flat-multi-module\parent-project\build.log, f:\jenkins\jenkins-slave\workspace\maven-release_MRELEASE-1010-EJSYEVM3Q5HW74P3YIOC3F6GPYCS3YZJ4IRX7EIB245MHT4XH6FQ@2\m\maven-release-plugin\target\it\projects\prepare\regular-multi-module\build.log]
[windows-jdk10] Finished parsing Maven Invoker results (found 0)
[windows-jdk10] [withMaven] junitPublisher - Archive test results for Maven artifact org.apache.maven.release:maven-release-api:3.0.0-SNAPSHOT generated by maven-surefire-plugin:test (default-test): m\maven-release-api\target\surefire-reports\*.xml
[windows-jdk10] Recording test results
[windows-jdk10] None of the test reports contained any result
[windows-jdk10] [withMaven] junitPublisher - Archive test results for Maven artifact org.apache.maven.release:maven-release-manager:3.0.0-SNAPSHOT generated by maven-surefire-plugin:test (default-test): m\maven-release-manager\target\surefire-reports\*.xml
[windows-jdk10] Recording test results
[windows-jdk10] [withMaven] junitPublisher - Archive test results for Maven artifact org.apache.maven.plugins:maven-release-plugin:3.0.0-SNAPSHOT generated by maven-surefire-plugin:test (default-test): m\maven-release-plugin\target\surefire-reports\*.xml
[windows-jdk10] Recording test results
[windows-jdk10] [withMaven] junitPublisher - Archive test results for Maven artifact org.apache.maven.release:maven-release-manager:3.0.0-SNAPSHOT generated by maven-failsafe-plugin:integration-test (default): m\maven-release-manager\target\failsafe-reports\*.xml
[windows-jdk10] Recording test results
[Pipeline] [windows-jdk10] // withMaven
[Pipeline] [windows-jdk10] cleanWs
[windows-jdk10] [WS-CLEANUP] Deleting project workspace...[WS-CLEANUP] done
[Pipeline] [windows-jdk10] cleanWs
[windows-jdk10] [WS-CLEANUP] Deleting project workspace...[WS-CLEANUP] done
[Pipeline] [windows-jdk10] }
[Pipeline] [windows-jdk10] // stage
[Pipeline] [windows-jdk10] }
[Pipeline] [windows-jdk10] // node
[Pipeline] [windows-jdk10] }
[windows-jdk10] Failed in branch windows-jdk10
[Pipeline] // parallel
[Pipeline] stage
[Pipeline] { (Notifications)
[Pipeline] echo
Build result: FAILURE
[Pipeline] jiraIssueSelector
[Pipeline] emailext