You are viewing a plain text version of this content. The canonical link for it is here.
Posted to commits@sling.apache.org by Apache Jenkins Server <je...@builds.apache.org> on 2017/03/09 19:27:19 UTC

Build failed in Jenkins: sling-karaf-org.apache.sling.karaf-distribution-1.8 #27

See <https://builds.apache.org/job/sling-karaf-org.apache.sling.karaf-distribution-1.8/27/display/redirect?page=changes>

Changes:

[olli] SLING-4411 Provide Oak features

switch to oak-segment-tar

------------------------------------------
Started by an SCM change
[EnvInject] - Loading node environment variables.
Building remotely on H15 (ubuntu) in workspace <https://builds.apache.org/job/sling-karaf-org.apache.sling.karaf-distribution-1.8/ws/>
Updating https://svn.apache.org/repos/asf/sling/trunk/karaf/org.apache.sling.karaf-distribution at revision '2017-03-09T19:25:57.391 +0000'
U         pom.xml
At revision 1786225

Parsing POMs
Established TCP socket on 42977
maven33-agent.jar already up to date
maven33-interceptor.jar already up to date
maven3-interceptor-commons.jar already up to date
[sling-karaf-org.apache.sling.karaf-distribution-1.8] $ /home/jenkins/tools/java/latest1.8/bin/java -Xmx2g -Xms256m -cp /home/jenkins/jenkins-slave/maven33-agent.jar:/home/jenkins/tools/maven/apache-maven-3.3.9/boot/plexus-classworlds-2.5.2.jar:/home/jenkins/tools/maven/apache-maven-3.3.9/conf/logging jenkins.maven3.agent.Maven33Main /home/jenkins/tools/maven/apache-maven-3.3.9 /home/jenkins/jenkins-slave/slave.jar /home/jenkins/jenkins-slave/maven33-interceptor.jar /home/jenkins/jenkins-slave/maven3-interceptor-commons.jar 42977
<===[JENKINS REMOTING CAPACITY]===>   channel started
Executing Maven:  -B -f <https://builds.apache.org/job/sling-karaf-org.apache.sling.karaf-distribution-1.8/ws/pom.xml> -Dmaven.repo.local=/home/jenkins/jenkins-slave/maven-repositories/1 -U clean deploy
[INFO] Scanning for projects...
[INFO]                                                                         
[INFO] ------------------------------------------------------------------------
[INFO] Building Apache Sling - Karaf Distribution 0.1.1-SNAPSHOT
[INFO] ------------------------------------------------------------------------
[INFO] Downloading: http://repository.apache.org/snapshots/org/apache/sling/org.apache.sling.karaf-features/0.1.1-SNAPSHOT/maven-metadata.xml
[INFO] Downloaded: http://repository.apache.org/snapshots/org/apache/sling/org.apache.sling.karaf-features/0.1.1-SNAPSHOT/maven-metadata.xml (2 KB at 2.3 KB/sec)
[INFO] Downloading: http://repository.apache.org/snapshots/org/apache/sling/org.apache.sling.karaf-features/0.1.1-SNAPSHOT/org.apache.sling.karaf-features-0.1.1-20170309.192510-21.pom
[INFO] Downloaded: http://repository.apache.org/snapshots/org/apache/sling/org.apache.sling.karaf-features/0.1.1-SNAPSHOT/org.apache.sling.karaf-features-0.1.1-20170309.192510-21.pom (4 KB at 8.6 KB/sec)
[INFO] Downloading: http://repository.apache.org/snapshots/org/apache/sling/org.apache.sling.karaf-configs/0.1.1-SNAPSHOT/maven-metadata.xml
[INFO] Downloaded: http://repository.apache.org/snapshots/org/apache/sling/org.apache.sling.karaf-configs/0.1.1-SNAPSHOT/maven-metadata.xml (10 KB at 26.4 KB/sec)
[INFO] Downloading: http://repository.apache.org/snapshots/org/apache/sling/org.apache.sling.karaf-repoinit/0.1.1-SNAPSHOT/maven-metadata.xml
[INFO] Downloaded: http://repository.apache.org/snapshots/org/apache/sling/org.apache.sling.karaf-repoinit/0.1.1-SNAPSHOT/maven-metadata.xml (1011 B at 2.7 KB/sec)
[INFO] Downloading: http://repository.apache.org/snapshots/org/apache/sling/org.apache.sling.karaf-features/0.1.1-SNAPSHOT/org.apache.sling.karaf-features-0.1.1-20170309.192510-21-features.xml
[INFO] Downloading: http://repository.apache.org/snapshots/org/apache/sling/org.apache.sling.karaf-configs/0.1.1-SNAPSHOT/org.apache.sling.karaf-configs-0.1.1-SNAPSHOT-org.apache.jackrabbit.oak.segment.SegmentNodeStoreService.config
[INFO] Downloaded: http://repository.apache.org/snapshots/org/apache/sling/org.apache.sling.karaf-features/0.1.1-SNAPSHOT/org.apache.sling.karaf-features-0.1.1-20170309.192510-21-features.xml (41 KB at 90.0 KB/sec)
[JENKINS] Archiving disabled
[INFO] ------------------------------------------------------------------------
[INFO] BUILD FAILURE
[JENKINS] Archiving disabled[INFO] ------------------------------------------------------------------------
[INFO] Total time: 19.837 s
[INFO] Finished at: 2017-03-09T19:27:13+00:00

[INFO] Final Memory: 26M/430M
[INFO] ------------------------------------------------------------------------
Waiting for Jenkins to finish collecting data
[ERROR] Failed to execute goal on project org.apache.sling.karaf-distribution: Could not resolve dependencies for project org.apache.sling:org.apache.sling.karaf-distribution:karaf-assembly:0.1.1-SNAPSHOT: Could not find artifact org.apache.sling:org.apache.sling.karaf-configs:config:org.apache.jackrabbit.oak.segment.SegmentNodeStoreService:0.1.1-SNAPSHOT in Nexus (http://repository.apache.org/snapshots) -> [Help 1]
[ERROR] 
[ERROR] To see the full stack trace of the errors, re-run Maven with the -e switch.
[ERROR] Re-run Maven using the -X switch to enable full debug logging.
[ERROR] 
[ERROR] For more information about the errors and possible solutions, please read the following articles:
[ERROR] [Help 1] http://cwiki.apache.org/confluence/display/MAVEN/DependencyResolutionException
channel stopped
Recording test results

Build failed in Jenkins: sling-karaf-org.apache.sling.karaf-distribution-1.8 #28

Posted by Apache Jenkins Server <je...@builds.apache.org>.
See <https://builds.apache.org/job/sling-karaf-org.apache.sling.karaf-distribution-1.8/28/display/redirect>

------------------------------------------
Started by upstream project "sling-karaf-org.apache.sling.karaf-features-1.8" build number 28
originally caused by:
 Started by an SCM change
[EnvInject] - Loading node environment variables.
Building remotely on H15 (ubuntu) in workspace <https://builds.apache.org/job/sling-karaf-org.apache.sling.karaf-distribution-1.8/ws/>
Updating https://svn.apache.org/repos/asf/sling/trunk/karaf/org.apache.sling.karaf-distribution at revision '2017-03-09T19:27:43.210 +0000'
At revision 1786225

No changes for https://svn.apache.org/repos/asf/sling/trunk/karaf/org.apache.sling.karaf-distribution since the previous build
Parsing POMs
Established TCP socket on 38319
maven33-agent.jar already up to date
maven33-interceptor.jar already up to date
maven3-interceptor-commons.jar already up to date
[sling-karaf-org.apache.sling.karaf-distribution-1.8] $ /home/jenkins/tools/java/latest1.8/bin/java -Xmx2g -Xms256m -cp /home/jenkins/jenkins-slave/maven33-agent.jar:/home/jenkins/tools/maven/apache-maven-3.3.9/boot/plexus-classworlds-2.5.2.jar:/home/jenkins/tools/maven/apache-maven-3.3.9/conf/logging jenkins.maven3.agent.Maven33Main /home/jenkins/tools/maven/apache-maven-3.3.9 /home/jenkins/jenkins-slave/slave.jar /home/jenkins/jenkins-slave/maven33-interceptor.jar /home/jenkins/jenkins-slave/maven3-interceptor-commons.jar 38319
<===[JENKINS REMOTING CAPACITY]===>   channel started
Executing Maven:  -B -f <https://builds.apache.org/job/sling-karaf-org.apache.sling.karaf-distribution-1.8/ws/pom.xml> -Dmaven.repo.local=/home/jenkins/jenkins-slave/maven-repositories/1 -U clean deploy
[INFO] Scanning for projects...
[INFO]                                                                         
[INFO] ------------------------------------------------------------------------
[INFO] Building Apache Sling - Karaf Distribution 0.1.1-SNAPSHOT
[INFO] ------------------------------------------------------------------------
[INFO] Downloading: http://repository.apache.org/snapshots/org/apache/sling/org.apache.sling.karaf-features/0.1.1-SNAPSHOT/maven-metadata.xml
[INFO] Downloaded: http://repository.apache.org/snapshots/org/apache/sling/org.apache.sling.karaf-features/0.1.1-SNAPSHOT/maven-metadata.xml (2 KB at 2.2 KB/sec)
[INFO] Downloading: http://repository.apache.org/snapshots/org/apache/sling/org.apache.sling.karaf-configs/0.1.1-SNAPSHOT/maven-metadata.xml
[INFO] Downloaded: http://repository.apache.org/snapshots/org/apache/sling/org.apache.sling.karaf-configs/0.1.1-SNAPSHOT/maven-metadata.xml (10 KB at 26.6 KB/sec)
[INFO] Downloading: http://repository.apache.org/snapshots/org/apache/sling/org.apache.sling.karaf-repoinit/0.1.1-SNAPSHOT/maven-metadata.xml
[INFO] Downloaded: http://repository.apache.org/snapshots/org/apache/sling/org.apache.sling.karaf-repoinit/0.1.1-SNAPSHOT/maven-metadata.xml (1011 B at 2.7 KB/sec)
[INFO] Downloading: http://repository.apache.org/snapshots/org/apache/sling/org.apache.sling.karaf-configs/0.1.1-SNAPSHOT/org.apache.sling.karaf-configs-0.1.1-SNAPSHOT-org.apache.jackrabbit.oak.segment.SegmentNodeStoreService.config
[JENKINS] Archiving disabled
[JENKINS] Archiving disabled
[INFO] ------------------------------------------------------------------------
[INFO] BUILD FAILURE
[INFO] ------------------------------------------------------------------------
[INFO] Total time: 12.078 s
[INFO] Finished at: 2017-03-09T19:28:28+00:00
[INFO] Final Memory: 23M/423M
[INFO] ------------------------------------------------------------------------
Waiting for Jenkins to finish collecting data
[ERROR] Failed to execute goal on project org.apache.sling.karaf-distribution: Could not resolve dependencies for project org.apache.sling:org.apache.sling.karaf-distribution:karaf-assembly:0.1.1-SNAPSHOT: Could not find artifact org.apache.sling:org.apache.sling.karaf-configs:config:org.apache.jackrabbit.oak.segment.SegmentNodeStoreService:0.1.1-SNAPSHOT in Nexus (http://repository.apache.org/snapshots) -> [Help 1]
[ERROR] 
[ERROR] To see the full stack trace of the errors, re-run Maven with the -e switch.
[ERROR] Re-run Maven using the -X switch to enable full debug logging.
[ERROR] 
[ERROR] For more information about the errors and possible solutions, please read the following articles:
[ERROR] [Help 1] http://cwiki.apache.org/confluence/display/MAVEN/DependencyResolutionException
channel stopped
Recording test results