You are viewing a plain text version of this content. The canonical link for it is here.
Posted to hdfs-dev@hadoop.apache.org by Apache Jenkins Server <je...@builds.apache.org> on 2016/01/27 00:19:06 UTC
Build failed in Jenkins: Hadoop-Hdfs-trunk #2770
See <https://builds.apache.org/job/Hadoop-Hdfs-trunk/2770/changes>
Changes:
[zhz] HDFS-9541. Add hdfsStreamBuilder API to libhdfs to support
------------------------------------------
[...truncated 8418 lines...]
[javadoc] [loading ZipFileIndexFileObject[<https://builds.apache.org/job/Hadoop-Hdfs-trunk/ws/hadoop-hdfs-project/hadoop-hdfs-client/target/hadoop-hdfs-client-3.0.0-SNAPSHOT.jar(org/apache/hadoop/hdfs/util/ByteArrayManager.class)]]>
[javadoc] [loading ZipFileIndexFileObject[<https://builds.apache.org/job/Hadoop-Hdfs-trunk/ws/hadoop-hdfs-project/hadoop-hdfs-client/target/hadoop-hdfs-client-3.0.0-SNAPSHOT.jar(org/apache/hadoop/hdfs/util/ByteArrayManager$1.class)]]>
[javadoc] [loading RegularFileObject[<https://builds.apache.org/job/Hadoop-Hdfs-trunk/ws/hadoop-hdfs-project/hadoop-hdfs/target/classes/org/apache/hadoop/hdfs/util/ReadOnlyList$Util$1.class]]>
[javadoc] [loading RegularFileObject[<https://builds.apache.org/job/Hadoop-Hdfs-trunk/ws/hadoop-hdfs-project/hadoop-hdfs/target/classes/org/apache/hadoop/hdfs/util/LightWeightHashSet$1.class]]>
[javadoc] [loading RegularFileObject[<https://builds.apache.org/job/Hadoop-Hdfs-trunk/ws/hadoop-hdfs-project/hadoop-hdfs/target/classes/org/apache/hadoop/hdfs/util/ReadOnlyList$Util$2.class]]>
[javadoc] [loading RegularFileObject[<https://builds.apache.org/job/Hadoop-Hdfs-trunk/ws/hadoop-hdfs-project/hadoop-hdfs/target/classes/org/apache/hadoop/hdfs/util/CyclicIteration$1.class]]>
[javadoc] [loading RegularFileObject[<https://builds.apache.org/job/Hadoop-Hdfs-trunk/ws/hadoop-hdfs-project/hadoop-hdfs/target/classes/org/apache/hadoop/hdfs/util/Diff$1.class]]>
[javadoc] [loading RegularFileObject[<https://builds.apache.org/job/Hadoop-Hdfs-trunk/ws/hadoop-hdfs-project/hadoop-hdfs/target/classes/org/apache/hadoop/hdfs/util/LightWeightLinkedSet$1.class]]>
[javadoc] [loading ZipFileIndexFileObject[<https://builds.apache.org/job/Hadoop-Hdfs-trunk/ws/hadoop-hdfs-project/hadoop-hdfs-client/target/hadoop-hdfs-client-3.0.0-SNAPSHOT.jar(org/apache/hadoop/hdfs/web/WebHdfsFileSystem$FsPathOutputStreamRunner.class)]]>
[javadoc] [loading ZipFileIndexFileObject[<https://builds.apache.org/job/Hadoop-Hdfs-trunk/ws/hadoop-hdfs-project/hadoop-hdfs-client/target/hadoop-hdfs-client-3.0.0-SNAPSHOT.jar(org/apache/hadoop/hdfs/web/WebHdfsFileSystem$FsPathOutputStreamRunner$1.class)]]>
[javadoc] [loading ZipFileIndexFileObject[<https://builds.apache.org/job/Hadoop-Hdfs-trunk/ws/hadoop-hdfs-project/hadoop-hdfs-client/target/hadoop-hdfs-client-3.0.0-SNAPSHOT.jar(org/apache/hadoop/hdfs/web/WebHdfsFileSystem$AbstractRunner.class)]]>
[javadoc] [loading ZipFileIndexFileObject[<https://builds.apache.org/job/Hadoop-Hdfs-trunk/ws/hadoop-hdfs-project/hadoop-hdfs-client/target/hadoop-hdfs-client-3.0.0-SNAPSHOT.jar(org/apache/hadoop/hdfs/web/WebHdfsFileSystem$AbstractRunner$1.class)]]>
[javadoc] [loading ZipFileIndexFileObject[<https://builds.apache.org/job/Hadoop-Hdfs-trunk/ws/hadoop-hdfs-project/hadoop-hdfs-client/target/hadoop-hdfs-client-3.0.0-SNAPSHOT.jar(org/apache/hadoop/hdfs/web/WebHdfsFileSystem$9.class)]]>
[javadoc] [loading ZipFileIndexFileObject[<https://builds.apache.org/job/Hadoop-Hdfs-trunk/ws/hadoop-hdfs-project/hadoop-hdfs-client/target/hadoop-hdfs-client-3.0.0-SNAPSHOT.jar(org/apache/hadoop/hdfs/web/WebHdfsFileSystem$8.class)]]>
[javadoc] [loading ZipFileIndexFileObject[<https://builds.apache.org/job/Hadoop-Hdfs-trunk/ws/hadoop-hdfs-project/hadoop-hdfs-client/target/hadoop-hdfs-client-3.0.0-SNAPSHOT.jar(org/apache/hadoop/hdfs/web/WebHdfsFileSystem$7.class)]]>
[javadoc] [loading ZipFileIndexFileObject[<https://builds.apache.org/job/Hadoop-Hdfs-trunk/ws/hadoop-hdfs-project/hadoop-hdfs-client/target/hadoop-hdfs-client-3.0.0-SNAPSHOT.jar(org/apache/hadoop/hdfs/web/WebHdfsFileSystem$6.class)]]>
[javadoc] [loading ZipFileIndexFileObject[<https://builds.apache.org/job/Hadoop-Hdfs-trunk/ws/hadoop-hdfs-project/hadoop-hdfs-client/target/hadoop-hdfs-client-3.0.0-SNAPSHOT.jar(org/apache/hadoop/hdfs/web/WebHdfsFileSystem$5.class)]]>
[javadoc] [loading ZipFileIndexFileObject[<https://builds.apache.org/job/Hadoop-Hdfs-trunk/ws/hadoop-hdfs-project/hadoop-hdfs-client/target/hadoop-hdfs-client-3.0.0-SNAPSHOT.jar(org/apache/hadoop/hdfs/web/WebHdfsFileSystem$4.class)]]>
[javadoc] [loading ZipFileIndexFileObject[<https://builds.apache.org/job/Hadoop-Hdfs-trunk/ws/hadoop-hdfs-project/hadoop-hdfs-client/target/hadoop-hdfs-client-3.0.0-SNAPSHOT.jar(org/apache/hadoop/hdfs/web/WebHdfsFileSystem$3.class)]]>
[javadoc] [loading ZipFileIndexFileObject[<https://builds.apache.org/job/Hadoop-Hdfs-trunk/ws/hadoop-hdfs-project/hadoop-hdfs-client/target/hadoop-hdfs-client-3.0.0-SNAPSHOT.jar(org/apache/hadoop/hdfs/web/WebHdfsFileSystem$2.class)]]>
[javadoc] [loading ZipFileIndexFileObject[<https://builds.apache.org/job/Hadoop-Hdfs-trunk/ws/hadoop-hdfs-project/hadoop-hdfs-client/target/hadoop-hdfs-client-3.0.0-SNAPSHOT.jar(org/apache/hadoop/hdfs/web/WebHdfsFileSystem$16.class)]]>
[javadoc] [loading ZipFileIndexFileObject[<https://builds.apache.org/job/Hadoop-Hdfs-trunk/ws/hadoop-hdfs-project/hadoop-hdfs-client/target/hadoop-hdfs-client-3.0.0-SNAPSHOT.jar(org/apache/hadoop/hdfs/web/WebHdfsFileSystem$15.class)]]>
[javadoc] [loading ZipFileIndexFileObject[<https://builds.apache.org/job/Hadoop-Hdfs-trunk/ws/hadoop-hdfs-project/hadoop-hdfs-client/target/hadoop-hdfs-client-3.0.0-SNAPSHOT.jar(org/apache/hadoop/hdfs/web/WebHdfsFileSystem$14.class)]]>
[javadoc] [loading ZipFileIndexFileObject[<https://builds.apache.org/job/Hadoop-Hdfs-trunk/ws/hadoop-hdfs-project/hadoop-hdfs-client/target/hadoop-hdfs-client-3.0.0-SNAPSHOT.jar(org/apache/hadoop/hdfs/web/WebHdfsFileSystem$13.class)]]>
[javadoc] [loading ZipFileIndexFileObject[<https://builds.apache.org/job/Hadoop-Hdfs-trunk/ws/hadoop-hdfs-project/hadoop-hdfs-client/target/hadoop-hdfs-client-3.0.0-SNAPSHOT.jar(org/apache/hadoop/hdfs/web/WebHdfsFileSystem$12.class)]]>
[javadoc] [loading ZipFileIndexFileObject[<https://builds.apache.org/job/Hadoop-Hdfs-trunk/ws/hadoop-hdfs-project/hadoop-hdfs-client/target/hadoop-hdfs-client-3.0.0-SNAPSHOT.jar(org/apache/hadoop/hdfs/web/WebHdfsFileSystem$11.class)]]>
[javadoc] [loading ZipFileIndexFileObject[<https://builds.apache.org/job/Hadoop-Hdfs-trunk/ws/hadoop-hdfs-project/hadoop-hdfs-client/target/hadoop-hdfs-client-3.0.0-SNAPSHOT.jar(org/apache/hadoop/hdfs/web/WebHdfsFileSystem$10.class)]]>
[javadoc] [loading ZipFileIndexFileObject[<https://builds.apache.org/job/Hadoop-Hdfs-trunk/ws/hadoop-hdfs-project/hadoop-hdfs-client/target/hadoop-hdfs-client-3.0.0-SNAPSHOT.jar(org/apache/hadoop/hdfs/web/URLConnectionFactory$2.class)]]>
[javadoc] [loading ZipFileIndexFileObject[<https://builds.apache.org/job/Hadoop-Hdfs-trunk/ws/hadoop-hdfs-project/hadoop-hdfs-client/target/hadoop-hdfs-client-3.0.0-SNAPSHOT.jar(org/apache/hadoop/hdfs/web/URLConnectionFactory$1.class)]]>
[javadoc] [loading ZipFileIndexFileObject[<https://builds.apache.org/job/Hadoop-Hdfs-trunk/ws/hadoop-hdfs-project/hadoop-hdfs-client/target/hadoop-hdfs-client-3.0.0-SNAPSHOT.jar(org/apache/hadoop/hdfs/web/TokenAspect.class)]]>
[javadoc] [loading ZipFileIndexFileObject[<https://builds.apache.org/job/Hadoop-Hdfs-trunk/ws/hadoop-hdfs-project/hadoop-hdfs-client/target/hadoop-hdfs-client-3.0.0-SNAPSHOT.jar(org/apache/hadoop/hdfs/web/KerberosUgiAuthenticator.class)]]>
[javadoc] [loading ZipFileIndexFileObject[<https://builds.apache.org/job/Hadoop-Hdfs-trunk/ws/hadoop-hdfs-project/hadoop-hdfs-client/target/hadoop-hdfs-client-3.0.0-SNAPSHOT.jar(org/apache/hadoop/hdfs/web/KerberosUgiAuthenticator$1.class)]]>
[javadoc] [loading ZipFileIndexFileObject[<https://builds.apache.org/job/Hadoop-Hdfs-trunk/ws/hadoop-hdfs-project/hadoop-hdfs-client/target/hadoop-hdfs-client-3.0.0-SNAPSHOT.jar(org/apache/hadoop/hdfs/web/JsonUtilClient.class)]]>
[javadoc] [loading ZipFileIndexFileObject[<https://builds.apache.org/job/Hadoop-Hdfs-trunk/ws/hadoop-hdfs-project/hadoop-hdfs-client/target/hadoop-hdfs-client-3.0.0-SNAPSHOT.jar(org/apache/hadoop/hdfs/web/ByteRangeInputStream.class)]]>
[javadoc] [loading RegularFileObject[<https://builds.apache.org/job/Hadoop-Hdfs-trunk/ws/hadoop-hdfs-project/hadoop-hdfs/target/classes/org/apache/hadoop/hdfs/web/ParamFilter$1.class]]>
[javadoc] [loading RegularFileObject[<https://builds.apache.org/job/Hadoop-Hdfs-trunk/ws/hadoop-hdfs-project/hadoop-hdfs/target/classes/org/apache/hadoop/hdfs/web/AuthFilter$1.class]]>
[javadoc] [loading RegularFileObject[<https://builds.apache.org/job/Hadoop-Hdfs-trunk/ws/hadoop-hdfs-project/hadoop-hdfs/target/classes/org/apache/hadoop/hdfs/web/AuthFilter$1$1.class]]>
[javadoc] [loading ZipFileIndexFileObject[<https://builds.apache.org/job/Hadoop-Hdfs-trunk/ws/hadoop-hdfs-project/hadoop-hdfs-client/target/hadoop-hdfs-client-3.0.0-SNAPSHOT.jar(org/apache/hadoop/hdfs/web/resources/ShortParam.class)]]>
[javadoc] [loading ZipFileIndexFileObject[<https://builds.apache.org/job/Hadoop-Hdfs-trunk/ws/hadoop-hdfs-project/hadoop-hdfs-client/target/hadoop-hdfs-client-3.0.0-SNAPSHOT.jar(org/apache/hadoop/hdfs/web/resources/Param$1.class)]]>
[javadoc] [loading ZipFileIndexFileObject[<https://builds.apache.org/job/Hadoop-Hdfs-trunk/ws/hadoop-hdfs-project/hadoop-hdfs-client/target/hadoop-hdfs-client-3.0.0-SNAPSHOT.jar(org/apache/hadoop/hdfs/web/resources/LongParam.class)]]>
[javadoc] [loading ZipFileIndexFileObject[<https://builds.apache.org/job/Hadoop-Hdfs-trunk/ws/hadoop-hdfs-project/hadoop-hdfs-client/target/hadoop-hdfs-client-3.0.0-SNAPSHOT.jar(org/apache/hadoop/hdfs/web/resources/IntegerParam.class)]]>
[javadoc] [loading ZipFileIndexFileObject[<https://builds.apache.org/job/Hadoop-Hdfs-trunk/ws/hadoop-hdfs-project/hadoop-hdfs-client/target/hadoop-hdfs-client-3.0.0-SNAPSHOT.jar(org/apache/hadoop/hdfs/web/resources/EnumSetParam.class)]]>
[javadoc] [loading ZipFileIndexFileObject[<https://builds.apache.org/job/Hadoop-Hdfs-trunk/ws/hadoop-hdfs-project/hadoop-hdfs-client/target/hadoop-hdfs-client-3.0.0-SNAPSHOT.jar(org/apache/hadoop/hdfs/web/resources/EnumParam.class)]]>
[javadoc] [loading ZipFileIndexFileObject[<https://builds.apache.org/job/Hadoop-Hdfs-trunk/ws/hadoop-hdfs-project/hadoop-hdfs-client/target/hadoop-hdfs-client-3.0.0-SNAPSHOT.jar(org/apache/hadoop/hdfs/web/resources/BooleanParam.class)]]>
[javadoc] [done in 5260 ms]
[javadoc] Generating Javadoc
[javadoc] Javadoc execution
[javadoc] Loading source file <https://builds.apache.org/job/Hadoop-Hdfs-trunk/ws/hadoop-hdfs-project/hadoop-hdfs/dev-support/jdiff/Null.java...>
[javadoc] Loading source files for package org.apache.hadoop.fs...
[javadoc] Loading source files for package org.apache.hadoop.hdfs...
[javadoc] Loading source files for package org.apache.hadoop.hdfs.client...
[javadoc] Loading source files for package org.apache.hadoop.hdfs.net...
[javadoc] Loading source files for package org.apache.hadoop.hdfs.protocol...
[javadoc] Loading source files for package org.apache.hadoop.hdfs.protocol.datatransfer...
[javadoc] Loading source files for package org.apache.hadoop.hdfs.protocol.datatransfer.sasl...
[javadoc] Loading source files for package org.apache.hadoop.hdfs.protocolPB...
[javadoc] Loading source files for package org.apache.hadoop.hdfs.qjournal.client...
[javadoc] Loading source files for package org.apache.hadoop.hdfs.qjournal.protocol...
[javadoc] Loading source files for package org.apache.hadoop.hdfs.qjournal.protocolPB...
[javadoc] Loading source files for package org.apache.hadoop.hdfs.qjournal.server...
[javadoc] Loading source files for package org.apache.hadoop.hdfs.security.token.block...
[javadoc] Loading source files for package org.apache.hadoop.hdfs.security.token.delegation...
[javadoc] Loading source files for package org.apache.hadoop.hdfs.server.balancer...
[javadoc] Loading source files for package org.apache.hadoop.hdfs.server.blockmanagement...
[javadoc] Loading source files for package org.apache.hadoop.hdfs.server.common...
[javadoc] Loading source files for package org.apache.hadoop.hdfs.server.datanode...
[javadoc] Loading source files for package org.apache.hadoop.hdfs.server.datanode.erasurecode...
[javadoc] Loading source files for package org.apache.hadoop.hdfs.server.datanode.fsdataset...
[javadoc] Loading source files for package org.apache.hadoop.hdfs.server.datanode.fsdataset.impl...
[javadoc] Loading source files for package org.apache.hadoop.hdfs.server.datanode.metrics...
[javadoc] Loading source files for package org.apache.hadoop.hdfs.server.datanode.web...
[javadoc] Loading source files for package org.apache.hadoop.hdfs.server.datanode.web.dtp...
[javadoc] Loading source files for package org.apache.hadoop.hdfs.server.datanode.web.webhdfs...
[javadoc] Loading source files for package org.apache.hadoop.hdfs.server.mover...
[javadoc] Loading source files for package org.apache.hadoop.hdfs.server.namenode...
[javadoc] Loading source files for package org.apache.hadoop.hdfs.server.namenode.ha...
[javadoc] Loading source files for package org.apache.hadoop.hdfs.server.namenode.metrics...
[javadoc] Loading source files for package org.apache.hadoop.hdfs.server.namenode.snapshot...
[javadoc] Loading source files for package org.apache.hadoop.hdfs.server.namenode.startupprogress...
[javadoc] Loading source files for package org.apache.hadoop.hdfs.server.namenode.top...
[javadoc] Loading source files for package org.apache.hadoop.hdfs.server.namenode.top.metrics...
[javadoc] Loading source files for package org.apache.hadoop.hdfs.server.namenode.top.window...
[javadoc] Loading source files for package org.apache.hadoop.hdfs.server.namenode.web.resources...
[javadoc] Loading source files for package org.apache.hadoop.hdfs.server.protocol...
[javadoc] Loading source files for package org.apache.hadoop.hdfs.tools...
[javadoc] Loading source files for package org.apache.hadoop.hdfs.tools.erasurecode...
[javadoc] Loading source files for package org.apache.hadoop.hdfs.tools.offlineEditsViewer...
[javadoc] Loading source files for package org.apache.hadoop.hdfs.tools.offlineImageViewer...
[javadoc] Loading source files for package org.apache.hadoop.hdfs.tools.snapshot...
[javadoc] Loading source files for package org.apache.hadoop.hdfs.util...
[javadoc] Loading source files for package org.apache.hadoop.hdfs.web...
[javadoc] Loading source files for package org.apache.hadoop.hdfs.web.resources...
[javadoc] Constructing Javadoc information...
[javadoc] ExcludePrivateAnnotationsJDiffDoclet
[javadoc] JDiff: doclet started ...
[javadoc] JDiff: reading the old API in from file '<https://builds.apache.org/job/Hadoop-Hdfs-trunk/ws/hadoop-hdfs-project/hadoop-hdfs/dev-support/jdiff/Apache_Hadoop_HDFS_2.6.0.xml'...Warning>: API identifier in the XML file (hadoop-hdfs 2.6.0) differs from the name of the file 'Apache_Hadoop_HDFS_2.6.0.xml'
[javadoc] finished
[javadoc] JDiff: reading the new API in from file '<https://builds.apache.org/job/Hadoop-Hdfs-trunk/ws/hadoop-hdfs-project/hadoop-hdfs/target/site/jdiff/xml/Apache_Hadoop_HDFS_3.0.0-SNAPSHOT.xml'...> finished
[javadoc] JDiff: comparing the old and new APIs ...
[javadoc] Warning: no classes found in the package org.apache.hadoop.hdfs.net
[javadoc] Warning: no classes found in the package org.apache.hadoop.hdfs.protocol.datatransfer.sasl
[javadoc] Warning: no classes found in the package org.apache.hadoop.hdfs.qjournal.client
[javadoc] Warning: no classes found in the package org.apache.hadoop.hdfs.qjournal.protocol
[javadoc] Warning: no classes found in the package org.apache.hadoop.hdfs.qjournal.protocolPB
[javadoc] Warning: no classes found in the package org.apache.hadoop.hdfs.server.mover
[javadoc] Warning: no classes found in the package org.apache.hadoop.hdfs.tools.snapshot
[javadoc] Approximately 41% difference between the APIs
[javadoc] JDiff: reading the comments in from file '<https://builds.apache.org/job/Hadoop-Hdfs-trunk/ws/hadoop-hdfs-project/hadoop-hdfs/target/site/jdiff/xml/user_comments_for_Apache_Hadoop_HDFS_2.6.0_to_Apache_Hadoop_HDFS_3.0.0-SNAPSHOT.xml'...>
[javadoc] (this will be created)
[javadoc] JDiff: generating HTML report into the file '<https://builds.apache.org/job/Hadoop-Hdfs-trunk/ws/hadoop-hdfs-project/hadoop-hdfs/target/site/jdiff/xml/changes.html'> and the subdirectory '<https://builds.apache.org/job/Hadoop-Hdfs-trunk/ws/hadoop-hdfs-project/hadoop-hdfs/target/site/jdiff/xml/changes'>
[javadoc] Note: all the comments have been newly generated
[javadoc] JDiff: writing the comments out to file '<https://builds.apache.org/job/Hadoop-Hdfs-trunk/ws/hadoop-hdfs-project/hadoop-hdfs/target/site/jdiff/xml/user_comments_for_Apache_Hadoop_HDFS_2.6.0_to_Apache_Hadoop_HDFS_3.0.0-SNAPSHOT.xml'...>
[javadoc] JDiff: finished (took 1s).
[xslt] Processing <https://builds.apache.org/job/Hadoop-Hdfs-trunk/ws/hadoop-hdfs-project/hadoop-hdfs/target/findbugsXml.xml> to <https://builds.apache.org/job/Hadoop-Hdfs-trunk/ws/hadoop-hdfs-project/hadoop-hdfs/target/site/findbugs.html>
[xslt] Loading stylesheet /home/jenkins/tools/findbugs/latest/src/xsl/default.xsl
[INFO] Executed tasks
[INFO]
[INFO] --- maven-antrun-plugin:1.7:run (pre-dist) @ hadoop-hdfs ---
[INFO] Executing tasks
main:
[INFO] Executed tasks
[INFO]
[INFO] >>> maven-javadoc-plugin:2.8.1:javadoc (default) @ hadoop-hdfs >>>
[INFO]
[INFO] --- maven-antrun-plugin:1.7:run (create-testdirs) @ hadoop-hdfs ---
[INFO] Executing tasks
main:
[INFO] Executed tasks
[INFO]
[INFO] --- hadoop-maven-plugins:3.0.0-SNAPSHOT:protoc (compile-protoc) @ hadoop-hdfs ---
[INFO] No changes detected in protoc files, skipping generation.
[INFO]
[INFO] <<< maven-javadoc-plugin:2.8.1:javadoc (default) @ hadoop-hdfs <<<
[INFO]
[INFO] --- maven-javadoc-plugin:2.8.1:javadoc (default) @ hadoop-hdfs ---
[INFO] Skipping javadoc generation
[INFO]
[INFO] --- maven-assembly-plugin:2.4:single (dist) @ hadoop-hdfs ---
[WARNING] The following patterns were never triggered in this artifact exclusion filter:
o 'org.apache.ant:*:jar'
o 'jdiff:jdiff:jar'
[INFO] Copying files to <https://builds.apache.org/job/Hadoop-Hdfs-trunk/ws/hadoop-hdfs-project/hadoop-hdfs/target/hadoop-hdfs-3.0.0-SNAPSHOT>
[INFO]
[INFO] --- maven-jar-plugin:2.5:jar (default-jar) @ hadoop-hdfs ---
[INFO]
[INFO] --- maven-source-plugin:2.3:jar-no-fork (hadoop-java-sources) @ hadoop-hdfs ---
[INFO]
[INFO] --- maven-source-plugin:2.3:test-jar-no-fork (hadoop-java-sources) @ hadoop-hdfs ---
[INFO]
[INFO] --- maven-enforcer-plugin:1.3.1:enforce (dist-enforce) @ hadoop-hdfs ---
[INFO]
[INFO] --- maven-site-plugin:3.4:attach-descriptor (attach-descriptor) @ hadoop-hdfs ---
[INFO]
[INFO] --- maven-antrun-plugin:1.7:run (tar) @ hadoop-hdfs ---
[INFO] Executing tasks
main:
[INFO] Executed tasks
[INFO]
[INFO] --- maven-javadoc-plugin:2.8.1:jar (module-javadocs) @ hadoop-hdfs ---
[INFO] Skipping javadoc generation
[INFO]
[INFO] --- maven-enforcer-plugin:1.3.1:enforce (depcheck) @ hadoop-hdfs ---
[INFO]
[INFO] --- maven-checkstyle-plugin:2.15:checkstyle (default-cli) @ hadoop-hdfs ---
[INFO]
[INFO] ------------------------------------------------------------------------
[INFO] Skipping Apache Hadoop HDFS Native Client
[INFO] This project has been banned from the build due to previous failures.
[INFO] ------------------------------------------------------------------------
[INFO]
[INFO] ------------------------------------------------------------------------
[INFO] Skipping Apache Hadoop HttpFS
[INFO] This project has been banned from the build due to previous failures.
[INFO] ------------------------------------------------------------------------
[INFO]
[INFO] ------------------------------------------------------------------------
[INFO] Skipping Apache Hadoop HDFS BookKeeper Journal
[INFO] This project has been banned from the build due to previous failures.
[INFO] ------------------------------------------------------------------------
[INFO]
[INFO] ------------------------------------------------------------------------
[INFO] Skipping Apache Hadoop HDFS-NFS
[INFO] This project has been banned from the build due to previous failures.
[INFO] ------------------------------------------------------------------------
[INFO]
[INFO] ------------------------------------------------------------------------
[INFO] Building Apache Hadoop HDFS Project 3.0.0-SNAPSHOT
[INFO] ------------------------------------------------------------------------
[INFO]
[INFO] --- maven-clean-plugin:2.5:clean (default-clean) @ hadoop-hdfs-project ---
[INFO] Deleting <https://builds.apache.org/job/Hadoop-Hdfs-trunk/ws/hadoop-hdfs-project/target>
[INFO]
[INFO] --- maven-antrun-plugin:1.7:run (create-testdirs) @ hadoop-hdfs-project ---
[INFO] Executing tasks
main:
[mkdir] Created dir: <https://builds.apache.org/job/Hadoop-Hdfs-trunk/ws/hadoop-hdfs-project/target/test-dir>
[INFO] Executed tasks
[INFO]
[INFO] --- maven-source-plugin:2.3:jar-no-fork (hadoop-java-sources) @ hadoop-hdfs-project ---
[INFO]
[INFO] --- maven-source-plugin:2.3:test-jar-no-fork (hadoop-java-sources) @ hadoop-hdfs-project ---
[INFO]
[INFO] --- maven-enforcer-plugin:1.3.1:enforce (dist-enforce) @ hadoop-hdfs-project ---
[INFO]
[INFO] --- maven-site-plugin:3.4:attach-descriptor (attach-descriptor) @ hadoop-hdfs-project ---
[INFO]
[INFO] --- maven-javadoc-plugin:2.8.1:jar (module-javadocs) @ hadoop-hdfs-project ---
[INFO] Skipping javadoc generation
[INFO]
[INFO] --- maven-enforcer-plugin:1.3.1:enforce (depcheck) @ hadoop-hdfs-project ---
[INFO]
[INFO] --- maven-checkstyle-plugin:2.15:checkstyle (default-cli) @ hadoop-hdfs-project ---
[INFO]
[INFO] --- findbugs-maven-plugin:3.0.0:findbugs (default-cli) @ hadoop-hdfs-project ---
[INFO] ------------------------------------------------------------------------
[INFO] Reactor Summary:
[INFO]
[INFO] Apache Hadoop HDFS Client ......................... SUCCESS [04:09 min]
[INFO] Apache Hadoop HDFS ................................ FAILURE [ 03:15 h]
[INFO] Apache Hadoop HDFS Native Client .................. SKIPPED
[INFO] Apache Hadoop HttpFS .............................. SKIPPED
[INFO] Apache Hadoop HDFS BookKeeper Journal ............. SKIPPED
[INFO] Apache Hadoop HDFS-NFS ............................ SKIPPED
[INFO] Apache Hadoop HDFS Project ........................ SUCCESS [ 0.053 s]
[INFO] ------------------------------------------------------------------------
[INFO] BUILD FAILURE
[INFO] ------------------------------------------------------------------------
[INFO] Total time: 03:19 h
[INFO] Finished at: 2016-01-26T23:18:48+00:00
[INFO] Final Memory: 63M/725M
[INFO] ------------------------------------------------------------------------
[ERROR] Failed to execute goal org.apache.maven.plugins:maven-checkstyle-plugin:2.15:checkstyle (default-cli) on project hadoop-hdfs: An error has occurred in Checkstyle report generation. Failed during checkstyle execution: Unable to find configuration file at location: checkstyle/checkstyle.xml: Could not find resource 'checkstyle/checkstyle.xml'. -> [Help 1]
[ERROR]
[ERROR] To see the full stack trace of the errors, re-run Maven with the -e switch.
[ERROR] Re-run Maven using the -X switch to enable full debug logging.
[ERROR]
[ERROR] For more information about the errors and possible solutions, please read the following articles:
[ERROR] [Help 1] http://cwiki.apache.org/confluence/display/MAVEN/MojoExecutionException
[ERROR]
[ERROR] After correcting the problems, you can resume the build with the command
[ERROR] mvn <goals> -rf :hadoop-hdfs
Build step 'Execute shell' marked build as failure
Archiving artifacts
Recording test results
Hadoop-Hdfs-trunk - Build # 2771 - Still Failing
Posted by Apache Jenkins Server <je...@builds.apache.org>.
See https://builds.apache.org/job/Hadoop-Hdfs-trunk/2771/
###################################################################################
########################## LAST 60 LINES OF THE CONSOLE ###########################
[...truncated 5452 lines...]
[INFO] --- maven-antrun-plugin:1.7:run (create-testdirs) @ hadoop-hdfs-project ---
[INFO] Executing tasks
main:
[mkdir] Created dir: /home/jenkins/jenkins-slave/workspace/Hadoop-Hdfs-trunk/hadoop-hdfs-project/target/test-dir
[INFO] Executed tasks
[INFO]
[INFO] --- maven-source-plugin:2.3:jar-no-fork (hadoop-java-sources) @ hadoop-hdfs-project ---
[INFO]
[INFO] --- maven-source-plugin:2.3:test-jar-no-fork (hadoop-java-sources) @ hadoop-hdfs-project ---
[INFO]
[INFO] --- maven-enforcer-plugin:1.3.1:enforce (dist-enforce) @ hadoop-hdfs-project ---
[INFO]
[INFO] --- maven-site-plugin:3.4:attach-descriptor (attach-descriptor) @ hadoop-hdfs-project ---
[INFO]
[INFO] --- maven-javadoc-plugin:2.8.1:jar (module-javadocs) @ hadoop-hdfs-project ---
[INFO] Skipping javadoc generation
[INFO]
[INFO] --- maven-enforcer-plugin:1.3.1:enforce (depcheck) @ hadoop-hdfs-project ---
[INFO]
[INFO] --- maven-checkstyle-plugin:2.15:checkstyle (default-cli) @ hadoop-hdfs-project ---
[INFO]
[INFO] --- findbugs-maven-plugin:3.0.0:findbugs (default-cli) @ hadoop-hdfs-project ---
[INFO] ------------------------------------------------------------------------
[INFO] Reactor Summary:
[INFO]
[INFO] Apache Hadoop HDFS Client ......................... SUCCESS [04:00 min]
[INFO] Apache Hadoop HDFS ................................ FAILURE [ 03:45 h]
[INFO] Apache Hadoop HDFS Native Client .................. SKIPPED
[INFO] Apache Hadoop HttpFS .............................. SKIPPED
[INFO] Apache Hadoop HDFS BookKeeper Journal ............. SKIPPED
[INFO] Apache Hadoop HDFS-NFS ............................ SKIPPED
[INFO] Apache Hadoop HDFS Project ........................ SUCCESS [ 0.058 s]
[INFO] ------------------------------------------------------------------------
[INFO] BUILD FAILURE
[INFO] ------------------------------------------------------------------------
[INFO] Total time: 03:49 h
[INFO] Finished at: 2016-01-27T05:13:40+00:00
[INFO] Final Memory: 55M/756M
[INFO] ------------------------------------------------------------------------
[ERROR] Failed to execute goal org.apache.maven.plugins:maven-surefire-plugin:2.17:test (default-test) on project hadoop-hdfs: There are test failures.
[ERROR]
[ERROR] Please refer to /home/jenkins/jenkins-slave/workspace/Hadoop-Hdfs-trunk/hadoop-hdfs-project/hadoop-hdfs/target/surefire-reports for the individual test results.
[ERROR] -> [Help 1]
[ERROR]
[ERROR] To see the full stack trace of the errors, re-run Maven with the -e switch.
[ERROR] Re-run Maven using the -X switch to enable full debug logging.
[ERROR]
[ERROR] For more information about the errors and possible solutions, please read the following articles:
[ERROR] [Help 1] http://cwiki.apache.org/confluence/display/MAVEN/MojoFailureException
[ERROR]
[ERROR] After correcting the problems, you can resume the build with the command
[ERROR] mvn <goals> -rf :hadoop-hdfs
Build step 'Execute shell' marked build as failure
Archiving artifacts
Recording test results
Sending e-mails to: hdfs-dev@hadoop.apache.org
Email was triggered for: Failure - Any
Sending email for trigger: Failure - Any
###################################################################################
############################## FAILED TESTS (if any) ##############################
4 tests failed.
FAILED: org.apache.hadoop.hdfs.TestPersistBlocks.TestRestartDfsWithFlush
Error Message:
End of File Exception between local host is: "asf905.gq1.ygridcore.net/67.195.81.149"; destination host is: "localhost":39940; : java.io.EOFException; For more details see: http://wiki.apache.org/hadoop/EOFException
Stack Trace:
java.io.EOFException: End of File Exception between local host is: "asf905.gq1.ygridcore.net/67.195.81.149"; destination host is: "localhost":39940; : java.io.EOFException; For more details see: http://wiki.apache.org/hadoop/EOFException
at sun.reflect.NativeConstructorAccessorImpl.newInstance0(Native Method)
at sun.reflect.NativeConstructorAccessorImpl.newInstance(NativeConstructorAccessorImpl.java:57)
at sun.reflect.DelegatingConstructorAccessorImpl.newInstance(DelegatingConstructorAccessorImpl.java:45)
at java.lang.reflect.Constructor.newInstance(Constructor.java:526)
at org.apache.hadoop.net.NetUtils.wrapWithMessage(NetUtils.java:792)
at org.apache.hadoop.net.NetUtils.wrapException(NetUtils.java:765)
at org.apache.hadoop.ipc.Client.call(Client.java:1453)
at org.apache.hadoop.ipc.Client.call(Client.java:1386)
at org.apache.hadoop.ipc.ProtobufRpcEngine$Invoker.invoke(ProtobufRpcEngine.java:230)
at com.sun.proxy.$Proxy19.addBlock(Unknown Source)
at org.apache.hadoop.hdfs.protocolPB.ClientNamenodeProtocolTranslatorPB.addBlock(ClientNamenodeProtocolTranslatorPB.java:406)
at sun.reflect.GeneratedMethodAccessor12.invoke(Unknown Source)
at sun.reflect.DelegatingMethodAccessorImpl.invoke(DelegatingMethodAccessorImpl.java:43)
at java.lang.reflect.Method.invoke(Method.java:606)
at org.apache.hadoop.io.retry.RetryInvocationHandler.invokeMethod(RetryInvocationHandler.java:255)
at org.apache.hadoop.io.retry.RetryInvocationHandler.invoke(RetryInvocationHandler.java:103)
at com.sun.proxy.$Proxy20.addBlock(Unknown Source)
at org.apache.hadoop.hdfs.DFSOutputStream.addBlock(DFSOutputStream.java:917)
at org.apache.hadoop.hdfs.DataStreamer.locateFollowingBlock(DataStreamer.java:1684)
at org.apache.hadoop.hdfs.DataStreamer.nextBlockOutputStream(DataStreamer.java:1494)
at org.apache.hadoop.hdfs.DataStreamer.run(DataStreamer.java:594)
Caused by: java.io.EOFException: null
at java.io.DataInputStream.readInt(DataInputStream.java:392)
at org.apache.hadoop.ipc.Client$Connection.receiveRpcResponse(Client.java:1111)
at org.apache.hadoop.ipc.Client$Connection.run(Client.java:1006)
FAILED: org.apache.hadoop.hdfs.server.datanode.TestDataNodeRollingUpgrade.testDatanodeRUwithRegularUpgrade
Error Message:
File /testDatanodeRUwithRegularUpgrade.03.dat could only be replicated to 0 nodes instead of minReplication (=1). There are 0 datanode(s) running and no node(s) are excluded in this operation.
at org.apache.hadoop.hdfs.server.blockmanagement.BlockManager.chooseTarget4NewBlock(BlockManager.java:1727)
at org.apache.hadoop.hdfs.server.namenode.FSDirWriteFileOp.chooseTargetForNewBlock(FSDirWriteFileOp.java:298)
at org.apache.hadoop.hdfs.server.namenode.FSNamesystem.getAdditionalBlock(FSNamesystem.java:2408)
at org.apache.hadoop.hdfs.server.namenode.NameNodeRpcServer.addBlock(NameNodeRpcServer.java:812)
at org.apache.hadoop.hdfs.protocolPB.ClientNamenodeProtocolServerSideTranslatorPB.addBlock(ClientNamenodeProtocolServerSideTranslatorPB.java:503)
at org.apache.hadoop.hdfs.protocol.proto.ClientNamenodeProtocolProtos$ClientNamenodeProtocol$2.callBlockingMethod(ClientNamenodeProtocolProtos.java)
at org.apache.hadoop.ipc.ProtobufRpcEngine$Server$ProtoBufRpcInvoker.call(ProtobufRpcEngine.java:637)
at org.apache.hadoop.ipc.RPC$Server.call(RPC.java:989)
at org.apache.hadoop.ipc.Server$Handler$1.run(Server.java:2305)
at org.apache.hadoop.ipc.Server$Handler$1.run(Server.java:2301)
at java.security.AccessController.doPrivileged(Native Method)
at javax.security.auth.Subject.doAs(Subject.java:415)
at org.apache.hadoop.security.UserGroupInformation.doAs(UserGroupInformation.java:1727)
at org.apache.hadoop.ipc.Server$Handler.run(Server.java:2299)
Stack Trace:
org.apache.hadoop.ipc.RemoteException: File /testDatanodeRUwithRegularUpgrade.03.dat could only be replicated to 0 nodes instead of minReplication (=1). There are 0 datanode(s) running and no node(s) are excluded in this operation.
at org.apache.hadoop.hdfs.server.blockmanagement.BlockManager.chooseTarget4NewBlock(BlockManager.java:1727)
at org.apache.hadoop.hdfs.server.namenode.FSDirWriteFileOp.chooseTargetForNewBlock(FSDirWriteFileOp.java:298)
at org.apache.hadoop.hdfs.server.namenode.FSNamesystem.getAdditionalBlock(FSNamesystem.java:2408)
at org.apache.hadoop.hdfs.server.namenode.NameNodeRpcServer.addBlock(NameNodeRpcServer.java:812)
at org.apache.hadoop.hdfs.protocolPB.ClientNamenodeProtocolServerSideTranslatorPB.addBlock(ClientNamenodeProtocolServerSideTranslatorPB.java:503)
at org.apache.hadoop.hdfs.protocol.proto.ClientNamenodeProtocolProtos$ClientNamenodeProtocol$2.callBlockingMethod(ClientNamenodeProtocolProtos.java)
at org.apache.hadoop.ipc.ProtobufRpcEngine$Server$ProtoBufRpcInvoker.call(ProtobufRpcEngine.java:637)
at org.apache.hadoop.ipc.RPC$Server.call(RPC.java:989)
at org.apache.hadoop.ipc.Server$Handler$1.run(Server.java:2305)
at org.apache.hadoop.ipc.Server$Handler$1.run(Server.java:2301)
at java.security.AccessController.doPrivileged(Native Method)
at javax.security.auth.Subject.doAs(Subject.java:415)
at org.apache.hadoop.security.UserGroupInformation.doAs(UserGroupInformation.java:1727)
at org.apache.hadoop.ipc.Server$Handler.run(Server.java:2299)
at org.apache.hadoop.ipc.Client.call(Client.java:1449)
at org.apache.hadoop.ipc.Client.call(Client.java:1386)
at org.apache.hadoop.ipc.ProtobufRpcEngine$Invoker.invoke(ProtobufRpcEngine.java:230)
at com.sun.proxy.$Proxy19.addBlock(Unknown Source)
at org.apache.hadoop.hdfs.protocolPB.ClientNamenodeProtocolTranslatorPB.addBlock(ClientNamenodeProtocolTranslatorPB.java:406)
at sun.reflect.NativeMethodAccessorImpl.invoke0(Native Method)
at sun.reflect.NativeMethodAccessorImpl.invoke(NativeMethodAccessorImpl.java:57)
at sun.reflect.DelegatingMethodAccessorImpl.invoke(DelegatingMethodAccessorImpl.java:43)
at java.lang.reflect.Method.invoke(Method.java:606)
at org.apache.hadoop.io.retry.RetryInvocationHandler.invokeMethod(RetryInvocationHandler.java:255)
at org.apache.hadoop.io.retry.RetryInvocationHandler.invoke(RetryInvocationHandler.java:103)
at com.sun.proxy.$Proxy20.addBlock(Unknown Source)
at org.apache.hadoop.hdfs.DFSOutputStream.addBlock(DFSOutputStream.java:917)
at org.apache.hadoop.hdfs.DataStreamer.locateFollowingBlock(DataStreamer.java:1684)
at org.apache.hadoop.hdfs.DataStreamer.nextBlockOutputStream(DataStreamer.java:1494)
at org.apache.hadoop.hdfs.DataStreamer.run(DataStreamer.java:594)
FAILED: org.apache.hadoop.hdfs.server.datanode.TestDataNodeRollingUpgrade.testWithLayoutChangeAndFinalize
Error Message:
null
Stack Trace:
java.lang.NullPointerException: null
at org.apache.hadoop.hdfs.server.datanode.TestDataNodeRollingUpgrade.testWithLayoutChangeAndFinalize(TestDataNodeRollingUpgrade.java:369)
FAILED: org.apache.hadoop.hdfs.server.datanode.TestDataNodeRollingUpgrade.testWithLayoutChangeAndRollback
Error Message:
null
Stack Trace:
java.lang.NullPointerException: null
at org.apache.hadoop.hdfs.server.datanode.TestDataNodeRollingUpgrade.testWithLayoutChangeAndRollback(TestDataNodeRollingUpgrade.java:430)
Jenkins build is back to normal : Hadoop-Hdfs-trunk #2772
Posted by Apache Jenkins Server <je...@builds.apache.org>.
See <https://builds.apache.org/job/Hadoop-Hdfs-trunk/2772/changes>
Build failed in Jenkins: Hadoop-Hdfs-trunk #2771
Posted by Apache Jenkins Server <je...@builds.apache.org>.
See <https://builds.apache.org/job/Hadoop-Hdfs-trunk/2771/changes>
Changes:
[aw] HADOOP-12743. Fix git environment check during test-patch (aw)
------------------------------------------
[...truncated 5259 lines...]
Running org.apache.hadoop.hdfs.TestDFSUpgradeFromImage
Tests run: 8, Failures: 0, Errors: 0, Skipped: 0, Time elapsed: 16.222 sec - in org.apache.hadoop.hdfs.TestDFSUpgradeFromImage
Running org.apache.hadoop.hdfs.TestEncryptionZonesWithKMS
Tests run: 23, Failures: 0, Errors: 0, Skipped: 0, Time elapsed: 81.099 sec - in org.apache.hadoop.hdfs.TestEncryptionZonesWithKMS
Running org.apache.hadoop.hdfs.TestDecommission
Tests run: 19, Failures: 0, Errors: 0, Skipped: 1, Time elapsed: 196.305 sec - in org.apache.hadoop.hdfs.TestDecommission
Running org.apache.hadoop.hdfs.TestDFSUtil
Tests run: 31, Failures: 0, Errors: 0, Skipped: 0, Time elapsed: 2.664 sec - in org.apache.hadoop.hdfs.TestDFSUtil
Running org.apache.hadoop.hdfs.TestGetBlocks
Tests run: 3, Failures: 0, Errors: 0, Skipped: 0, Time elapsed: 42.917 sec - in org.apache.hadoop.hdfs.TestGetBlocks
Running org.apache.hadoop.hdfs.TestDFSStripedOutputStreamWithFailure060
Tests run: 10, Failures: 0, Errors: 0, Skipped: 0, Time elapsed: 0.313 sec - in org.apache.hadoop.hdfs.TestDFSStripedOutputStreamWithFailure060
Running org.apache.hadoop.hdfs.TestMultiThreadedHflush
Tests run: 3, Failures: 0, Errors: 0, Skipped: 0, Time elapsed: 11.648 sec - in org.apache.hadoop.hdfs.TestMultiThreadedHflush
Running org.apache.hadoop.hdfs.util.TestCyclicIteration
Tests run: 1, Failures: 0, Errors: 0, Skipped: 0, Time elapsed: 0.085 sec - in org.apache.hadoop.hdfs.util.TestCyclicIteration
Running org.apache.hadoop.hdfs.util.TestBestEffortLongFile
Tests run: 2, Failures: 0, Errors: 0, Skipped: 0, Time elapsed: 0.276 sec - in org.apache.hadoop.hdfs.util.TestBestEffortLongFile
Running org.apache.hadoop.hdfs.util.TestDiff
Tests run: 1, Failures: 0, Errors: 0, Skipped: 0, Time elapsed: 3.168 sec - in org.apache.hadoop.hdfs.util.TestDiff
Running org.apache.hadoop.hdfs.util.TestStripedBlockUtil
Tests run: 3, Failures: 0, Errors: 0, Skipped: 0, Time elapsed: 3.968 sec - in org.apache.hadoop.hdfs.util.TestStripedBlockUtil
Running org.apache.hadoop.hdfs.util.TestXMLUtils
Tests run: 6, Failures: 0, Errors: 0, Skipped: 0, Time elapsed: 0.085 sec - in org.apache.hadoop.hdfs.util.TestXMLUtils
Running org.apache.hadoop.hdfs.util.TestLightWeightHashSet
Tests run: 14, Failures: 0, Errors: 0, Skipped: 0, Time elapsed: 0.229 sec - in org.apache.hadoop.hdfs.util.TestLightWeightHashSet
Running org.apache.hadoop.hdfs.util.TestMD5FileUtils
Tests run: 5, Failures: 0, Errors: 0, Skipped: 0, Time elapsed: 0.406 sec - in org.apache.hadoop.hdfs.util.TestMD5FileUtils
Running org.apache.hadoop.hdfs.util.TestLightWeightLinkedSet
Tests run: 17, Failures: 0, Errors: 0, Skipped: 0, Time elapsed: 0.254 sec - in org.apache.hadoop.hdfs.util.TestLightWeightLinkedSet
Running org.apache.hadoop.hdfs.util.TestAtomicFileOutputStream
Tests run: 4, Failures: 0, Errors: 0, Skipped: 1, Time elapsed: 0.339 sec - in org.apache.hadoop.hdfs.util.TestAtomicFileOutputStream
Running org.apache.hadoop.hdfs.TestLease
Tests run: 5, Failures: 0, Errors: 0, Skipped: 0, Time elapsed: 12.019 sec - in org.apache.hadoop.hdfs.TestLease
Running org.apache.hadoop.hdfs.TestInjectionForSimulatedStorage
Tests run: 1, Failures: 0, Errors: 0, Skipped: 0, Time elapsed: 15.819 sec - in org.apache.hadoop.hdfs.TestInjectionForSimulatedStorage
Running org.apache.hadoop.hdfs.TestHFlush
Tests run: 14, Failures: 0, Errors: 0, Skipped: 0, Time elapsed: 42.844 sec - in org.apache.hadoop.hdfs.TestHFlush
Running org.apache.hadoop.hdfs.TestErasureCodingPolicies
Tests run: 9, Failures: 0, Errors: 0, Skipped: 0, Time elapsed: 15.424 sec - in org.apache.hadoop.hdfs.TestErasureCodingPolicies
Running org.apache.hadoop.hdfs.TestRemoteBlockReader
Tests run: 1, Failures: 0, Errors: 0, Skipped: 0, Time elapsed: 5.343 sec - in org.apache.hadoop.hdfs.TestRemoteBlockReader
Running org.apache.hadoop.hdfs.TestHdfsAdmin
Tests run: 2, Failures: 0, Errors: 0, Skipped: 0, Time elapsed: 4.757 sec - in org.apache.hadoop.hdfs.TestHdfsAdmin
Running org.apache.hadoop.hdfs.TestDistributedFileSystem
Tests run: 18, Failures: 0, Errors: 0, Skipped: 0, Time elapsed: 58.994 sec - in org.apache.hadoop.hdfs.TestDistributedFileSystem
Running org.apache.hadoop.hdfs.TestRollingUpgradeRollback
Tests run: 3, Failures: 0, Errors: 0, Skipped: 0, Time elapsed: 12.603 sec - in org.apache.hadoop.hdfs.TestRollingUpgradeRollback
Running org.apache.hadoop.hdfs.TestRollingUpgrade
Tests run: 12, Failures: 0, Errors: 0, Skipped: 0, Time elapsed: 115.943 sec - in org.apache.hadoop.hdfs.TestRollingUpgrade
Running org.apache.hadoop.hdfs.TestDatanodeDeath
Tests run: 4, Failures: 0, Errors: 0, Skipped: 0, Time elapsed: 63.975 sec - in org.apache.hadoop.hdfs.TestDatanodeDeath
Running org.apache.hadoop.hdfs.TestCrcCorruption
Tests run: 4, Failures: 0, Errors: 0, Skipped: 0, Time elapsed: 19.903 sec - in org.apache.hadoop.hdfs.TestCrcCorruption
Running org.apache.hadoop.hdfs.TestFsShellPermission
Tests run: 1, Failures: 0, Errors: 0, Skipped: 0, Time elapsed: 5.677 sec - in org.apache.hadoop.hdfs.TestFsShellPermission
Running org.apache.hadoop.hdfs.protocol.TestLocatedBlock
Tests run: 1, Failures: 0, Errors: 0, Skipped: 0, Time elapsed: 0.271 sec - in org.apache.hadoop.hdfs.protocol.TestLocatedBlock
Running org.apache.hadoop.hdfs.protocol.TestLayoutVersion
Tests run: 11, Failures: 0, Errors: 0, Skipped: 0, Time elapsed: 0.305 sec - in org.apache.hadoop.hdfs.protocol.TestLayoutVersion
Running org.apache.hadoop.hdfs.protocol.datatransfer.sasl.TestSaslDataTransfer
Tests run: 8, Failures: 0, Errors: 0, Skipped: 0, Time elapsed: 35.866 sec - in org.apache.hadoop.hdfs.protocol.datatransfer.sasl.TestSaslDataTransfer
Running org.apache.hadoop.hdfs.protocol.datatransfer.TestPacketReceiver
Tests run: 1, Failures: 0, Errors: 0, Skipped: 0, Time elapsed: 0.444 sec - in org.apache.hadoop.hdfs.protocol.datatransfer.TestPacketReceiver
Running org.apache.hadoop.hdfs.protocol.TestAnnotations
Tests run: 1, Failures: 0, Errors: 0, Skipped: 0, Time elapsed: 0.168 sec - in org.apache.hadoop.hdfs.protocol.TestAnnotations
Running org.apache.hadoop.hdfs.protocol.TestBlockListAsLongs
Tests run: 7, Failures: 0, Errors: 0, Skipped: 0, Time elapsed: 1.047 sec - in org.apache.hadoop.hdfs.protocol.TestBlockListAsLongs
Running org.apache.hadoop.hdfs.TestDFSStripedOutputStreamWithFailure170
Tests run: 10, Failures: 0, Errors: 0, Skipped: 0, Time elapsed: 0.314 sec - in org.apache.hadoop.hdfs.TestDFSStripedOutputStreamWithFailure170
Running org.apache.hadoop.hdfs.TestDFSStripedOutputStreamWithFailure190
Tests run: 10, Failures: 0, Errors: 0, Skipped: 0, Time elapsed: 101.453 sec - in org.apache.hadoop.hdfs.TestDFSStripedOutputStreamWithFailure190
Running org.apache.hadoop.hdfs.TestDFSAddressConfig
Tests run: 1, Failures: 0, Errors: 0, Skipped: 0, Time elapsed: 5.679 sec - in org.apache.hadoop.hdfs.TestDFSAddressConfig
Running org.apache.hadoop.hdfs.TestDFSConfigKeys
Tests run: 1, Failures: 0, Errors: 0, Skipped: 0, Time elapsed: 0.222 sec - in org.apache.hadoop.hdfs.TestDFSConfigKeys
Running org.apache.hadoop.hdfs.TestParallelUnixDomainRead
Tests run: 4, Failures: 0, Errors: 0, Skipped: 0, Time elapsed: 41.369 sec - in org.apache.hadoop.hdfs.TestParallelUnixDomainRead
Running org.apache.hadoop.hdfs.TestDFSStripedOutputStreamWithFailure140
Tests run: 10, Failures: 0, Errors: 0, Skipped: 0, Time elapsed: 0.315 sec - in org.apache.hadoop.hdfs.TestDFSStripedOutputStreamWithFailure140
Running org.apache.hadoop.hdfs.TestDFSStripedOutputStreamWithFailure100
Tests run: 10, Failures: 0, Errors: 0, Skipped: 0, Time elapsed: 0.314 sec - in org.apache.hadoop.hdfs.TestDFSStripedOutputStreamWithFailure100
Running org.apache.hadoop.hdfs.TestReplication
Tests run: 9, Failures: 0, Errors: 0, Skipped: 0, Time elapsed: 55.746 sec - in org.apache.hadoop.hdfs.TestReplication
Running org.apache.hadoop.hdfs.TestRead
Tests run: 3, Failures: 0, Errors: 0, Skipped: 0, Time elapsed: 8.318 sec - in org.apache.hadoop.hdfs.TestRead
Running org.apache.hadoop.hdfs.TestPipelines
Tests run: 1, Failures: 0, Errors: 0, Skipped: 0, Time elapsed: 6.31 sec - in org.apache.hadoop.hdfs.TestPipelines
Running org.apache.hadoop.hdfs.TestDFSStripedOutputStreamWithFailure
Tests run: 4, Failures: 0, Errors: 0, Skipped: 0, Time elapsed: 113.374 sec - in org.apache.hadoop.hdfs.TestDFSStripedOutputStreamWithFailure
Running org.apache.hadoop.hdfs.TestDeprecatedKeys
Tests run: 1, Failures: 0, Errors: 0, Skipped: 0, Time elapsed: 0.655 sec - in org.apache.hadoop.hdfs.TestDeprecatedKeys
Running org.apache.hadoop.hdfs.TestAclsEndToEnd
Tests run: 9, Failures: 0, Errors: 0, Skipped: 0, Time elapsed: 83.841 sec - in org.apache.hadoop.hdfs.TestAclsEndToEnd
Running org.apache.hadoop.hdfs.TestParallelShortCircuitReadNoChecksum
Tests run: 4, Failures: 0, Errors: 0, Skipped: 0, Time elapsed: 15.573 sec - in org.apache.hadoop.hdfs.TestParallelShortCircuitReadNoChecksum
Running org.apache.hadoop.hdfs.TestParallelShortCircuitRead
Tests run: 4, Failures: 0, Errors: 0, Skipped: 0, Time elapsed: 16.649 sec - in org.apache.hadoop.hdfs.TestParallelShortCircuitRead
Running org.apache.hadoop.hdfs.TestHDFSTrash
Tests run: 2, Failures: 0, Errors: 0, Skipped: 0, Time elapsed: 6.354 sec - in org.apache.hadoop.hdfs.TestHDFSTrash
Running org.apache.hadoop.hdfs.TestFileAppend
Tests run: 12, Failures: 0, Errors: 0, Skipped: 0, Time elapsed: 41.381 sec - in org.apache.hadoop.hdfs.TestFileAppend
Running org.apache.hadoop.hdfs.TestDFSRemove
Tests run: 1, Failures: 0, Errors: 0, Skipped: 0, Time elapsed: 16.44 sec - in org.apache.hadoop.hdfs.TestDFSRemove
Running org.apache.hadoop.hdfs.TestErasureCodingPolicyWithSnapshot
Tests run: 4, Failures: 0, Errors: 0, Skipped: 0, Time elapsed: 24.054 sec - in org.apache.hadoop.hdfs.TestErasureCodingPolicyWithSnapshot
Running org.apache.hadoop.hdfs.TestDFSRollback
Tests run: 1, Failures: 0, Errors: 0, Skipped: 0, Time elapsed: 17.903 sec - in org.apache.hadoop.hdfs.TestDFSRollback
Running org.apache.hadoop.hdfs.TestReadWhileWriting
Tests run: 1, Failures: 0, Errors: 0, Skipped: 0, Time elapsed: 8 sec - in org.apache.hadoop.hdfs.TestReadWhileWriting
Running org.apache.hadoop.hdfs.TestConnCache
Tests run: 1, Failures: 0, Errors: 0, Skipped: 0, Time elapsed: 5.038 sec - in org.apache.hadoop.hdfs.TestConnCache
Running org.apache.hadoop.hdfs.TestPersistBlocks
Tests run: 5, Failures: 0, Errors: 1, Skipped: 0, Time elapsed: 29.684 sec <<< FAILURE! - in org.apache.hadoop.hdfs.TestPersistBlocks
TestRestartDfsWithFlush(org.apache.hadoop.hdfs.TestPersistBlocks) Time elapsed: 4.737 sec <<< ERROR!
java.io.EOFException: End of File Exception between local host is: "asf905.gq1.ygridcore.net/67.195.81.149"; destination host is: "localhost":39940; : java.io.EOFException; For more details see: http://wiki.apache.org/hadoop/EOFException
at sun.reflect.NativeConstructorAccessorImpl.newInstance0(Native Method)
at sun.reflect.NativeConstructorAccessorImpl.newInstance(NativeConstructorAccessorImpl.java:57)
at sun.reflect.DelegatingConstructorAccessorImpl.newInstance(DelegatingConstructorAccessorImpl.java:45)
at java.lang.reflect.Constructor.newInstance(Constructor.java:526)
at org.apache.hadoop.net.NetUtils.wrapWithMessage(NetUtils.java:792)
at org.apache.hadoop.net.NetUtils.wrapException(NetUtils.java:765)
at org.apache.hadoop.ipc.Client.call(Client.java:1453)
at org.apache.hadoop.ipc.Client.call(Client.java:1386)
at org.apache.hadoop.ipc.ProtobufRpcEngine$Invoker.invoke(ProtobufRpcEngine.java:230)
at com.sun.proxy.$Proxy19.addBlock(Unknown Source)
at org.apache.hadoop.hdfs.protocolPB.ClientNamenodeProtocolTranslatorPB.addBlock(ClientNamenodeProtocolTranslatorPB.java:406)
at sun.reflect.GeneratedMethodAccessor12.invoke(Unknown Source)
at sun.reflect.DelegatingMethodAccessorImpl.invoke(DelegatingMethodAccessorImpl.java:43)
at java.lang.reflect.Method.invoke(Method.java:606)
at org.apache.hadoop.io.retry.RetryInvocationHandler.invokeMethod(RetryInvocationHandler.java:255)
at org.apache.hadoop.io.retry.RetryInvocationHandler.invoke(RetryInvocationHandler.java:103)
at com.sun.proxy.$Proxy20.addBlock(Unknown Source)
at org.apache.hadoop.hdfs.DFSOutputStream.addBlock(DFSOutputStream.java:917)
at org.apache.hadoop.hdfs.DataStreamer.locateFollowingBlock(DataStreamer.java:1684)
at org.apache.hadoop.hdfs.DataStreamer.nextBlockOutputStream(DataStreamer.java:1494)
at org.apache.hadoop.hdfs.DataStreamer.run(DataStreamer.java:594)
Caused by: java.io.EOFException: null
at java.io.DataInputStream.readInt(DataInputStream.java:392)
at org.apache.hadoop.ipc.Client$Connection.receiveRpcResponse(Client.java:1111)
at org.apache.hadoop.ipc.Client$Connection.run(Client.java:1006)
Running org.apache.hadoop.hdfs.TestSetrepDecreasing
Tests run: 1, Failures: 0, Errors: 0, Skipped: 0, Time elapsed: 17.449 sec - in org.apache.hadoop.hdfs.TestSetrepDecreasing
Running org.apache.hadoop.hdfs.TestDatanodeLayoutUpgrade
Tests run: 1, Failures: 0, Errors: 0, Skipped: 0, Time elapsed: 6.5 sec - in org.apache.hadoop.hdfs.TestDatanodeLayoutUpgrade
Running org.apache.hadoop.hdfs.TestFileCorruption
Tests run: 3, Failures: 0, Errors: 0, Skipped: 0, Time elapsed: 9.928 sec - in org.apache.hadoop.hdfs.TestFileCorruption
Running org.apache.hadoop.hdfs.TestDFSStartupVersions
Tests run: 1, Failures: 0, Errors: 0, Skipped: 0, Time elapsed: 14 sec - in org.apache.hadoop.hdfs.TestDFSStartupVersions
Running org.apache.hadoop.hdfs.TestWriteConfigurationToDFS
Tests run: 1, Failures: 0, Errors: 0, Skipped: 0, Time elapsed: 6.574 sec - in org.apache.hadoop.hdfs.TestWriteConfigurationToDFS
Running org.apache.hadoop.hdfs.TestListFilesInDFS
Tests run: 2, Failures: 0, Errors: 0, Skipped: 0, Time elapsed: 5.498 sec - in org.apache.hadoop.hdfs.TestListFilesInDFS
Results :
Tests in error:
TestDataNodeRollingUpgrade.testDatanodeRUwithRegularUpgrade » Remote File /tes...
TestDataNodeRollingUpgrade.testWithLayoutChangeAndFinalize:369 NullPointer
TestDataNodeRollingUpgrade.testWithLayoutChangeAndRollback:430 NullPointer
TestPersistBlocks.TestRestartDfsWithFlush » EOF End of File Exception between ...
Tests run: 4146, Failures: 0, Errors: 4, Skipped: 17
[INFO]
[INFO] ------------------------------------------------------------------------
[INFO] Skipping Apache Hadoop HDFS Native Client
[INFO] This project has been banned from the build due to previous failures.
[INFO] ------------------------------------------------------------------------
[INFO]
[INFO] ------------------------------------------------------------------------
[INFO] Skipping Apache Hadoop HttpFS
[INFO] This project has been banned from the build due to previous failures.
[INFO] ------------------------------------------------------------------------
[INFO]
[INFO] ------------------------------------------------------------------------
[INFO] Skipping Apache Hadoop HDFS BookKeeper Journal
[INFO] This project has been banned from the build due to previous failures.
[INFO] ------------------------------------------------------------------------
[INFO]
[INFO] ------------------------------------------------------------------------
[INFO] Skipping Apache Hadoop HDFS-NFS
[INFO] This project has been banned from the build due to previous failures.
[INFO] ------------------------------------------------------------------------
[INFO]
[INFO] ------------------------------------------------------------------------
[INFO] Building Apache Hadoop HDFS Project 3.0.0-SNAPSHOT
[INFO] ------------------------------------------------------------------------
[INFO]
[INFO] --- maven-clean-plugin:2.5:clean (default-clean) @ hadoop-hdfs-project ---
[INFO] Deleting <https://builds.apache.org/job/Hadoop-Hdfs-trunk/ws/hadoop-hdfs-project/target>
[INFO]
[INFO] --- maven-antrun-plugin:1.7:run (create-testdirs) @ hadoop-hdfs-project ---
[INFO] Executing tasks
main:
[mkdir] Created dir: <https://builds.apache.org/job/Hadoop-Hdfs-trunk/ws/hadoop-hdfs-project/target/test-dir>
[INFO] Executed tasks
[INFO]
[INFO] --- maven-source-plugin:2.3:jar-no-fork (hadoop-java-sources) @ hadoop-hdfs-project ---
[INFO]
[INFO] --- maven-source-plugin:2.3:test-jar-no-fork (hadoop-java-sources) @ hadoop-hdfs-project ---
[INFO]
[INFO] --- maven-enforcer-plugin:1.3.1:enforce (dist-enforce) @ hadoop-hdfs-project ---
[INFO]
[INFO] --- maven-site-plugin:3.4:attach-descriptor (attach-descriptor) @ hadoop-hdfs-project ---
[INFO]
[INFO] --- maven-javadoc-plugin:2.8.1:jar (module-javadocs) @ hadoop-hdfs-project ---
[INFO] Skipping javadoc generation
[INFO]
[INFO] --- maven-enforcer-plugin:1.3.1:enforce (depcheck) @ hadoop-hdfs-project ---
[INFO]
[INFO] --- maven-checkstyle-plugin:2.15:checkstyle (default-cli) @ hadoop-hdfs-project ---
[INFO]
[INFO] --- findbugs-maven-plugin:3.0.0:findbugs (default-cli) @ hadoop-hdfs-project ---
[INFO] ------------------------------------------------------------------------
[INFO] Reactor Summary:
[INFO]
[INFO] Apache Hadoop HDFS Client ......................... SUCCESS [04:00 min]
[INFO] Apache Hadoop HDFS ................................ FAILURE [ 03:45 h]
[INFO] Apache Hadoop HDFS Native Client .................. SKIPPED
[INFO] Apache Hadoop HttpFS .............................. SKIPPED
[INFO] Apache Hadoop HDFS BookKeeper Journal ............. SKIPPED
[INFO] Apache Hadoop HDFS-NFS ............................ SKIPPED
[INFO] Apache Hadoop HDFS Project ........................ SUCCESS [ 0.058 s]
[INFO] ------------------------------------------------------------------------
[INFO] BUILD FAILURE
[INFO] ------------------------------------------------------------------------
[INFO] Total time: 03:49 h
[INFO] Finished at: 2016-01-27T05:13:40+00:00
[INFO] Final Memory: 55M/756M
[INFO] ------------------------------------------------------------------------
[ERROR] Failed to execute goal org.apache.maven.plugins:maven-surefire-plugin:2.17:test (default-test) on project hadoop-hdfs: There are test failures.
[ERROR]
[ERROR] Please refer to <https://builds.apache.org/job/Hadoop-Hdfs-trunk/ws/hadoop-hdfs-project/hadoop-hdfs/target/surefire-reports> for the individual test results.
[ERROR] -> [Help 1]
[ERROR]
[ERROR] To see the full stack trace of the errors, re-run Maven with the -e switch.
[ERROR] Re-run Maven using the -X switch to enable full debug logging.
[ERROR]
[ERROR] For more information about the errors and possible solutions, please read the following articles:
[ERROR] [Help 1] http://cwiki.apache.org/confluence/display/MAVEN/MojoFailureException
[ERROR]
[ERROR] After correcting the problems, you can resume the build with the command
[ERROR] mvn <goals> -rf :hadoop-hdfs
Build step 'Execute shell' marked build as failure
Archiving artifacts
Recording test results