You are viewing a plain text version of this content. The canonical link for it is here.
Posted to notifications@maven.apache.org by Apache Jenkins Server <je...@builds.apache.org> on 2017/12/14 03:46:24 UTC

Build failed in Jenkins: Maven TLP » maven-doxia-sitetools » master #7

See https://builds.apache.org/job/maven-box/job/maven-doxia-sitetools/job/master/7/

Changes:

* [DOXIASITETOOLS-183] add RenderingContext.isEditable()
* [DOXIASITETOOLS-183] add RenderingContext.isEditable()
* [DOXIASITETOOLS-183] add RenderingContext.isEditable()
* [DOXIASITETOOLS-183] add RenderingContext.isEditable()
* [DOXIASITETOOLS-183] add RenderingContext.isEditable()
* [DOXIASITETOOLS-183] add RenderingContext.isEditable()

All tests passed

Build log:
[...truncated 1.02 MB...]
[windows-jdk8] [INFO] Changes detected - recompiling the module!
[windows-jdk8] [INFO] Compiling 15 source files to F:\jenkins\jenkins-slave\workspace\aven-doxia-sitetools_master-IEJNSNBOTHLVP7BGSL5GY25SPJJHIFGR3FSD4C6F3I2V26ZMEPWQ\m\doxia-site-renderer\target\test-classes
[Pipeline] [linux-jdk7] }
[linux-jdk7] [withMaven] artifactsPublisher - Archive artifact m/pom.xml under org/apache/maven/doxia/doxia-sitetools/1.8-SNAPSHOT/doxia-sitetools-1.8-SNAPSHOT.pom
[linux-jdk7] [withMaven] artifactsPublisher - Archive artifact m/doxia-decoration-model/pom.xml under org/apache/maven/doxia/doxia-decoration-model/1.8-SNAPSHOT/doxia-decoration-model-1.8-SNAPSHOT.pom
[linux-jdk7] [withMaven] artifactsPublisher - Archive artifact m/doxia-decoration-model/target/doxia-decoration-model-1.8-SNAPSHOT.jar under org/apache/maven/doxia/doxia-decoration-model/1.8-SNAPSHOT/doxia-decoration-model-1.8-SNAPSHOT.jar
[linux-jdk7] [withMaven] artifactsPublisher - Archive artifact m/doxia-skin-model/pom.xml under org/apache/maven/doxia/doxia-skin-model/1.8-SNAPSHOT/doxia-skin-model-1.8-SNAPSHOT.pom
[linux-jdk7] [withMaven] artifactsPublisher - Archive artifact m/doxia-skin-model/target/doxia-skin-model-1.8-SNAPSHOT.jar under org/apache/maven/doxia/doxia-skin-model/1.8-SNAPSHOT/doxia-skin-model-1.8-SNAPSHOT.jar
[linux-jdk7] [withMaven] artifactsPublisher - Archive artifact m/doxia-integration-tools/pom.xml under org/apache/maven/doxia/doxia-integration-tools/1.8-SNAPSHOT/doxia-integration-tools-1.8-SNAPSHOT.pom
[linux-jdk7] [withMaven] artifactsPublisher - Archive artifact m/doxia-integration-tools/target/doxia-integration-tools-1.8-SNAPSHOT.jar under org/apache/maven/doxia/doxia-integration-tools/1.8-SNAPSHOT/doxia-integration-tools-1.8-SNAPSHOT.jar
[linux-jdk7] [withMaven] artifactsPublisher - Archive artifact m/target/doxia-sitetools-1.8-SNAPSHOT-site.xml under org/apache/maven/doxia/doxia-sitetools/1.8-SNAPSHOT/doxia-sitetools-1.8-SNAPSHOT-site.xml
[linux-jdk7] [withMaven] junitPublisher - Archive test results for Maven artifact org.apache.maven.doxia:doxia-decoration-model:1.8-SNAPSHOT generated by maven-surefire-plugin:test (default-test): m/doxia-decoration-model/target/surefire-reports/*.xml
[linux-jdk7] [withMaven] junitPublisher - Jenkins JUnit Attachments Plugin not found, can't publish test attachments.Recording test results
[linux-jdk7] [withMaven] junitPublisher - Archive test results for Maven artifact org.apache.maven.doxia:doxia-skin-model:1.8-SNAPSHOT generated by maven-surefire-plugin:test (default-test): m/doxia-skin-model/target/surefire-reports/*.xml
[linux-jdk7] [withMaven] junitPublisher - Jenkins JUnit Attachments Plugin not found, can't publish test attachments.Recording test results
[linux-jdk7] None of the test reports contained any result
[linux-jdk7] [withMaven] junitPublisher - Archive test results for Maven artifact org.apache.maven.doxia:doxia-integration-tools:1.8-SNAPSHOT generated by maven-surefire-plugin:test (default-test): m/doxia-integration-tools/target/surefire-reports/*.xml
[linux-jdk7] [withMaven] junitPublisher - Jenkins JUnit Attachments Plugin not found, can't publish test attachments.Recording test results
[linux-jdk7] [withMaven] junitPublisher - Archive test results for Maven artifact org.apache.maven.doxia:doxia-site-renderer:1.8-SNAPSHOT generated by maven-surefire-plugin:test (default-test): m/doxia-site-renderer/target/surefire-reports/*.xml
[linux-jdk7] [withMaven] junitPublisher - Jenkins JUnit Attachments Plugin not found, can't publish test attachments.Recording test results
[linux-jdk7] [withMaven] openTasksPublisher - Scan Tasks for Maven artifact org.apache.maven.doxia:doxia-decoration-model:1.8-SNAPSHOT in source directory m/doxia-decoration-model/src/main/java
[linux-jdk7] [withMaven] openTasksPublisher - Scan Tasks for Maven artifact org.apache.maven.doxia:doxia-integration-tools:1.8-SNAPSHOT in source directory m/doxia-integration-tools/src/main/java
[linux-jdk7] [withMaven] openTasksPublisher - Scan Tasks for Maven artifact org.apache.maven.doxia:doxia-site-renderer:1.8-SNAPSHOT in source directory m/doxia-site-renderer/src/main/java
[linux-jdk7] [TASKS] Scanning folder '/home/jenkins/jenkins-slave/workspace/aven-doxia-sitetools_master-IEJNSNBOTHLVP7BGSL5GY25SPJJHIFGR3FSD4C6F3I2V26ZMEPWQ' for files matching the pattern 'm/doxia-decoration-model/src/main/java/**/*,m/doxia-integration-tools/src/main/java/**/*,m/doxia-site-renderer/src/main/java/**/*' - excludes: null
[linux-jdk7] [TASKS] Found 22 files to scan for tasks
[linux-jdk7] [TASKS] Found 9 open tasks.
[linux-jdk7] Skipping warnings blame since pipelines do not have an SCM link.%n
[linux-jdk7] [TASKS] Computing warning deltas based on reference build #6
[Pipeline] [linux-jdk7] // withMaven
[Pipeline] [windows-jdk7] }
[Pipeline] [linux-jdk7] }
[Pipeline] [linux-jdk9] }
[Pipeline] [linux-jdk8] }
[Pipeline] [windows-jdk7] // dir
[Pipeline] [linux-jdk7] // stage
[Pipeline] [linux-jdk9] // dir
[Pipeline] [linux-jdk8] // dir
[windows-jdk9] [INFO] /F:/jenkins/jenkins-slave/workspace/aven-doxia-sitetools_master-IEJNSNBOTHLVP7BGSL5GY25SPJJHIFGR3FSD4C6F3I2V26ZMEPWQ@2/m/doxia-site-renderer/src/test/java/org/apache/maven/doxia/siterenderer/RenderingContextTest.java: Some input files use or override a deprecated API.
[windows-jdk9] [INFO] /F:/jenkins/jenkins-slave/workspace/aven-doxia-sitetools_master-IEJNSNBOTHLVP7BGSL5GY25SPJJHIFGR3FSD4C6F3I2V26ZMEPWQ@2/m/doxia-site-renderer/src/test/java/org/apache/maven/doxia/siterenderer/RenderingContextTest.java: Recompile with -Xlint:deprecation for details.
[windows-jdk9] [INFO] 
[windows-jdk9] [INFO] --- maven-surefire-plugin:2.19.1:test (default-test) @ doxia-site-renderer ---
[windows-jdk9] 
[windows-jdk9] -------------------------------------------------------
[windows-jdk9]  T E S T S
[windows-jdk9] -------------------------------------------------------
[windows-jdk8] [INFO] /F:/jenkins/jenkins-slave/workspace/aven-doxia-sitetools_master-IEJNSNBOTHLVP7BGSL5GY25SPJJHIFGR3FSD4C6F3I2V26ZMEPWQ/m/doxia-site-renderer/src/test/java/org/apache/maven/doxia/siterenderer/SkinResourceLoaderTest.java: Some input files use or override a deprecated API.
[windows-jdk8] [INFO] /F:/jenkins/jenkins-slave/workspace/aven-doxia-sitetools_master-IEJNSNBOTHLVP7BGSL5GY25SPJJHIFGR3FSD4C6F3I2V26ZMEPWQ/m/doxia-site-renderer/src/test/java/org/apache/maven/doxia/siterenderer/SkinResourceLoaderTest.java: Recompile with -Xlint:deprecation for details.
[windows-jdk8] [INFO] 
[windows-jdk8] [INFO] --- maven-surefire-plugin:2.19.1:test (default-test) @ doxia-site-renderer ---
[windows-jdk8] 
[windows-jdk8] -------------------------------------------------------
[windows-jdk8]  T E S T S
[windows-jdk8] -------------------------------------------------------
[windows-jdk9] Picked up JAVA_TOOL_OPTIONS: -Dmaven.ext.class.path="f:\jenkins\jenkins-slave\workspace\aven-doxia-sitetools_master-IEJNSNBOTHLVP7BGSL5GY25SPJJHIFGR3FSD4C6F3I2V26ZMEPWQ@2@tmp\withMavend26d9d58\pipeline-maven-spy.jar" -Dorg.jenkinsci.plugins.pipeline.maven.reportsFolder="f:\jenkins\jenkins-slave\workspace\aven-doxia-sitetools_master-IEJNSNBOTHLVP7BGSL5GY25SPJJHIFGR3FSD4C6F3I2V26ZMEPWQ@2@tmp\withMavend26d9d58" 
[windows-jdk9] Running org.apache.maven.doxia.siterenderer.DefaultSiteRendererTest
[windows-jdk8] Running org.apache.maven.doxia.siterenderer.DefaultSiteRendererTest
[windows-jdk9] [WARNING] [APT Parser] Ambiguous link: 'cdc.html'. If this is a local link, prepend "./"!
[windows-jdk9] [WARNING] Could not parse date 'May 2008' from apt.apt (expected yyyy-MM-dd format), ignoring!
[windows-jdk9] [WARNING] Could not parse date '25th May 2005' from cdc.apt (expected yyyy-MM-dd format), ignoring!
[windows-jdk9] [WARNING] [XHTML Sink] No HTML tag found for unknown event: 'note', ignoring!
[windows-jdk9] [WARNING] [XHTML Sink] No HTML tag found for unknown event: 'sidebar', ignoring!
[windows-jdk9] [WARNING] Could not parse date '30 Nov 1996' from sdocbook_full.xml (expected yyyy-MM-dd format), ignoring!
[windows-jdk8] [WARNING] [APT Parser] Ambiguous link: 'cdc.html'. If this is a local link, prepend "./"!
[windows-jdk8] [WARNING] Could not parse date 'May 2008' from apt.apt (expected yyyy-MM-dd format), ignoring!
[windows-jdk8] [WARNING] Could not parse date '25th May 2005' from cdc.apt (expected yyyy-MM-dd format), ignoring!
[windows-jdk8] [WARNING] [XHTML Sink] No HTML tag found for unknown event: 'note', ignoring!
[windows-jdk8] [WARNING] [XHTML Sink] No HTML tag found for unknown event: 'sidebar', ignoring!
[windows-jdk8] [WARNING] Could not parse date '30 Nov 1996' from sdocbook_full.xml (expected yyyy-MM-dd format), ignoring!
[windows-jdk9] Dec 14, 2017 3:46:17 AM com.gargoylesoftware.htmlunit.javascript.host.Stylesheet loadStylesheet
[windows-jdk9] SEVERE: F:\jenkins\jenkins-slave\workspace\aven-doxia-sitetools_master-IEJNSNBOTHLVP7BGSL5GY25SPJJHIFGR3FSD4C6F3I2V26ZMEPWQ@2\m\doxia-site-renderer\target\output\css\maven-base.css (The system cannot find the path specified)
[windows-jdk9] Dec 14, 2017 3:46:17 AM com.gargoylesoftware.htmlunit.javascript.host.Stylesheet loadStylesheet
[windows-jdk9] SEVERE: F:\jenkins\jenkins-slave\workspace\aven-doxia-sitetools_master-IEJNSNBOTHLVP7BGSL5GY25SPJJHIFGR3FSD4C6F3I2V26ZMEPWQ@2\m\doxia-site-renderer\target\output\css\maven-theme.css (The system cannot find the path specified)
[windows-jdk9] Dec 14, 2017 3:46:17 AM com.gargoylesoftware.htmlunit.javascript.host.Stylesheet loadStylesheet
[windows-jdk9] SEVERE: F:\jenkins\jenkins-slave\workspace\aven-doxia-sitetools_master-IEJNSNBOTHLVP7BGSL5GY25SPJJHIFGR3FSD4C6F3I2V26ZMEPWQ@2\m\doxia-site-renderer\target\output\css\site.css (The system cannot find the path specified)
[windows-jdk9] Dec 14, 2017 3:46:17 AM com.gargoylesoftware.htmlunit.javascript.host.Stylesheet loadStylesheet
[windows-jdk9] SEVERE: F:\jenkins\jenkins-slave\workspace\aven-doxia-sitetools_master-IEJNSNBOTHLVP7BGSL5GY25SPJJHIFGR3FSD4C6F3I2V26ZMEPWQ@2\m\doxia-site-renderer\target\output\css\print.css (The system cannot find the path specified)
[windows-jdk9] Dec 14, 2017 3:46:17 AM com.gargoylesoftware.htmlunit.javascript.host.Stylesheet loadStylesheet
[windows-jdk9] SEVERE: F:\jenkins\jenkins-slave\workspace\aven-doxia-sitetools_master-IEJNSNBOTHLVP7BGSL5GY25SPJJHIFGR3FSD4C6F3I2V26ZMEPWQ@2\m\doxia-site-renderer\target\output\css\maven-base.css (The system cannot find the path specified)
[windows-jdk9] Dec 14, 2017 3:46:17 AM com.gargoylesoftware.htmlunit.javascript.host.Stylesheet loadStylesheet
[windows-jdk9] SEVERE: F:\jenkins\jenkins-slave\workspace\aven-doxia-sitetools_master-IEJNSNBOTHLVP7BGSL5GY25SPJJHIFGR3FSD4C6F3I2V26ZMEPWQ@2\m\doxia-site-renderer\target\output\css\maven-theme.css (The system cannot find the path specified)
[windows-jdk9] Dec 14, 2017 3:46:17 AM com.gargoylesoftware.htmlunit.javascript.host.Stylesheet loadStylesheet
[windows-jdk9] SEVERE: F:\jenkins\jenkins-slave\workspace\aven-doxia-sitetools_master-IEJNSNBOTHLVP7BGSL5GY25SPJJHIFGR3FSD4C6F3I2V26ZMEPWQ@2\m\doxia-site-renderer\target\output\css\site.css (The system cannot find the path specified)
[windows-jdk9] Dec 14, 2017 3:46:17 AM com.gargoylesoftware.htmlunit.javascript.host.Stylesheet loadStylesheet
[windows-jdk9] SEVERE: F:\jenkins\jenkins-slave\workspace\aven-doxia-sitetools_master-IEJNSNBOTHLVP7BGSL5GY25SPJJHIFGR3FSD4C6F3I2V26ZMEPWQ@2\m\doxia-site-renderer\target\output\css\print.css (The system cannot find the path specified)
[windows-jdk9] Dec 14, 2017 3:46:17 AM com.gargoylesoftware.htmlunit.javascript.host.Stylesheet loadStylesheet
[windows-jdk9] SEVERE: F:\jenkins\jenkins-slave\workspace\aven-doxia-sitetools_master-IEJNSNBOTHLVP7BGSL5GY25SPJJHIFGR3FSD4C6F3I2V26ZMEPWQ@2\m\doxia-site-renderer\target\output\css\maven-base.css (The system cannot find the path specified)
[windows-jdk9] Dec 14, 2017 3:46:17 AM com.gargoylesoftware.htmlunit.javascript.host.Stylesheet loadStylesheet
[windows-jdk9] SEVERE: F:\jenkins\jenkins-slave\workspace\aven-doxia-sitetools_master-IEJNSNBOTHLVP7BGSL5GY25SPJJHIFGR3FSD4C6F3I2V26ZMEPWQ@2\m\doxia-site-renderer\target\output\css\maven-theme.css (The system cannot find the path specified)
[windows-jdk9] Dec 14, 2017 3:46:17 AM com.gargoylesoftware.htmlunit.javascript.host.Stylesheet loadStylesheet
[windows-jdk9] SEVERE: F:\jenkins\jenkins-slave\workspace\aven-doxia-sitetools_master-IEJNSNBOTHLVP7BGSL5GY25SPJJHIFGR3FSD4C6F3I2V26ZMEPWQ@2\m\doxia-site-renderer\target\output\css\site.css (The system cannot find the path specified)
[windows-jdk9] Dec 14, 2017 3:46:17 AM com.gargoylesoftware.htmlunit.javascript.host.Stylesheet loadStylesheet
[windows-jdk9] SEVERE: F:\jenkins\jenkins-slave\workspace\aven-doxia-sitetools_master-IEJNSNBOTHLVP7BGSL5GY25SPJJHIFGR3FSD4C6F3I2V26ZMEPWQ@2\m\doxia-site-renderer\target\output\css\print.css (The system cannot find the path specified)
[windows-jdk9] Dec 14, 2017 3:46:17 AM com.gargoylesoftware.htmlunit.javascript.host.Stylesheet loadStylesheet
[windows-jdk9] SEVERE: F:\jenkins\jenkins-slave\workspace\aven-doxia-sitetools_master-IEJNSNBOTHLVP7BGSL5GY25SPJJHIFGR3FSD4C6F3I2V26ZMEPWQ@2\m\doxia-site-renderer\target\output\css\maven-base.css (The system cannot find the path specified)
[windows-jdk9] Dec 14, 2017 3:46:17 AM com.gargoylesoftware.htmlunit.javascript.host.Stylesheet loadStylesheet
[windows-jdk9] SEVERE: F:\jenkins\jenkins-slave\workspace\aven-doxia-sitetools_master-IEJNSNBOTHLVP7BGSL5GY25SPJJHIFGR3FSD4C6F3I2V26ZMEPWQ@2\m\doxia-site-renderer\target\output\css\maven-theme.css (The system cannot find the path specified)
[windows-jdk9] Dec 14, 2017 3:46:17 AM com.gargoylesoftware.htmlunit.javascript.host.Stylesheet loadStylesheet
[windows-jdk9] SEVERE: F:\jenkins\jenkins-slave\workspace\aven-doxia-sitetools_master-IEJNSNBOTHLVP7BGSL5GY25SPJJHIFGR3FSD4C6F3I2V26ZMEPWQ@2\m\doxia-site-renderer\target\output\css\site.css (The system cannot find the path specified)
[windows-jdk9] Dec 14, 2017 3:46:17 AM com.gargoylesoftware.htmlunit.javascript.host.Stylesheet loadStylesheet
[windows-jdk9] SEVERE: F:\jenkins\jenkins-slave\workspace\aven-doxia-sitetools_master-IEJNSNBOTHLVP7BGSL5GY25SPJJHIFGR3FSD4C6F3I2V26ZMEPWQ@2\m\doxia-site-renderer\target\output\css\print.css (The system cannot find the path specified)
[windows-jdk9] Dec 14, 2017 3:46:17 AM com.gargoylesoftware.htmlunit.javascript.host.Stylesheet loadStylesheet
[windows-jdk9] SEVERE: F:\jenkins\jenkins-slave\workspace\aven-doxia-sitetools_master-IEJNSNBOTHLVP7BGSL5GY25SPJJHIFGR3FSD4C6F3I2V26ZMEPWQ@2\m\doxia-site-renderer\target\output\css\maven-base.css (The system cannot find the path specified)
[windows-jdk9] Dec 14, 2017 3:46:17 AM com.gargoylesoftware.htmlunit.javascript.host.Stylesheet loadStylesheet
[windows-jdk9] SEVERE: F:\jenkins\jenkins-slave\workspace\aven-doxia-sitetools_master-IEJNSNBOTHLVP7BGSL5GY25SPJJHIFGR3FSD4C6F3I2V26ZMEPWQ@2\m\doxia-site-renderer\target\output\css\maven-theme.css (The system cannot find the path specified)
[windows-jdk9] Dec 14, 2017 3:46:17 AM com.gargoylesoftware.htmlunit.javascript.host.Stylesheet loadStylesheet
[windows-jdk9] SEVERE: F:\jenkins\jenkins-slave\workspace\aven-doxia-sitetools_master-IEJNSNBOTHLVP7BGSL5GY25SPJJHIFGR3FSD4C6F3I2V26ZMEPWQ@2\m\doxia-site-renderer\target\output\css\site.css (The system cannot find the path specified)
[windows-jdk9] Dec 14, 2017 3:46:17 AM com.gargoylesoftware.htmlunit.javascript.host.Stylesheet loadStylesheet
[windows-jdk9] SEVERE: F:\jenkins\jenkins-slave\workspace\aven-doxia-sitetools_master-IEJNSNBOTHLVP7BGSL5GY25SPJJHIFGR3FSD4C6F3I2V26ZMEPWQ@2\m\doxia-site-renderer\target\output\css\print.css (The system cannot find the path specified)
[windows-jdk9] Dec 14, 2017 3:46:18 AM com.gargoylesoftware.htmlunit.javascript.host.Stylesheet loadStylesheet
[windows-jdk9] SEVERE: F:\jenkins\jenkins-slave\workspace\aven-doxia-sitetools_master-IEJNSNBOTHLVP7BGSL5GY25SPJJHIFGR3FSD4C6F3I2V26ZMEPWQ@2\m\doxia-site-renderer\target\output\css\maven-base.css (The system cannot find the path specified)
[windows-jdk9] Dec 14, 2017 3:46:18 AM com.gargoylesoftware.htmlunit.javascript.host.Stylesheet loadStylesheet
[windows-jdk9] SEVERE: F:\jenkins\jenkins-slave\workspace\aven-doxia-sitetools_master-IEJNSNBOTHLVP7BGSL5GY25SPJJHIFGR3FSD4C6F3I2V26ZMEPWQ@2\m\doxia-site-renderer\target\output\css\maven-theme.css (The system cannot find the path specified)
[windows-jdk9] Dec 14, 2017 3:46:18 AM com.gargoylesoftware.htmlunit.javascript.host.Stylesheet loadStylesheet
[windows-jdk9] SEVERE: F:\jenkins\jenkins-slave\workspace\aven-doxia-sitetools_master-IEJNSNBOTHLVP7BGSL5GY25SPJJHIFGR3FSD4C6F3I2V26ZMEPWQ@2\m\doxia-site-renderer\target\output\css\site.css (The system cannot find the path specified)
[windows-jdk9] Dec 14, 2017 3:46:18 AM com.gargoylesoftware.htmlunit.javascript.host.Stylesheet loadStylesheet
[windows-jdk9] SEVERE: F:\jenkins\jenkins-slave\workspace\aven-doxia-sitetools_master-IEJNSNBOTHLVP7BGSL5GY25SPJJHIFGR3FSD4C6F3I2V26ZMEPWQ@2\m\doxia-site-renderer\target\output\css\print.css (The system cannot find the path specified)
[windows-jdk9] Dec 14, 2017 3:46:18 AM com.gargoylesoftware.htmlunit.javascript.host.Stylesheet loadStylesheet
[windows-jdk9] SEVERE: F:\jenkins\jenkins-slave\workspace\aven-doxia-sitetools_master-IEJNSNBOTHLVP7BGSL5GY25SPJJHIFGR3FSD4C6F3I2V26ZMEPWQ@2\m\doxia-site-renderer\target\output\css\maven-base.css (The system cannot find the path specified)
[windows-jdk9] Dec 14, 2017 3:46:18 AM com.gargoylesoftware.htmlunit.javascript.host.Stylesheet loadStylesheet
[windows-jdk9] SEVERE: F:\jenkins\jenkins-slave\workspace\aven-doxia-sitetools_master-IEJNSNBOTHLVP7BGSL5GY25SPJJHIFGR3FSD4C6F3I2V26ZMEPWQ@2\m\doxia-site-renderer\target\output\css\maven-theme.css (The system cannot find the path specified)
[windows-jdk9] Dec 14, 2017 3:46:18 AM com.gargoylesoftware.htmlunit.javascript.host.Stylesheet loadStylesheet
[windows-jdk9] SEVERE: F:\jenkins\jenkins-slave\workspace\aven-doxia-sitetools_master-IEJNSNBOTHLVP7BGSL5GY25SPJJHIFGR3FSD4C6F3I2V26ZMEPWQ@2\m\doxia-site-renderer\target\output\css\site.css (The system cannot find the path specified)
[windows-jdk9] Dec 14, 2017 3:46:18 AM com.gargoylesoftware.htmlunit.javascript.host.Stylesheet loadStylesheet
[windows-jdk9] SEVERE: F:\jenkins\jenkins-slave\workspace\aven-doxia-sitetools_master-IEJNSNBOTHLVP7BGSL5GY25SPJJHIFGR3FSD4C6F3I2V26ZMEPWQ@2\m\doxia-site-renderer\target\output\css\print.css (The system cannot find the path specified)
[Pipeline] [linux-jdk7] }
[Pipeline] [windows-jdk7] }
[windows-jdk7] [withMaven] Skip 'Generated Artifacts Publisher' disabled by configuration
[windows-jdk7] [withMaven] junitPublisher - Archive test results for Maven artifact org.apache.maven.doxia:doxia-decoration-model:1.8-SNAPSHOT generated by maven-surefire-plugin:test (default-test): m\doxia-decoration-model\target\surefire-reports\*.xml
[windows-jdk7] [withMaven] junitPublisher - Jenkins JUnit Attachments Plugin not found, can't publish test attachments.Recording test results
[windows-jdk7] [withMaven] junitPublisher - Archive test results for Maven artifact org.apache.maven.doxia:doxia-skin-model:1.8-SNAPSHOT generated by maven-surefire-plugin:test (default-test): m\doxia-skin-model\target\surefire-reports\*.xml
[windows-jdk7] [withMaven] junitPublisher - Jenkins JUnit Attachments Plugin not found, can't publish test attachments.Recording test results
[windows-jdk7] None of the test reports contained any result
[windows-jdk7] [withMaven] junitPublisher - Archive test results for Maven artifact org.apache.maven.doxia:doxia-integration-tools:1.8-SNAPSHOT generated by maven-surefire-plugin:test (default-test): m\doxia-integration-tools\target\surefire-reports\*.xml
[windows-jdk7] [withMaven] junitPublisher - Jenkins JUnit Attachments Plugin not found, can't publish test attachments.Recording test results
[windows-jdk7] [withMaven] junitPublisher - Archive test results for Maven artifact org.apache.maven.doxia:doxia-site-renderer:1.8-SNAPSHOT generated by maven-surefire-plugin:test (default-test): m\doxia-site-renderer\target\surefire-reports\*.xml
[windows-jdk7] [withMaven] junitPublisher - Jenkins JUnit Attachments Plugin not found, can't publish test attachments.Recording test results
[windows-jdk7] [withMaven] Skip 'Findbugs Publisher' disabled by configuration
[windows-jdk7] [withMaven] Skip 'Open Task Scanner Publisher' disabled by configuration
[Pipeline] [linux-jdk9] }
[linux-jdk9] [withMaven] Skip 'Generated Artifacts Publisher' disabled by configuration
[linux-jdk9] [withMaven] junitPublisher - Archive test results for Maven artifact org.apache.maven.doxia:doxia-decoration-model:1.8-SNAPSHOT generated by maven-surefire-plugin:test (default-test): m/doxia-decoration-model/target/surefire-reports/*.xml
[linux-jdk9] [withMaven] junitPublisher - Jenkins JUnit Attachments Plugin not found, can't publish test attachments.Recording test results
[linux-jdk9] [withMaven] junitPublisher - Archive test results for Maven artifact org.apache.maven.doxia:doxia-skin-model:1.8-SNAPSHOT generated by maven-surefire-plugin:test (default-test): m/doxia-skin-model/target/surefire-reports/*.xml
[linux-jdk9] [withMaven] junitPublisher - Jenkins JUnit Attachments Plugin not found, can't publish test attachments.Recording test results
[linux-jdk9] None of the test reports contained any result
[linux-jdk9] [withMaven] junitPublisher - Archive test results for Maven artifact org.apache.maven.doxia:doxia-integration-tools:1.8-SNAPSHOT generated by maven-surefire-plugin:test (default-test): m/doxia-integration-tools/target/surefire-reports/*.xml
[linux-jdk9] [withMaven] junitPublisher - Jenkins JUnit Attachments Plugin not found, can't publish test attachments.Recording test results
[linux-jdk9] [withMaven] junitPublisher - Archive test results for Maven artifact org.apache.maven.doxia:doxia-site-renderer:1.8-SNAPSHOT generated by maven-surefire-plugin:test (default-test): m/doxia-site-renderer/target/surefire-reports/*.xml
[linux-jdk9] [withMaven] junitPublisher - Jenkins JUnit Attachments Plugin not found, can't publish test attachments.Recording test results
[linux-jdk9] [withMaven] Skip 'Findbugs Publisher' disabled by configuration
[linux-jdk9] [withMaven] Skip 'Open Task Scanner Publisher' disabled by configuration
[Pipeline] [linux-jdk8] }
[linux-jdk8] [withMaven] Skip 'Generated Artifacts Publisher' disabled by configuration
[linux-jdk8] [withMaven] junitPublisher - Archive test results for Maven artifact org.apache.maven.doxia:doxia-decoration-model:1.8-SNAPSHOT generated by maven-surefire-plugin:test (default-test): m/doxia-decoration-model/target/surefire-reports/*.xml
[linux-jdk8] [withMaven] junitPublisher - Jenkins JUnit Attachments Plugin not found, can't publish test attachments.Recording test results
[linux-jdk8] [withMaven] junitPublisher - Archive test results for Maven artifact org.apache.maven.doxia:doxia-skin-model:1.8-SNAPSHOT generated by maven-surefire-plugin:test (default-test): m/doxia-skin-model/target/surefire-reports/*.xml
[linux-jdk8] [withMaven] junitPublisher - Jenkins JUnit Attachments Plugin not found, can't publish test attachments.Recording test results
[linux-jdk8] None of the test reports contained any result
[linux-jdk8] [withMaven] junitPublisher - Archive test results for Maven artifact org.apache.maven.doxia:doxia-integration-tools:1.8-SNAPSHOT generated by maven-surefire-plugin:test (default-test): m/doxia-integration-tools/target/surefire-reports/*.xml
[linux-jdk8] [withMaven] junitPublisher - Jenkins JUnit Attachments Plugin not found, can't publish test attachments.Recording test results
[linux-jdk8] [withMaven] junitPublisher - Archive test results for Maven artifact org.apache.maven.doxia:doxia-site-renderer:1.8-SNAPSHOT generated by maven-surefire-plugin:test (default-test): m/doxia-site-renderer/target/surefire-reports/*.xml
[linux-jdk8] [withMaven] junitPublisher - Jenkins JUnit Attachments Plugin not found, can't publish test attachments.Recording test results
[linux-jdk8] [withMaven] Skip 'Findbugs Publisher' disabled by configuration
[linux-jdk8] [withMaven] Skip 'Open Task Scanner Publisher' disabled by configuration
[Pipeline] [linux-jdk7] // node
[Pipeline] [windows-jdk7] // withMaven
[Pipeline] [linux-jdk9] // withMaven
[Pipeline] [linux-jdk8] // withMaven
[Pipeline] [linux-jdk7] }
[linux-jdk7] Failed in branch linux-jdk7
[Pipeline] [windows-jdk7] }
[Pipeline] [linux-jdk9] }
[Pipeline] [linux-jdk8] }
[windows-jdk8] Sending interrupt signal to process
[windows-jdk9] WARNING: An illegal reflective access operation has occurred
[windows-jdk9] WARNING: Illegal reflective access by org.mockito.cglib.core.ReflectUtils$2 (file:/f:/jenkins/jenkins-slave/workspace/aven-doxia-sitetools_master-IEJNSNBOTHLVP7BGSL5GY25SPJJHIFGR3FSD4C6F3I2V26ZMEPWQ%402/.repository/org/mockito/mockito-core/1.10.19/mockito-core-1.10.19.jar) to method java.lang.ClassLoader.defineClass(java.lang.String,byte[],int,int,java.security.ProtectionDomain)
[windows-jdk9] WARNING: Please consider reporting this to the maintainers of org.mockito.cglib.core.ReflectUtils$2
[windows-jdk9] WARNING: Use --illegal-access=warn to enable warnings of further illegal reflective access operations
[windows-jdk9] WARNING: All illegal access operations will be denied in a future release
[windows-jdk9] Tests run: 6, Failures: 0, Errors: 0, Skipped: 0, Time elapsed: 8.944 sec - in org.apache.maven.doxia.siterenderer.DefaultSiteRendererTest
[windows-jdk9] Running org.apache.maven.doxia.siterenderer.RenderingContextTest
[windows-jdk9] Tests run: 1, Failures: 0, Errors: 0, Skipped: 0, Time elapsed: 0.085 sec - in org.apache.maven.doxia.siterenderer.RenderingContextTest
[windows-jdk9] Running org.apache.maven.doxia.siterenderer.SkinResourceLoaderTest
[windows-jdk9] Tests run: 1, Failures: 0, Errors: 0, Skipped: 0, Time elapsed: 0 sec - in org.apache.maven.doxia.siterenderer.SkinResourceLoaderTest
[windows-jdk9] Sending interrupt signal to process
[windows-jdk8] 
[windows-jdk8] Results :
[windows-jdk8] 
[windows-jdk8] Tests run: 0, Failures: 0, Errors: 0, Skipped: 0
[windows-jdk8] 
[windows-jdk8] [INFO] ------------------------------------------------------------------------
[windows-jdk8] [INFO] Reactor Summary:
[windows-jdk8] [INFO] 
[windows-jdk8] [INFO] Doxia Sitetools .................................... SUCCESS [ 11.490 s]
[windows-jdk8] [INFO] Doxia Sitetools :: Decoration Model ................ SUCCESS [ 15.141 s]
[windows-jdk8] [INFO] Doxia Sitetools :: Skin Model ...................... SUCCESS [  2.634 s]
[windows-jdk8] [INFO] Doxia Sitetools :: Integration Tools ............... SUCCESS [ 10.479 s]
[windows-jdk8] [INFO] Doxia Sitetools :: Site Renderer ................... FAILURE [ 16.376 s]
[windows-jdk8] [INFO] Doxia Sitetools :: Document Renderer ............... SKIPPED
[windows-jdk8] [INFO] ------------------------------------------------------------------------
[windows-jdk8] [INFO] BUILD FAILURE
[windows-jdk8] [INFO] ------------------------------------------------------------------------
[windows-jdk8] [INFO] Total time: 56.829 s
[windows-jdk8] [INFO] Finished at: 2017-12-14T03:46:19Z
[Pipeline] [windows-jdk7] // stage
[Pipeline] [linux-jdk9] // stage
[Pipeline] [linux-jdk8] // stage
[Pipeline] [linux-jdk8] }
[Pipeline] [linux-jdk9] }
[Pipeline] [windows-jdk7] }
[Pipeline] [windows-jdk8] }
[Pipeline] [windows-jdk9] }
[Pipeline] [linux-jdk8] // node
[Pipeline] [linux-jdk9] // node
[Pipeline] [windows-jdk7] // node
[Pipeline] [windows-jdk8] // dir
[Pipeline] [windows-jdk9] // dir
[Pipeline] [linux-jdk8] }
[linux-jdk8] Failed in branch linux-jdk8
[Pipeline] [linux-jdk9] }
[linux-jdk9] Failed in branch linux-jdk9
[Pipeline] [windows-jdk7] }
[windows-jdk7] Failed in branch windows-jdk7
[Pipeline] [windows-jdk8] }
[windows-jdk8] [withMaven] One or multiple Maven executions have been ignored by the Jenkins Pipeline Maven Plugin because they have been interrupted before completion (1). See Pipeline Maven Plugin FAQ for more details.
[Pipeline] [windows-jdk9] }
[windows-jdk9] [withMaven] One or multiple Maven executions have been ignored by the Jenkins Pipeline Maven Plugin because they have been interrupted before completion (1). See Pipeline Maven Plugin FAQ for more details.
[Pipeline] [windows-jdk8] // withMaven
[Pipeline] [windows-jdk9] // withMaven
[Pipeline] [windows-jdk8] }
[Pipeline] [windows-jdk9] }
[Pipeline] [windows-jdk8] // stage
[Pipeline] [windows-jdk9] // stage
[Pipeline] [windows-jdk8] }
[Pipeline] [windows-jdk9] }
[Pipeline] [windows-jdk8] // node
[Pipeline] [windows-jdk9] // node
[Pipeline] [windows-jdk8] }
[windows-jdk8] Failed in branch windows-jdk8
[Pipeline] [windows-jdk9] }
[windows-jdk9] Failed in branch windows-jdk9
[Pipeline] // parallel
[Pipeline] stage
[Pipeline] { (Notifications)
[Pipeline] echo
Build result: FAILURE
[Pipeline] jiraIssueSelector
[Pipeline] jiraComment
[Pipeline] emailext

Build succeeded in Jenkins: Maven TLP » maven-doxia-sitetools » master #8

Posted by Apache Jenkins Server <je...@builds.apache.org>.
See https://builds.apache.org/job/maven-box/job/maven-doxia-sitetools/job/master/8/

Changes:

* fixed typo
* fixed typo
* fixed typo
* fixed typo
* fixed typo

All tests passed