You are viewing a plain text version of this content. The canonical link for it is here.
Posted to dev@kafka.apache.org by Apache Jenkins Server <je...@builds.apache.org> on 2019/06/11 21:17:23 UTC

Build failed in Jenkins: kafka-2.1-jdk8 #205

See <https://builds.apache.org/job/kafka-2.1-jdk8/205/display/redirect?page=changes>

Changes:

[cmccabe] KAFKA-4893; Fix deletion and moving of topics with long names

------------------------------------------
[...truncated 2.54 MB...]

org.apache.kafka.streams.test.OutputVerifierTest > shouldFailIfValueIsDifferentWithNullReversForCompareKeyValueWithProducerRecord PASSED

org.apache.kafka.streams.test.OutputVerifierTest > shouldPassIfKeyAndValueAndTimestampIsEqualForCompareKeyValueTimestamp STARTED

org.apache.kafka.streams.test.OutputVerifierTest > shouldPassIfKeyAndValueAndTimestampIsEqualForCompareKeyValueTimestamp PASSED

org.apache.kafka.streams.test.OutputVerifierTest > shouldFailIfValueIsDifferentWithNullForCompareKeyValueTimestampWithProducerRecord STARTED

org.apache.kafka.streams.test.OutputVerifierTest > shouldFailIfValueIsDifferentWithNullForCompareKeyValueTimestampWithProducerRecord PASSED

org.apache.kafka.streams.test.OutputVerifierTest > shouldFailIfKeyIsDifferentWithNullReversForCompareKeyValueWithProducerRecord STARTED

org.apache.kafka.streams.test.OutputVerifierTest > shouldFailIfKeyIsDifferentWithNullReversForCompareKeyValueWithProducerRecord PASSED

org.apache.kafka.streams.test.OutputVerifierTest > shouldPassIfKeyAndValueIsEqualWithNullForCompareKeyValueWithProducerRecord STARTED

org.apache.kafka.streams.test.OutputVerifierTest > shouldPassIfKeyAndValueIsEqualWithNullForCompareKeyValueWithProducerRecord PASSED

org.apache.kafka.streams.test.OutputVerifierTest > shouldFailIfKeyIsDifferentWithNullForCompareKeyValueTimestampWithProducerRecord STARTED

org.apache.kafka.streams.test.OutputVerifierTest > shouldFailIfKeyIsDifferentWithNullForCompareKeyValueTimestampWithProducerRecord PASSED

org.apache.kafka.streams.test.OutputVerifierTest > shouldFailIfValueIsDifferentForCompareKeyValueTimestamp STARTED

org.apache.kafka.streams.test.OutputVerifierTest > shouldFailIfValueIsDifferentForCompareKeyValueTimestamp PASSED

org.apache.kafka.streams.test.OutputVerifierTest > shouldPassIfValueAndTimestampIsEqualForCompareValueTimestampWithProducerRecord STARTED

org.apache.kafka.streams.test.OutputVerifierTest > shouldPassIfValueAndTimestampIsEqualForCompareValueTimestampWithProducerRecord PASSED

org.apache.kafka.streams.test.OutputVerifierTest > shouldFailIfValueIsDifferentWithNullReversForCompareKeyValueTimestamp STARTED

org.apache.kafka.streams.test.OutputVerifierTest > shouldFailIfValueIsDifferentWithNullReversForCompareKeyValueTimestamp PASSED

org.apache.kafka.streams.test.OutputVerifierTest > shouldFailIfValueIsDifferentWithNullReverseForCompareValueTimestampWithProducerRecord STARTED

org.apache.kafka.streams.test.OutputVerifierTest > shouldFailIfValueIsDifferentWithNullReverseForCompareValueTimestampWithProducerRecord PASSED

> Task :log4j-appender:test

org.apache.kafka.log4jappender.KafkaLog4jAppenderTest > testLog4jAppendsWithSyncSendWithoutIgnoringExceptionsShouldNotThrowException STARTED

org.apache.kafka.log4jappender.KafkaLog4jAppenderTest > testLog4jAppendsWithSyncSendWithoutIgnoringExceptionsShouldNotThrowException PASSED

org.apache.kafka.log4jappender.KafkaLog4jAppenderTest > testLog4jAppendsWithRealProducerConfigWithSyncSendAndNotIgnoringExceptionsShouldThrowException STARTED

org.apache.kafka.log4jappender.KafkaLog4jAppenderTest > testLog4jAppendsWithRealProducerConfigWithSyncSendAndNotIgnoringExceptionsShouldThrowException PASSED

org.apache.kafka.log4jappender.KafkaLog4jAppenderTest > testLog4jAppends STARTED

org.apache.kafka.log4jappender.KafkaLog4jAppenderTest > testLog4jAppends PASSED

org.apache.kafka.log4jappender.KafkaLog4jAppenderTest > testKafkaLog4jConfigs STARTED

org.apache.kafka.log4jappender.KafkaLog4jAppenderTest > testKafkaLog4jConfigs PASSED

org.apache.kafka.log4jappender.KafkaLog4jAppenderTest > testLog4jAppendsWithSyncSendAndSimulateProducerFailShouldThrowException STARTED

org.apache.kafka.log4jappender.KafkaLog4jAppenderTest > testLog4jAppendsWithSyncSendAndSimulateProducerFailShouldThrowException PASSED

org.apache.kafka.log4jappender.KafkaLog4jAppenderTest > testLog4jAppendsWithRealProducerConfigWithSyncSendShouldNotThrowException STARTED

org.apache.kafka.log4jappender.KafkaLog4jAppenderTest > testLog4jAppendsWithRealProducerConfigWithSyncSendShouldNotThrowException PASSED
log4j: Finalizing appender named [KAFKA].
log4j: Finalizing appender named [KAFKA].

> Task :streams:streams-scala:test

org.apache.kafka.streams.scala.WordCountTest > testShouldCountWordsMaterialized STARTED

org.apache.kafka.streams.scala.WordCountTest > testShouldCountWordsMaterialized PASSED

org.apache.kafka.streams.scala.WordCountTest > testShouldCountWordsJava STARTED

org.apache.kafka.streams.scala.WordCountTest > testShouldCountWordsJava PASSED

org.apache.kafka.streams.scala.WordCountTest > testShouldCountWords STARTED

org.apache.kafka.streams.scala.WordCountTest > testShouldCountWords PASSED

org.apache.kafka.streams.scala.kstream.ProducedTest > Create a Produced should create a Produced with Serdes STARTED

org.apache.kafka.streams.scala.kstream.ProducedTest > Create a Produced should create a Produced with Serdes PASSED

org.apache.kafka.streams.scala.kstream.ProducedTest > Create a Produced with timestampExtractor and resetPolicy should create a Consumed with Serdes, timestampExtractor and resetPolicy STARTED

org.apache.kafka.streams.scala.kstream.ProducedTest > Create a Produced with timestampExtractor and resetPolicy should create a Consumed with Serdes, timestampExtractor and resetPolicy PASSED

org.apache.kafka.streams.scala.kstream.GroupedTest > Create a Grouped should create a Grouped with Serdes STARTED

org.apache.kafka.streams.scala.kstream.GroupedTest > Create a Grouped should create a Grouped with Serdes PASSED

org.apache.kafka.streams.scala.kstream.GroupedTest > Create a Grouped with repartition topic name should create a Grouped with Serdes, and repartition topic name STARTED

org.apache.kafka.streams.scala.kstream.GroupedTest > Create a Grouped with repartition topic name should create a Grouped with Serdes, and repartition topic name PASSED

org.apache.kafka.streams.scala.kstream.JoinedTest > Create a Joined should create a Joined with Serdes STARTED

org.apache.kafka.streams.scala.kstream.JoinedTest > Create a Joined should create a Joined with Serdes PASSED

org.apache.kafka.streams.scala.kstream.JoinedTest > Create a Joined should create a Joined with Serdes and repartition topic name STARTED

org.apache.kafka.streams.scala.kstream.JoinedTest > Create a Joined should create a Joined with Serdes and repartition topic name PASSED

org.apache.kafka.streams.scala.kstream.MaterializedTest > Create a Materialized should create a Materialized with Serdes STARTED

org.apache.kafka.streams.scala.kstream.MaterializedTest > Create a Materialized should create a Materialized with Serdes PASSED

org.apache.kafka.streams.scala.kstream.MaterializedTest > Create a Materialize with a store name should create a Materialized with Serdes and a store name STARTED

org.apache.kafka.streams.scala.kstream.MaterializedTest > Create a Materialize with a store name should create a Materialized with Serdes and a store name PASSED

org.apache.kafka.streams.scala.kstream.MaterializedTest > Create a Materialize with a window store supplier should create a Materialized with Serdes and a store supplier STARTED

org.apache.kafka.streams.scala.kstream.MaterializedTest > Create a Materialize with a window store supplier should create a Materialized with Serdes and a store supplier PASSED

org.apache.kafka.streams.scala.kstream.MaterializedTest > Create a Materialize with a key value store supplier should create a Materialized with Serdes and a store supplier STARTED

org.apache.kafka.streams.scala.kstream.MaterializedTest > Create a Materialize with a key value store supplier should create a Materialized with Serdes and a store supplier PASSED

org.apache.kafka.streams.scala.kstream.MaterializedTest > Create a Materialize with a session store supplier should create a Materialized with Serdes and a store supplier STARTED

org.apache.kafka.streams.scala.kstream.MaterializedTest > Create a Materialize with a session store supplier should create a Materialized with Serdes and a store supplier PASSED

org.apache.kafka.streams.scala.kstream.KTableTest > filter a KTable should filter records satisfying the predicate STARTED

org.apache.kafka.streams.scala.kstream.KTableTest > filter a KTable should filter records satisfying the predicate PASSED

org.apache.kafka.streams.scala.kstream.KTableTest > filterNot a KTable should filter records not satisfying the predicate STARTED

org.apache.kafka.streams.scala.kstream.KTableTest > filterNot a KTable should filter records not satisfying the predicate PASSED

org.apache.kafka.streams.scala.kstream.KTableTest > join 2 KTables should join correctly records STARTED

org.apache.kafka.streams.scala.kstream.KTableTest > join 2 KTables should join correctly records PASSED

org.apache.kafka.streams.scala.kstream.KTableTest > join 2 KTables with a Materialized should join correctly records and state store STARTED

org.apache.kafka.streams.scala.kstream.KTableTest > join 2 KTables with a Materialized should join correctly records and state store PASSED

org.apache.kafka.streams.scala.kstream.KStreamTest > filter a KStream should filter records satisfying the predicate STARTED

org.apache.kafka.streams.scala.kstream.KStreamTest > filter a KStream should filter records satisfying the predicate PASSED

org.apache.kafka.streams.scala.kstream.KStreamTest > filterNot a KStream should filter records not satisfying the predicate STARTED

org.apache.kafka.streams.scala.kstream.KStreamTest > filterNot a KStream should filter records not satisfying the predicate PASSED

org.apache.kafka.streams.scala.kstream.KStreamTest > foreach a KStream should run foreach actions on records STARTED

org.apache.kafka.streams.scala.kstream.KStreamTest > foreach a KStream should run foreach actions on records PASSED

org.apache.kafka.streams.scala.kstream.KStreamTest > peek a KStream should run peek actions on records STARTED

org.apache.kafka.streams.scala.kstream.KStreamTest > peek a KStream should run peek actions on records PASSED

org.apache.kafka.streams.scala.kstream.KStreamTest > selectKey a KStream should select a new key STARTED

org.apache.kafka.streams.scala.kstream.KStreamTest > selectKey a KStream should select a new key PASSED

org.apache.kafka.streams.scala.kstream.KStreamTest > join 2 KStreams should join correctly records STARTED

org.apache.kafka.streams.scala.kstream.KStreamTest > join 2 KStreams should join correctly records PASSED

org.apache.kafka.streams.scala.kstream.ConsumedTest > Create a Consumed should create a Consumed with Serdes STARTED

org.apache.kafka.streams.scala.kstream.ConsumedTest > Create a Consumed should create a Consumed with Serdes PASSED

org.apache.kafka.streams.scala.kstream.ConsumedTest > Create a Consumed with timestampExtractor and resetPolicy should create a Consumed with Serdes, timestampExtractor and resetPolicy STARTED

org.apache.kafka.streams.scala.kstream.ConsumedTest > Create a Consumed with timestampExtractor and resetPolicy should create a Consumed with Serdes, timestampExtractor and resetPolicy PASSED

org.apache.kafka.streams.scala.kstream.ConsumedTest > Create a Consumed with timestampExtractor should create a Consumed with Serdes and timestampExtractor STARTED

org.apache.kafka.streams.scala.kstream.ConsumedTest > Create a Consumed with timestampExtractor should create a Consumed with Serdes and timestampExtractor PASSED

org.apache.kafka.streams.scala.kstream.ConsumedTest > Create a Consumed with resetPolicy should create a Consumed with Serdes and resetPolicy STARTED

org.apache.kafka.streams.scala.kstream.ConsumedTest > Create a Consumed with resetPolicy should create a Consumed with Serdes and resetPolicy PASSED

org.apache.kafka.streams.scala.TopologyTest > shouldBuildIdenticalTopologyInJavaNScalaJoin STARTED

org.apache.kafka.streams.scala.TopologyTest > shouldBuildIdenticalTopologyInJavaNScalaJoin PASSED

org.apache.kafka.streams.scala.TopologyTest > shouldBuildIdenticalTopologyInJavaNScalaSimple STARTED

org.apache.kafka.streams.scala.TopologyTest > shouldBuildIdenticalTopologyInJavaNScalaSimple PASSED

org.apache.kafka.streams.scala.TopologyTest > shouldBuildIdenticalTopologyInJavaNScalaAggregate STARTED

org.apache.kafka.streams.scala.TopologyTest > shouldBuildIdenticalTopologyInJavaNScalaAggregate PASSED

org.apache.kafka.streams.scala.TopologyTest > shouldBuildIdenticalTopologyInJavaNScalaProperties STARTED

org.apache.kafka.streams.scala.TopologyTest > shouldBuildIdenticalTopologyInJavaNScalaProperties PASSED

org.apache.kafka.streams.scala.TopologyTest > shouldBuildIdenticalTopologyInJavaNScalaTransform STARTED

org.apache.kafka.streams.scala.TopologyTest > shouldBuildIdenticalTopologyInJavaNScalaTransform PASSED

org.apache.kafka.streams.scala.StreamToTableJoinScalaIntegrationTestImplicitSerdes > testShouldCountClicksPerRegionWithNamedRepartitionTopic STARTED

org.apache.kafka.streams.scala.StreamToTableJoinScalaIntegrationTestImplicitSerdes > testShouldCountClicksPerRegionWithNamedRepartitionTopic PASSED

org.apache.kafka.streams.scala.StreamToTableJoinScalaIntegrationTestImplicitSerdes > testShouldCountClicksPerRegionJava STARTED

org.apache.kafka.streams.scala.StreamToTableJoinScalaIntegrationTestImplicitSerdes > testShouldCountClicksPerRegionJava PASSED

org.apache.kafka.streams.scala.StreamToTableJoinScalaIntegrationTestImplicitSerdes > testShouldCountClicksPerRegion STARTED

org.apache.kafka.streams.scala.StreamToTableJoinScalaIntegrationTestImplicitSerdes > testShouldCountClicksPerRegion PASSED

> Task :streams:examples:test

org.apache.kafka.streams.examples.wordcount.WordCountProcessorTest > test STARTED

org.apache.kafka.streams.examples.wordcount.WordCountProcessorTest > test PASSED

> Task :testScala_2_11 FAILED

FAILURE: Build failed with an exception.

* What went wrong:
Execution failed for task ':kafka-2.1-jdk8:core:spotbugsMain'.
> A failure occurred while executing com.github.spotbugs.internal.spotbugs.SpotBugsRunner
   > SpotBugs rule violations were found. See the report at: file://<https://builds.apache.org/job/kafka-2.1-jdk8/ws/core/build/reports/spotbugs/main.xml>

* Try:
Run with --stacktrace option to get the stack trace. Run with --info or --debug option to get more log output. Run with --scan to get full insights.

* Get more help at https://help.gradle.org

BUILD FAILED in 3h 2m 15s
133 actionable tasks: 91 executed, 42 up-to-date
Build step 'Execute shell' marked build as failure
[FINDBUGS] Collecting findbugs analysis files...
Setting GRADLE_4_8_1_HOME=/home/jenkins/tools/gradle/4.8.1
[FINDBUGS] Searching for all files in <https://builds.apache.org/job/kafka-2.1-jdk8/ws/> that match the pattern **/build/reports/findbugs/*.xml
[FINDBUGS] No files found. Configuration error?
Setting GRADLE_4_8_1_HOME=/home/jenkins/tools/gradle/4.8.1
No credentials specified
Setting GRADLE_4_8_1_HOME=/home/jenkins/tools/gradle/4.8.1
<Git Blamer> Using GitBlamer to create author and commit information for all warnings.
<Git Blamer> GIT_COMMIT=e832dd013e92455365603bbcdeebb17602ce67df, workspace=<https://builds.apache.org/job/kafka-2.1-jdk8/ws/>
[FINDBUGS] Computing warning deltas based on reference build #204
Recording test results
Setting GRADLE_4_8_1_HOME=/home/jenkins/tools/gradle/4.8.1
Setting GRADLE_4_8_1_HOME=/home/jenkins/tools/gradle/4.8.1

Jenkins build is back to normal : kafka-2.1-jdk8 #206

Posted by Apache Jenkins Server <je...@builds.apache.org>.
See <https://builds.apache.org/job/kafka-2.1-jdk8/206/display/redirect?page=changes>