You are viewing a plain text version of this content. The canonical link for it is here.
Posted to dev@kafka.apache.org by Apache Jenkins Server <je...@builds.apache.org> on 2016/07/26 03:38:55 UTC
Build failed in Jenkins: kafka-trunk-jdk8 #775
See <https://builds.apache.org/job/kafka-trunk-jdk8/775/changes>
Changes:
[ismael] KAFKA-3933; Always fully read deepIterator
[ismael] KAFKA-3935; Fix test_restart_failed_task system test for SinkTasks
[ismael] MINOR: cleanup apache license in python files
------------------------------------------
[...truncated 6782 lines...]
kafka.message.ByteBufferMessageSetTest > testValidBytes PASSED
kafka.message.ByteBufferMessageSetTest > testValidBytesWithCompression STARTED
kafka.message.ByteBufferMessageSetTest > testValidBytesWithCompression PASSED
kafka.message.ByteBufferMessageSetTest > testOffsetAssignmentAfterMessageFormatConversion STARTED
kafka.message.ByteBufferMessageSetTest > testOffsetAssignmentAfterMessageFormatConversion PASSED
kafka.message.ByteBufferMessageSetTest > testIteratorIsConsistent STARTED
kafka.message.ByteBufferMessageSetTest > testIteratorIsConsistent PASSED
kafka.message.ByteBufferMessageSetTest > testAbsoluteOffsetAssignment STARTED
kafka.message.ByteBufferMessageSetTest > testAbsoluteOffsetAssignment PASSED
kafka.message.ByteBufferMessageSetTest > testCreateTime STARTED
kafka.message.ByteBufferMessageSetTest > testCreateTime PASSED
kafka.message.ByteBufferMessageSetTest > testInvalidCreateTime STARTED
kafka.message.ByteBufferMessageSetTest > testInvalidCreateTime PASSED
kafka.message.ByteBufferMessageSetTest > testWrittenEqualsRead STARTED
kafka.message.ByteBufferMessageSetTest > testWrittenEqualsRead PASSED
kafka.message.ByteBufferMessageSetTest > testLogAppendTime STARTED
kafka.message.ByteBufferMessageSetTest > testLogAppendTime PASSED
kafka.message.ByteBufferMessageSetTest > testWriteTo STARTED
kafka.message.ByteBufferMessageSetTest > testWriteTo PASSED
kafka.message.ByteBufferMessageSetTest > testEquals STARTED
kafka.message.ByteBufferMessageSetTest > testEquals PASSED
kafka.message.ByteBufferMessageSetTest > testSizeInBytes STARTED
kafka.message.ByteBufferMessageSetTest > testSizeInBytes PASSED
kafka.message.ByteBufferMessageSetTest > testIterator STARTED
kafka.message.ByteBufferMessageSetTest > testIterator PASSED
kafka.message.ByteBufferMessageSetTest > testRelativeOffsetAssignment STARTED
kafka.message.ByteBufferMessageSetTest > testRelativeOffsetAssignment PASSED
kafka.tools.ConsoleConsumerTest > shouldLimitReadsToMaxMessageLimit STARTED
kafka.tools.ConsoleConsumerTest > shouldLimitReadsToMaxMessageLimit PASSED
kafka.tools.ConsoleConsumerTest > shouldParseValidNewConsumerValidConfig STARTED
kafka.tools.ConsoleConsumerTest > shouldParseValidNewConsumerValidConfig PASSED
kafka.tools.ConsoleConsumerTest > shouldStopWhenOutputCheckErrorFails STARTED
kafka.tools.ConsoleConsumerTest > shouldStopWhenOutputCheckErrorFails PASSED
kafka.tools.ConsoleConsumerTest > shouldParseValidNewSimpleConsumerValidConfigWithStringOffset STARTED
kafka.tools.ConsoleConsumerTest > shouldParseValidNewSimpleConsumerValidConfigWithStringOffset PASSED
kafka.tools.ConsoleConsumerTest > shouldParseConfigsFromFile STARTED
kafka.tools.ConsoleConsumerTest > shouldParseConfigsFromFile PASSED
kafka.tools.ConsoleConsumerTest > shouldParseValidNewSimpleConsumerValidConfigWithNumericOffset STARTED
kafka.tools.ConsoleConsumerTest > shouldParseValidNewSimpleConsumerValidConfigWithNumericOffset PASSED
kafka.tools.ConsoleConsumerTest > shouldParseValidOldConsumerValidConfig STARTED
kafka.tools.ConsoleConsumerTest > shouldParseValidOldConsumerValidConfig PASSED
kafka.tools.MirrorMakerTest > testDefaultMirrorMakerMessageHandler STARTED
kafka.tools.MirrorMakerTest > testDefaultMirrorMakerMessageHandler PASSED
kafka.tools.ConsoleProducerTest > testParseKeyProp STARTED
kafka.tools.ConsoleProducerTest > testParseKeyProp PASSED
kafka.tools.ConsoleProducerTest > testValidConfigsOldProducer STARTED
kafka.tools.ConsoleProducerTest > testValidConfigsOldProducer PASSED
kafka.tools.ConsoleProducerTest > testInvalidConfigs STARTED
kafka.tools.ConsoleProducerTest > testInvalidConfigs PASSED
kafka.tools.ConsoleProducerTest > testValidConfigsNewProducer STARTED
kafka.tools.ConsoleProducerTest > testValidConfigsNewProducer PASSED
kafka.network.SocketServerTest > testClientDisconnectionUpdatesRequestMetrics STARTED
kafka.network.SocketServerTest > testClientDisconnectionUpdatesRequestMetrics PASSED
kafka.network.SocketServerTest > testMaxConnectionsPerIp STARTED
kafka.network.SocketServerTest > testMaxConnectionsPerIp PASSED
kafka.network.SocketServerTest > testBrokerSendAfterChannelClosedUpdatesRequestMetrics STARTED
kafka.network.SocketServerTest > testBrokerSendAfterChannelClosedUpdatesRequestMetrics PASSED
kafka.network.SocketServerTest > simpleRequest STARTED
kafka.network.SocketServerTest > simpleRequest PASSED
kafka.network.SocketServerTest > testSessionPrincipal STARTED
kafka.network.SocketServerTest > testSessionPrincipal PASSED
kafka.network.SocketServerTest > testMaxConnectionsPerIpOverrides STARTED
kafka.network.SocketServerTest > testMaxConnectionsPerIpOverrides PASSED
kafka.network.SocketServerTest > testSocketsCloseOnShutdown STARTED
kafka.network.SocketServerTest > testSocketsCloseOnShutdown PASSED
kafka.network.SocketServerTest > testSslSocketServer STARTED
kafka.network.SocketServerTest > testSslSocketServer PASSED
kafka.network.SocketServerTest > tooBigRequestIsRejected STARTED
kafka.network.SocketServerTest > tooBigRequestIsRejected PASSED
kafka.zk.ZKPathTest > testCreatePersistentSequentialThrowsException STARTED
kafka.zk.ZKPathTest > testCreatePersistentSequentialThrowsException PASSED
kafka.zk.ZKPathTest > testCreatePersistentSequentialExists STARTED
kafka.zk.ZKPathTest > testCreatePersistentSequentialExists PASSED
kafka.zk.ZKPathTest > testCreateEphemeralPathExists STARTED
kafka.zk.ZKPathTest > testCreateEphemeralPathExists PASSED
kafka.zk.ZKPathTest > testCreatePersistentPath STARTED
kafka.zk.ZKPathTest > testCreatePersistentPath PASSED
kafka.zk.ZKPathTest > testMakeSurePersistsPathExistsThrowsException STARTED
kafka.zk.ZKPathTest > testMakeSurePersistsPathExistsThrowsException PASSED
kafka.zk.ZKPathTest > testCreateEphemeralPathThrowsException STARTED
kafka.zk.ZKPathTest > testCreateEphemeralPathThrowsException PASSED
kafka.zk.ZKPathTest > testCreatePersistentPathThrowsException STARTED
kafka.zk.ZKPathTest > testCreatePersistentPathThrowsException PASSED
kafka.zk.ZKPathTest > testMakeSurePersistsPathExists STARTED
kafka.zk.ZKPathTest > testMakeSurePersistsPathExists PASSED
kafka.zk.ZKEphemeralTest > testOverlappingSessions[0] STARTED
kafka.zk.ZKEphemeralTest > testOverlappingSessions[0] PASSED
kafka.zk.ZKEphemeralTest > testEphemeralNodeCleanup[0] STARTED
kafka.zk.ZKEphemeralTest > testEphemeralNodeCleanup[0] PASSED
kafka.zk.ZKEphemeralTest > testZkWatchedEphemeral[0] STARTED
kafka.zk.ZKEphemeralTest > testZkWatchedEphemeral[0] PASSED
kafka.zk.ZKEphemeralTest > testSameSession[0] STARTED
kafka.zk.ZKEphemeralTest > testSameSession[0] PASSED
kafka.zk.ZKEphemeralTest > testOverlappingSessions[1] STARTED
kafka.zk.ZKEphemeralTest > testOverlappingSessions[1] PASSED
kafka.zk.ZKEphemeralTest > testEphemeralNodeCleanup[1] STARTED
kafka.zk.ZKEphemeralTest > testEphemeralNodeCleanup[1] PASSED
kafka.zk.ZKEphemeralTest > testZkWatchedEphemeral[1] STARTED
kafka.zk.ZKEphemeralTest > testZkWatchedEphemeral[1] PASSED
kafka.zk.ZKEphemeralTest > testSameSession[1] STARTED
kafka.zk.ZKEphemeralTest > testSameSession[1] PASSED
kafka.common.ConfigTest > testInvalidGroupIds STARTED
kafka.common.ConfigTest > testInvalidGroupIds PASSED
kafka.common.ConfigTest > testInvalidClientIds STARTED
kafka.common.ConfigTest > testInvalidClientIds PASSED
kafka.common.TopicTest > testInvalidTopicNames STARTED
kafka.common.TopicTest > testInvalidTopicNames PASSED
kafka.common.TopicTest > testTopicHasCollision STARTED
kafka.common.TopicTest > testTopicHasCollision PASSED
kafka.common.TopicTest > testTopicHasCollisionChars STARTED
kafka.common.TopicTest > testTopicHasCollisionChars PASSED
kafka.common.ZkNodeChangeNotificationListenerTest > testProcessNotification STARTED
kafka.common.ZkNodeChangeNotificationListenerTest > testProcessNotification PASSED
815 tests completed, 1 failed
:kafka-trunk-jdk8:core:test FAILED
:test_core_2_11 FAILED
FAILURE: Build failed with an exception.
* What went wrong:
Execution failed for task ':core:test'.
> There were failing tests. See the report at: file:///x1/jenkins/jenkins-slave/workspace/kafka-trunk-jdk8/core/build/reports/tests/index.html
* Try:
Run with --stacktrace option to get the stack trace. Run with --info or --debug option to get more log output.
BUILD FAILED
Total time: 1 hrs 26 mins 10.59 secs
Build step 'Execute shell' marked build as failure
Recording test results
Setting GRADLE_2_4_RC_2_HOME=/home/jenkins/jenkins-slave/tools/hudson.plugins.gradle.GradleInstallation/Gradle_2.4-rc-2
Setting JDK1_8_0_66_HOME=/home/jenkins/jenkins-slave/tools/hudson.model.JDK/jdk1.8.0_66
Setting GRADLE_2_4_RC_2_HOME=/home/jenkins/jenkins-slave/tools/hudson.plugins.gradle.GradleInstallation/Gradle_2.4-rc-2
Setting JDK1_8_0_66_HOME=/home/jenkins/jenkins-slave/tools/hudson.model.JDK/jdk1.8.0_66
Jenkins build is back to normal : kafka-trunk-jdk8 #777
Posted by Apache Jenkins Server <je...@builds.apache.org>.
See <https://builds.apache.org/job/kafka-trunk-jdk8/777/changes>
Build failed in Jenkins: kafka-trunk-jdk8 #776
Posted by Apache Jenkins Server <je...@builds.apache.org>.
See <https://builds.apache.org/job/kafka-trunk-jdk8/776/changes>
Changes:
[ismael] MINOR: Increase default timeout for other `wait` methods in `TestUtils`
------------------------------------------
[...truncated 1312 lines...]
kafka.server.LogRecoveryTest > testHWCheckpointWithFailuresMultipleLogSegments PASSED
kafka.server.LogRecoveryTest > testHWCheckpointNoFailuresSingleLogSegment STARTED
kafka.server.LogRecoveryTest > testHWCheckpointNoFailuresSingleLogSegment PASSED
kafka.server.LogRecoveryTest > testHWCheckpointWithFailuresSingleLogSegment STARTED
kafka.server.LogRecoveryTest > testHWCheckpointWithFailuresSingleLogSegment PASSED
kafka.server.AbstractFetcherThreadTest > testConsumerLagRemovedWithPartition STARTED
kafka.server.AbstractFetcherThreadTest > testConsumerLagRemovedWithPartition PASSED
kafka.server.AbstractFetcherThreadTest > testMetricsRemovedOnShutdown STARTED
kafka.server.AbstractFetcherThreadTest > testMetricsRemovedOnShutdown PASSED
kafka.server.ServerShutdownTest > testCleanShutdownAfterFailedStartup STARTED
kafka.server.ServerShutdownTest > testCleanShutdownAfterFailedStartup PASSED
kafka.server.ServerShutdownTest > testConsecutiveShutdown STARTED
kafka.server.ServerShutdownTest > testConsecutiveShutdown PASSED
kafka.server.ServerShutdownTest > testCleanShutdown STARTED
kafka.server.ServerShutdownTest > testCleanShutdown PASSED
kafka.server.ServerShutdownTest > testCleanShutdownWithDeleteTopicEnabled STARTED
kafka.server.ServerShutdownTest > testCleanShutdownWithDeleteTopicEnabled PASSED
kafka.server.ServerStartupTest > testBrokerStateRunningAfterZK STARTED
kafka.server.ServerStartupTest > testBrokerStateRunningAfterZK PASSED
kafka.server.ServerStartupTest > testBrokerCreatesZKChroot STARTED
kafka.server.ServerStartupTest > testBrokerCreatesZKChroot PASSED
kafka.server.ServerStartupTest > testConflictBrokerRegistration STARTED
kafka.server.ServerStartupTest > testConflictBrokerRegistration PASSED
kafka.server.ServerStartupTest > testBrokerSelfAware STARTED
kafka.server.ServerStartupTest > testBrokerSelfAware PASSED
kafka.server.EdgeCaseRequestTest > testInvalidApiVersionRequest STARTED
kafka.server.EdgeCaseRequestTest > testInvalidApiVersionRequest PASSED
kafka.server.EdgeCaseRequestTest > testMalformedHeaderRequest STARTED
kafka.server.EdgeCaseRequestTest > testMalformedHeaderRequest PASSED
kafka.server.EdgeCaseRequestTest > testProduceRequestWithNullClientId STARTED
kafka.server.EdgeCaseRequestTest > testProduceRequestWithNullClientId PASSED
kafka.server.EdgeCaseRequestTest > testInvalidApiKeyRequest STARTED
kafka.server.EdgeCaseRequestTest > testInvalidApiKeyRequest PASSED
kafka.server.EdgeCaseRequestTest > testHeaderOnlyRequest STARTED
kafka.server.EdgeCaseRequestTest > testHeaderOnlyRequest PASSED
kafka.server.CreateTopicsRequestTest > testValidCreateTopicsRequests STARTED
kafka.server.CreateTopicsRequestTest > testValidCreateTopicsRequests PASSED
kafka.server.CreateTopicsRequestTest > testErrorCreateTopicsRequests STARTED
kafka.server.CreateTopicsRequestTest > testErrorCreateTopicsRequests PASSED
kafka.server.CreateTopicsRequestTest > testInvalidCreateTopicsRequests STARTED
kafka.server.CreateTopicsRequestTest > testInvalidCreateTopicsRequests PASSED
kafka.server.CreateTopicsRequestTest > testNotController STARTED
kafka.server.CreateTopicsRequestTest > testNotController PASSED
kafka.server.OffsetCommitTest > testUpdateOffsets STARTED
kafka.server.OffsetCommitTest > testUpdateOffsets PASSED
kafka.server.OffsetCommitTest > testLargeMetadataPayload STARTED
kafka.server.OffsetCommitTest > testLargeMetadataPayload PASSED
kafka.server.OffsetCommitTest > testCommitAndFetchOffsets STARTED
kafka.server.OffsetCommitTest > testCommitAndFetchOffsets PASSED
kafka.server.OffsetCommitTest > testOffsetExpiration STARTED
kafka.server.OffsetCommitTest > testOffsetExpiration PASSED
kafka.server.OffsetCommitTest > testNonExistingTopicOffsetCommit STARTED
kafka.server.OffsetCommitTest > testNonExistingTopicOffsetCommit PASSED
kafka.server.ReplicaManagerTest > testHighWaterMarkDirectoryMapping STARTED
kafka.server.ReplicaManagerTest > testHighWaterMarkDirectoryMapping PASSED
kafka.server.ReplicaManagerTest > testFetchBeyondHighWatermarkReturnEmptyResponse STARTED
kafka.server.ReplicaManagerTest > testFetchBeyondHighWatermarkReturnEmptyResponse PASSED
kafka.server.ReplicaManagerTest > testIllegalRequiredAcks STARTED
kafka.server.ReplicaManagerTest > testIllegalRequiredAcks PASSED
kafka.server.ReplicaManagerTest > testClearPurgatoryOnBecomingFollower STARTED
kafka.server.ReplicaManagerTest > testClearPurgatoryOnBecomingFollower PASSED
kafka.server.ReplicaManagerTest > testHighwaterMarkRelativeDirectoryMapping STARTED
kafka.server.ReplicaManagerTest > testHighwaterMarkRelativeDirectoryMapping PASSED
kafka.server.IsrExpirationTest > testIsrExpirationForSlowFollowers STARTED
kafka.server.IsrExpirationTest > testIsrExpirationForSlowFollowers PASSED
kafka.server.IsrExpirationTest > testIsrExpirationForStuckFollowers STARTED
kafka.server.IsrExpirationTest > testIsrExpirationForStuckFollowers PASSED
kafka.server.IsrExpirationTest > testIsrExpirationIfNoFetchRequestMade STARTED
kafka.server.IsrExpirationTest > testIsrExpirationIfNoFetchRequestMade PASSED
kafka.server.ControlledShutdownLeaderSelectorTest > testSelectLeader STARTED
kafka.server.ControlledShutdownLeaderSelectorTest > testSelectLeader PASSED
kafka.server.ClientQuotaManagerTest > testQuotaViolation STARTED
kafka.server.ClientQuotaManagerTest > testQuotaViolation PASSED
kafka.server.ClientQuotaManagerTest > testExpireQuotaSensors STARTED
kafka.server.ClientQuotaManagerTest > testExpireQuotaSensors PASSED
kafka.server.ClientQuotaManagerTest > testExpireThrottleTimeSensor STARTED
kafka.server.ClientQuotaManagerTest > testExpireThrottleTimeSensor PASSED
kafka.server.ClientQuotaManagerTest > testQuotaParsing STARTED
kafka.server.ClientQuotaManagerTest > testQuotaParsing PASSED
kafka.server.MetadataCacheTest > getTopicMetadataWithNonSupportedSecurityProtocol STARTED
kafka.server.MetadataCacheTest > getTopicMetadataWithNonSupportedSecurityProtocol PASSED
kafka.server.MetadataCacheTest > getTopicMetadataIsrNotAvailable STARTED
kafka.server.MetadataCacheTest > getTopicMetadataIsrNotAvailable PASSED
kafka.server.MetadataCacheTest > getTopicMetadata STARTED
kafka.server.MetadataCacheTest > getTopicMetadata PASSED
kafka.server.MetadataCacheTest > getTopicMetadataReplicaNotAvailable STARTED
kafka.server.MetadataCacheTest > getTopicMetadataReplicaNotAvailable PASSED
kafka.server.MetadataCacheTest > getTopicMetadataPartitionLeaderNotAvailable STARTED
kafka.server.MetadataCacheTest > getTopicMetadataPartitionLeaderNotAvailable PASSED
kafka.server.MetadataCacheTest > getAliveBrokersShouldNotBeMutatedByUpdateCache STARTED
kafka.server.MetadataCacheTest > getAliveBrokersShouldNotBeMutatedByUpdateCache PASSED
kafka.server.MetadataCacheTest > getTopicMetadataNonExistingTopics STARTED
kafka.server.MetadataCacheTest > getTopicMetadataNonExistingTopics PASSED
kafka.server.ServerGenerateBrokerIdTest > testGetSequenceIdMethod STARTED
kafka.server.ServerGenerateBrokerIdTest > testGetSequenceIdMethod PASSED
kafka.server.ServerGenerateBrokerIdTest > testBrokerMetadataOnIdCollision STARTED
kafka.server.ServerGenerateBrokerIdTest > testBrokerMetadataOnIdCollision PASSED
kafka.server.ServerGenerateBrokerIdTest > testAutoGenerateBrokerId STARTED
kafka.server.ServerGenerateBrokerIdTest > testAutoGenerateBrokerId PASSED
kafka.server.ServerGenerateBrokerIdTest > testMultipleLogDirsMetaProps STARTED
kafka.server.ServerGenerateBrokerIdTest > testMultipleLogDirsMetaProps PASSED
kafka.server.ServerGenerateBrokerIdTest > testDisableGeneratedBrokerId STARTED
kafka.server.ServerGenerateBrokerIdTest > testDisableGeneratedBrokerId PASSED
kafka.server.ServerGenerateBrokerIdTest > testUserConfigAndGeneratedBrokerId STARTED
kafka.server.ServerGenerateBrokerIdTest > testUserConfigAndGeneratedBrokerId PASSED
kafka.server.ServerGenerateBrokerIdTest > testConsistentBrokerIdFromUserConfigAndMetaProps STARTED
kafka.server.ServerGenerateBrokerIdTest > testConsistentBrokerIdFromUserConfigAndMetaProps PASSED
kafka.server.ApiVersionsRequestTest > testApiVersionsRequestWithUnsupportedVersion STARTED
kafka.server.ApiVersionsRequestTest > testApiVersionsRequestWithUnsupportedVersion PASSED
kafka.server.ApiVersionsRequestTest > testApiVersionsRequest STARTED
kafka.server.ApiVersionsRequestTest > testApiVersionsRequest PASSED
kafka.server.LogOffsetTest > testFetchOffsetsBeforeWithChangingSegmentSize STARTED
kafka.server.LogOffsetTest > testFetchOffsetsBeforeWithChangingSegmentSize PASSED
kafka.server.LogOffsetTest > testGetOffsetsBeforeEarliestTime STARTED
:kafka-trunk-jdk8:core:test FAILED
:test_core_2_10 FAILED
FAILURE: Build failed with an exception.
* What went wrong:
Execution failed for task ':core:test'.
> Process 'Gradle Test Executor 1' finished with non-zero exit value 137
* Try:
Run with --stacktrace option to get the stack trace. Run with --info or --debug option to get more log output.
BUILD FAILED
Total time: 34 mins 34.424 secs
Build step 'Execute shell' marked build as failure
Recording test results
Setting GRADLE_2_4_RC_2_HOME=/home/jenkins/jenkins-slave/tools/hudson.plugins.gradle.GradleInstallation/Gradle_2.4-rc-2
Setting JDK1_8_0_66_HOME=/home/jenkins/jenkins-slave/tools/hudson.model.JDK/jdk1.8.0_66
ERROR: Step ‘Publish JUnit test result report’ failed: No test report files were found. Configuration error?
Setting GRADLE_2_4_RC_2_HOME=/home/jenkins/jenkins-slave/tools/hudson.plugins.gradle.GradleInstallation/Gradle_2.4-rc-2
Setting JDK1_8_0_66_HOME=/home/jenkins/jenkins-slave/tools/hudson.model.JDK/jdk1.8.0_66