You are viewing a plain text version of this content. The canonical link for it is here.
Posted to builds@beam.apache.org by Apache Jenkins Server <je...@builds.apache.org> on 2023/06/19 22:06:50 UTC

Build failed in Jenkins: beam_PostCommit_Python37 #6826

See <https://ci-beam.apache.org/job/beam_PostCommit_Python37/6826/display/redirect>

Changes:


------------------------------------------
[...truncated 21.37 MB...]
apache_beam/examples/complete/game/game_stats_it_test.py: 2 warnings
apache_beam/examples/complete/game/leader_board_it_test.py: 2 warnings
apache_beam/io/gcp/bigquery_file_loads_test.py: 3 warnings
apache_beam/io/gcp/big_query_query_to_table_it_test.py: 4 warnings
apache_beam/io/gcp/bigquery_json_it_test.py: 2 warnings
apache_beam/io/gcp/bigquery_test.py: 6 warnings
apache_beam/io/gcp/bigquery_write_it_test.py: 4 warnings
  <https://ci-beam.apache.org/job/beam_PostCommit_Python37/ws/src/sdks/python/apache_beam/io/gcp/bigquery.py>:2034: BeamDeprecationWarning: options is deprecated since First stable release. References to <pipeline>.options will not be supported
    experiments = p.options.view_as(DebugOptions).experiments or []

apache_beam/examples/cookbook/bigquery_tornadoes_it_test.py: 1 warning
apache_beam/io/gcp/bigquery_file_loads_test.py: 3 warnings
apache_beam/io/gcp/big_query_query_to_table_it_test.py: 4 warnings
apache_beam/io/gcp/bigquery_write_it_test.py: 3 warnings
apache_beam/io/gcp/bigquery_test.py: 3 warnings
  <https://ci-beam.apache.org/job/beam_PostCommit_Python37/ws/src/sdks/python/apache_beam/io/gcp/bigquery_file_loads.py>:1169: BeamDeprecationWarning: options is deprecated since First stable release. References to <pipeline>.options will not be supported
    self.project = self.project or p.options.view_as(GoogleCloudOptions).project

apache_beam/examples/cookbook/bigquery_tornadoes_it_test.py: 1 warning
apache_beam/examples/complete/game/hourly_team_score_it_test.py: 1 warning
apache_beam/io/gcp/bigquery_file_loads_test.py: 3 warnings
apache_beam/io/gcp/big_query_query_to_table_it_test.py: 4 warnings
apache_beam/io/gcp/bigquery_write_it_test.py: 3 warnings
apache_beam/io/gcp/bigquery_test.py: 3 warnings
  <https://ci-beam.apache.org/job/beam_PostCommit_Python37/ws/src/sdks/python/apache_beam/io/gcp/bigquery_file_loads.py>:1176: BeamDeprecationWarning: options is deprecated since First stable release. References to <pipeline>.options will not be supported
    temp_location = p.options.view_as(GoogleCloudOptions).temp_location

apache_beam/examples/cookbook/bigquery_tornadoes_it_test.py: 1 warning
apache_beam/examples/complete/game/hourly_team_score_it_test.py: 1 warning
apache_beam/io/gcp/bigquery_file_loads_test.py: 3 warnings
apache_beam/io/gcp/big_query_query_to_table_it_test.py: 4 warnings
apache_beam/io/gcp/bigquery_write_it_test.py: 3 warnings
apache_beam/io/gcp/bigquery_test.py: 3 warnings
  <https://ci-beam.apache.org/job/beam_PostCommit_Python37/ws/src/sdks/python/apache_beam/io/gcp/bigquery_file_loads.py>:1178: BeamDeprecationWarning: options is deprecated since First stable release. References to <pipeline>.options will not be supported
    p.options.view_as(GoogleCloudOptions).job_name or 'AUTOMATIC_JOB_NAME')

apache_beam/examples/cookbook/bigquery_tornadoes_it_test.py::BigqueryTornadoesIT::test_bigquery_tornadoes_it
  <https://ci-beam.apache.org/job/beam_PostCommit_Python37/ws/src/sdks/python/apache_beam/io/gcp/tests/utils.py>:100: PendingDeprecationWarning: Client.dataset is deprecated and will be removed in a future version. Use a string like 'my_project.my_dataset' or a cloud.google.bigquery.DatasetReference object, instead.
    table_ref = client.dataset(dataset_id).table(table_id)

apache_beam/examples/complete/game/hourly_team_score_it_test.py::HourlyTeamScoreIT::test_hourly_team_score_it
apache_beam/examples/complete/game/game_stats_it_test.py::GameStatsIT::test_game_stats_it
apache_beam/examples/complete/game/leader_board_it_test.py::LeaderBoardIT::test_leader_board_it
apache_beam/io/gcp/bigquery_test.py::PubSubBigQueryIT::test_file_loads
apache_beam/io/gcp/bigquery_test.py::PubSubBigQueryIT::test_streaming_inserts
  <https://ci-beam.apache.org/job/beam_PostCommit_Python37/ws/src/sdks/python/apache_beam/io/gcp/tests/utils.py>:63: PendingDeprecationWarning: Client.dataset is deprecated and will be removed in a future version. Use a string like 'my_project.my_dataset' or a cloud.google.bigquery.DatasetReference object, instead.
    dataset_ref = client.dataset(unique_dataset_name, project=project)

apache_beam/examples/dataframe/flight_delays_it_test.py::FlightDelaysTest::test_flight_delays
  <https://ci-beam.apache.org/job/beam_PostCommit_Python37/ws/src/sdks/python/apache_beam/examples/dataframe/flight_delays.py>:47: FutureWarning: Dropping of nuisance columns in DataFrame reductions (with 'numeric_only=None') is deprecated; in a future version this will raise TypeError.  Select only valid columns before calling the reduction.
    return airline_df[at_top_airports].mean()

apache_beam/examples/dataframe/flight_delays_it_test.py::FlightDelaysTest::test_flight_delays
apache_beam/examples/dataframe/taxiride_it_test.py::TaxirideIT::test_aggregation
apache_beam/examples/dataframe/taxiride_it_test.py::TaxirideIT::test_enrich
  <https://ci-beam.apache.org/job/beam_PostCommit_Python37/ws/src/sdks/python/apache_beam/io/fileio.py>:593: BeamDeprecationWarning: options is deprecated since First stable release. References to <pipeline>.options will not be supported
    p.options.view_as(GoogleCloudOptions).temp_location or

apache_beam/io/gcp/bigquery_read_it_test.py::ReadTests::test_native_source
  <https://ci-beam.apache.org/job/beam_PostCommit_Python37/ws/src/sdks/python/apache_beam/io/gcp/bigquery_read_it_test.py>:170: BeamDeprecationWarning: BigQuerySource is deprecated since 2.25.0. Use ReadFromBigQuery instead.
    beam.io.BigQuerySource(query=self.query, use_standard_sql=True)))

apache_beam/io/gcp/bigquery_test.py::BigQueryStreamingInsertTransformIntegrationTests::test_multiple_destinations_transform
  <https://ci-beam.apache.org/job/beam_PostCommit_Python37/ws/src/sdks/python/apache_beam/io/gcp/bigquery_test.py>:1694: BeamDeprecationWarning: options is deprecated since First stable release. References to <pipeline>.options will not be supported
    streaming = self.test_pipeline.options.view_as(StandardOptions).streaming

apache_beam/io/gcp/bigquery_read_it_test.py::ReadNewTypesTests::test_native_source
  <https://ci-beam.apache.org/job/beam_PostCommit_Python37/ws/src/sdks/python/apache_beam/io/gcp/bigquery_read_it_test.py>:693: BeamDeprecationWarning: BigQuerySource is deprecated since 2.25.0. Use ReadFromBigQuery instead.
    beam.io.BigQuerySource(query=self.query, use_standard_sql=True)))

apache_beam/io/gcp/bigquery_read_it_test.py::ReadAllBQTests::test_read_queries
  <https://ci-beam.apache.org/job/beam_PostCommit_Python37/ws/src/sdks/python/apache_beam/io/gcp/bigquery.py>:2836: BeamDeprecationWarning: options is deprecated since First stable release. References to <pipeline>.options will not be supported
    job_name = pcoll.pipeline.options.view_as(GoogleCloudOptions).job_name

apache_beam/io/gcp/bigquery_read_it_test.py::ReadAllBQTests::test_read_queries
  <https://ci-beam.apache.org/job/beam_PostCommit_Python37/ws/src/sdks/python/apache_beam/io/gcp/bigquery.py>:2837: BeamDeprecationWarning: options is deprecated since First stable release. References to <pipeline>.options will not be supported
    project = pcoll.pipeline.options.view_as(GoogleCloudOptions).project

apache_beam/io/gcp/bigquery_read_it_test.py::ReadAllBQTests::test_read_queries
  <https://ci-beam.apache.org/job/beam_PostCommit_Python37/ws/src/sdks/python/apache_beam/io/gcp/bigquery.py>:2850: BeamDeprecationWarning: options is deprecated since First stable release. References to <pipeline>.options will not be supported
    options=pcoll.pipeline.options,

-- Docs: https://docs.pytest.org/en/stable/how-to/capture-warnings.html
- generated xml file: <https://ci-beam.apache.org/job/beam_PostCommit_Python37/ws/src/sdks/python/pytest_postCommitIT-df-py37.xml> -
========== 83 passed, 39 skipped, 568 warnings in 8371.72s (2:19:31) ===========

> Task :sdks:python:test-suites:dataflow:py37:spannerioIT
>>> RUNNING integration tests with pipeline options: --runner=TestDataflowRunner --project=apache-beam-testing --region=us-central1 --staging_location=gs://temp-storage-for-end-to-end-tests/staging-it --temp_location=gs://temp-storage-for-end-to-end-tests/temp-it --output=gs://temp-storage-for-end-to-end-tests/py-it-cloud/output --sdk_location=<https://ci-beam.apache.org/job/beam_PostCommit_Python37/ws/src/sdks/python/build/apache_beam-2.49.0.dev0-cp37-cp37m-manylinux_2_17_x86_64.manylinux2014_x86_64.whl> --requirements_file=postcommit_requirements.txt --num_workers=1 --sleep_secs=20 --kms_key_name=projects/apache-beam-testing/locations/global/keyRings/beam-it/cryptoKeys/test --dataflow_kms_key=projects/apache-beam-testing/locations/global/keyRings/beam-it/cryptoKeys/test
>>>   pytest options: --capture=no --timeout=4500 --color=yes --log-cli-level=INFO --numprocesses=8 --dist=loadfile
>>>   collect markers: -m=spannerio_it
============================= test session starts ==============================
platform linux -- Python 3.7.12, pytest-7.3.2, pluggy-1.0.0
rootdir: <https://ci-beam.apache.org/job/beam_PostCommit_Python37/ws/src/sdks/python>
configfile: pytest.ini
plugins: hypothesis-6.79.1, xdist-3.3.1, requests-mock-1.11.0, timeout-2.1.0
timeout: 4500.0s
timeout method: signal
timeout func_only: False
created: 8/8 workers
8 workers [15 items]

scheduling tests via LoadFileScheduling

apache_beam/io/gcp/experimental/spannerio_read_it_test.py::SpannerReadIntegrationTest::test_read_via_sql 
apache_beam/io/gcp/experimental/spannerio_write_it_test.py::SpannerWriteIntegrationTest::test_metrics_error_call 
[gw1] SKIPPED apache_beam/io/gcp/experimental/spannerio_write_it_test.py::SpannerWriteIntegrationTest::test_metrics_error_call 
apache_beam/io/gcp/experimental/spannerio_write_it_test.py::SpannerWriteIntegrationTest::test_metrics_ok_call 
[gw1] SKIPPED apache_beam/io/gcp/experimental/spannerio_write_it_test.py::SpannerWriteIntegrationTest::test_metrics_ok_call 
apache_beam/io/gcp/experimental/spannerio_write_it_test.py::SpannerWriteIntegrationTest::test_spanner_error 
[gw1] PASSED apache_beam/io/gcp/experimental/spannerio_write_it_test.py::SpannerWriteIntegrationTest::test_spanner_error 
apache_beam/io/gcp/experimental/spannerio_write_it_test.py::SpannerWriteIntegrationTest::test_spanner_update 
[gw0] PASSED apache_beam/io/gcp/experimental/spannerio_read_it_test.py::SpannerReadIntegrationTest::test_read_via_sql 
apache_beam/io/gcp/experimental/spannerio_read_it_test.py::SpannerReadIntegrationTest::test_read_via_table 
[gw0] PASSED apache_beam/io/gcp/experimental/spannerio_read_it_test.py::SpannerReadIntegrationTest::test_read_via_table 
apache_beam/io/gcp/experimental/spannerio_read_it_test.py::SpannerReadIntegrationTest::test_sql_metrics_error_call 
[gw0] SKIPPED apache_beam/io/gcp/experimental/spannerio_read_it_test.py::SpannerReadIntegrationTest::test_sql_metrics_error_call 
apache_beam/io/gcp/experimental/spannerio_read_it_test.py::SpannerReadIntegrationTest::test_sql_metrics_ok_call 
[gw0] SKIPPED apache_beam/io/gcp/experimental/spannerio_read_it_test.py::SpannerReadIntegrationTest::test_sql_metrics_ok_call 
apache_beam/io/gcp/experimental/spannerio_read_it_test.py::SpannerReadIntegrationTest::test_table_metrics_error_call 
[gw0] SKIPPED apache_beam/io/gcp/experimental/spannerio_read_it_test.py::SpannerReadIntegrationTest::test_table_metrics_error_call 
apache_beam/io/gcp/experimental/spannerio_read_it_test.py::SpannerReadIntegrationTest::test_table_metrics_ok_call 
[gw0] SKIPPED apache_beam/io/gcp/experimental/spannerio_read_it_test.py::SpannerReadIntegrationTest::test_table_metrics_ok_call 
apache_beam/io/gcp/experimental/spannerio_read_it_test.py::SpannerReadIntegrationTest::test_transaction_sql_metrics_error_call 
[gw0] SKIPPED apache_beam/io/gcp/experimental/spannerio_read_it_test.py::SpannerReadIntegrationTest::test_transaction_sql_metrics_error_call 
apache_beam/io/gcp/experimental/spannerio_read_it_test.py::SpannerReadIntegrationTest::test_transaction_sql_metrics_ok_call 
[gw0] SKIPPED apache_beam/io/gcp/experimental/spannerio_read_it_test.py::SpannerReadIntegrationTest::test_transaction_sql_metrics_ok_call 
apache_beam/io/gcp/experimental/spannerio_read_it_test.py::SpannerReadIntegrationTest::test_transaction_table_metrics_error_call 
[gw0] SKIPPED apache_beam/io/gcp/experimental/spannerio_read_it_test.py::SpannerReadIntegrationTest::test_transaction_table_metrics_error_call 
apache_beam/io/gcp/experimental/spannerio_read_it_test.py::SpannerReadIntegrationTest::test_transaction_table_metrics_ok_call 
[gw0] SKIPPED apache_beam/io/gcp/experimental/spannerio_read_it_test.py::SpannerReadIntegrationTest::test_transaction_table_metrics_ok_call 
[gw1] PASSED apache_beam/io/gcp/experimental/spannerio_write_it_test.py::SpannerWriteIntegrationTest::test_spanner_update 
apache_beam/io/gcp/experimental/spannerio_write_it_test.py::SpannerWriteIntegrationTest::test_write_batches 
[gw1] PASSED apache_beam/io/gcp/experimental/spannerio_write_it_test.py::SpannerWriteIntegrationTest::test_write_batches 

=============================== warnings summary ===============================
../../build/gradleenv/-1734967052/lib/python3.7/site-packages/hdfs/config.py:15
../../build/gradleenv/-1734967052/lib/python3.7/site-packages/hdfs/config.py:15
../../build/gradleenv/-1734967052/lib/python3.7/site-packages/hdfs/config.py:15
../../build/gradleenv/-1734967052/lib/python3.7/site-packages/hdfs/config.py:15
../../build/gradleenv/-1734967052/lib/python3.7/site-packages/hdfs/config.py:15
../../build/gradleenv/-1734967052/lib/python3.7/site-packages/hdfs/config.py:15
../../build/gradleenv/-1734967052/lib/python3.7/site-packages/hdfs/config.py:15
../../build/gradleenv/-1734967052/lib/python3.7/site-packages/hdfs/config.py:15
../../build/gradleenv/-1734967052/lib/python3.7/site-packages/hdfs/config.py:15
  <https://ci-beam.apache.org/job/beam_PostCommit_Python37/ws/src/build/gradleenv/-1734967052/lib/python3.7/site-packages/hdfs/config.py>:15: DeprecationWarning: the imp module is deprecated in favour of importlib; see the module's documentation for alternative uses
    from imp import load_source

../../build/gradleenv/-1734967052/lib/python3.7/site-packages/google/rpc/__init__.py:18
../../build/gradleenv/-1734967052/lib/python3.7/site-packages/google/rpc/__init__.py:18
../../build/gradleenv/-1734967052/lib/python3.7/site-packages/google/rpc/__init__.py:18
../../build/gradleenv/-1734967052/lib/python3.7/site-packages/google/rpc/__init__.py:18
../../build/gradleenv/-1734967052/lib/python3.7/site-packages/google/rpc/__init__.py:18
../../build/gradleenv/-1734967052/lib/python3.7/site-packages/google/rpc/__init__.py:18
../../build/gradleenv/-1734967052/lib/python3.7/site-packages/google/rpc/__init__.py:18
../../build/gradleenv/-1734967052/lib/python3.7/site-packages/google/rpc/__init__.py:18
../../build/gradleenv/-1734967052/lib/python3.7/site-packages/google/rpc/__init__.py:18
  <https://ci-beam.apache.org/job/beam_PostCommit_Python37/ws/src/build/gradleenv/-1734967052/lib/python3.7/site-packages/google/rpc/__init__.py>:18: DeprecationWarning: pkg_resources is deprecated as an API. See https://setuptools.pypa.io/en/latest/pkg_resources.html
    import pkg_resources

../../build/gradleenv/-1734967052/lib/python3.7/site-packages/pkg_resources/__init__.py:2871: 162 warnings
  <https://ci-beam.apache.org/job/beam_PostCommit_Python37/ws/src/build/gradleenv/-1734967052/lib/python3.7/site-packages/pkg_resources/__init__.py>:2871: DeprecationWarning: Deprecated call to `pkg_resources.declare_namespace('google')`.
  Implementing implicit namespace packages (as specified in PEP 420) is preferred to `pkg_resources.declare_namespace`. See https://setuptools.pypa.io/en/latest/references/keywords.html#keyword-namespace-packages
    declare_namespace(pkg)

../../build/gradleenv/-1734967052/lib/python3.7/site-packages/pkg_resources/__init__.py:2871: 117 warnings
  <https://ci-beam.apache.org/job/beam_PostCommit_Python37/ws/src/build/gradleenv/-1734967052/lib/python3.7/site-packages/pkg_resources/__init__.py>:2871: DeprecationWarning: Deprecated call to `pkg_resources.declare_namespace('google.cloud')`.
  Implementing implicit namespace packages (as specified in PEP 420) is preferred to `pkg_resources.declare_namespace`. See https://setuptools.pypa.io/en/latest/references/keywords.html#keyword-namespace-packages
    declare_namespace(pkg)

../../build/gradleenv/-1734967052/lib/python3.7/site-packages/pkg_resources/__init__.py:2350: 36 warnings
  <https://ci-beam.apache.org/job/beam_PostCommit_Python37/ws/src/build/gradleenv/-1734967052/lib/python3.7/site-packages/pkg_resources/__init__.py>:2350: DeprecationWarning: Deprecated call to `pkg_resources.declare_namespace('google')`.
  Implementing implicit namespace packages (as specified in PEP 420) is preferred to `pkg_resources.declare_namespace`. See https://setuptools.pypa.io/en/latest/references/keywords.html#keyword-namespace-packages
    declare_namespace(parent)

../../build/gradleenv/-1734967052/lib/python3.7/site-packages/pkg_resources/__init__.py:2871
../../build/gradleenv/-1734967052/lib/python3.7/site-packages/pkg_resources/__init__.py:2871
../../build/gradleenv/-1734967052/lib/python3.7/site-packages/pkg_resources/__init__.py:2871
../../build/gradleenv/-1734967052/lib/python3.7/site-packages/pkg_resources/__init__.py:2871
../../build/gradleenv/-1734967052/lib/python3.7/site-packages/pkg_resources/__init__.py:2871
../../build/gradleenv/-1734967052/lib/python3.7/site-packages/pkg_resources/__init__.py:2871
../../build/gradleenv/-1734967052/lib/python3.7/site-packages/pkg_resources/__init__.py:2871
../../build/gradleenv/-1734967052/lib/python3.7/site-packages/pkg_resources/__init__.py:2871
../../build/gradleenv/-1734967052/lib/python3.7/site-packages/pkg_resources/__init__.py:2871
  <https://ci-beam.apache.org/job/beam_PostCommit_Python37/ws/src/build/gradleenv/-1734967052/lib/python3.7/site-packages/pkg_resources/__init__.py>:2871: DeprecationWarning: Deprecated call to `pkg_resources.declare_namespace('google.logging')`.
  Implementing implicit namespace packages (as specified in PEP 420) is preferred to `pkg_resources.declare_namespace`. See https://setuptools.pypa.io/en/latest/references/keywords.html#keyword-namespace-packages
    declare_namespace(pkg)

../../build/gradleenv/-1734967052/lib/python3.7/site-packages/pkg_resources/__init__.py:2871
../../build/gradleenv/-1734967052/lib/python3.7/site-packages/pkg_resources/__init__.py:2871
../../build/gradleenv/-1734967052/lib/python3.7/site-packages/pkg_resources/__init__.py:2871
../../build/gradleenv/-1734967052/lib/python3.7/site-packages/pkg_resources/__init__.py:2871
../../build/gradleenv/-1734967052/lib/python3.7/site-packages/pkg_resources/__init__.py:2871
../../build/gradleenv/-1734967052/lib/python3.7/site-packages/pkg_resources/__init__.py:2871
../../build/gradleenv/-1734967052/lib/python3.7/site-packages/pkg_resources/__init__.py:2871
../../build/gradleenv/-1734967052/lib/python3.7/site-packages/pkg_resources/__init__.py:2871
../../build/gradleenv/-1734967052/lib/python3.7/site-packages/pkg_resources/__init__.py:2871
  <https://ci-beam.apache.org/job/beam_PostCommit_Python37/ws/src/build/gradleenv/-1734967052/lib/python3.7/site-packages/pkg_resources/__init__.py>:2871: DeprecationWarning: Deprecated call to `pkg_resources.declare_namespace('google.iam')`.
  Implementing implicit namespace packages (as specified in PEP 420) is preferred to `pkg_resources.declare_namespace`. See https://setuptools.pypa.io/en/latest/references/keywords.html#keyword-namespace-packages
    declare_namespace(pkg)

../../build/gradleenv/-1734967052/lib/python3.7/site-packages/google/rpc/__init__.py:20
../../build/gradleenv/-1734967052/lib/python3.7/site-packages/google/rpc/__init__.py:20
../../build/gradleenv/-1734967052/lib/python3.7/site-packages/google/rpc/__init__.py:20
../../build/gradleenv/-1734967052/lib/python3.7/site-packages/google/rpc/__init__.py:20
../../build/gradleenv/-1734967052/lib/python3.7/site-packages/google/rpc/__init__.py:20
../../build/gradleenv/-1734967052/lib/python3.7/site-packages/google/rpc/__init__.py:20
../../build/gradleenv/-1734967052/lib/python3.7/site-packages/google/rpc/__init__.py:20
../../build/gradleenv/-1734967052/lib/python3.7/site-packages/google/rpc/__init__.py:20
../../build/gradleenv/-1734967052/lib/python3.7/site-packages/google/rpc/__init__.py:20
  <https://ci-beam.apache.org/job/beam_PostCommit_Python37/ws/src/build/gradleenv/-1734967052/lib/python3.7/site-packages/google/rpc/__init__.py>:20: DeprecationWarning: Deprecated call to `pkg_resources.declare_namespace('google.rpc')`.
  Implementing implicit namespace packages (as specified in PEP 420) is preferred to `pkg_resources.declare_namespace`. See https://setuptools.pypa.io/en/latest/references/keywords.html#keyword-namespace-packages
    pkg_resources.declare_namespace(__name__)

-- Docs: https://docs.pytest.org/en/stable/how-to/capture-warnings.html
- generated xml file: <https://ci-beam.apache.org/job/beam_PostCommit_Python37/ws/src/sdks/python/pytest_postCommitIT-df-py37.xml> -
=========== 5 passed, 19 skipped, 360 warnings in 1283.56s (0:21:23) ===========

FAILURE: Build failed with an exception.

* Where:
Script '<https://ci-beam.apache.org/job/beam_PostCommit_Python37/ws/src/sdks/python/test-suites/direct/common.gradle'> line: 74

* What went wrong:
Execution failed for task ':sdks:python:test-suites:direct:py37:spannerioIT'.
> Process 'command 'sh'' finished with non-zero exit value 1

* Try:
> Run with --stacktrace option to get the stack trace.
> Run with --info or --debug option to get more log output.

* Get more help at https://help.gradle.org

Deprecated Gradle features were used in this build, making it incompatible with Gradle 8.0.

You can use '--warning-mode all' to show the individual deprecation warnings and determine if they come from your own scripts or plugins.

See https://docs.gradle.org/7.5.1/userguide/command_line_interface.html#sec:command_line_warnings

Execution optimizations have been disabled for 1 invalid unit(s) of work during this build to ensure correctness.
Please consult deprecation warnings for more details.

BUILD FAILED in 2h 46m 35s
214 actionable tasks: 149 executed, 59 from cache, 6 up-to-date

Publishing build scan...
https://ge.apache.org/s/dhdpnzibjhz3a

Build step 'Invoke Gradle script' changed build result to FAILURE
Build step 'Invoke Gradle script' marked build as failure

---------------------------------------------------------------------
To unsubscribe, e-mail: builds-unsubscribe@beam.apache.org
For additional commands, e-mail: builds-help@beam.apache.org


Jenkins build is back to normal : beam_PostCommit_Python37 #6828

Posted by Apache Jenkins Server <je...@builds.apache.org>.
See <https://ci-beam.apache.org/job/beam_PostCommit_Python37/6828/display/redirect>


---------------------------------------------------------------------
To unsubscribe, e-mail: builds-unsubscribe@beam.apache.org
For additional commands, e-mail: builds-help@beam.apache.org


Build failed in Jenkins: beam_PostCommit_Python37 #6827

Posted by Apache Jenkins Server <je...@builds.apache.org>.
See <https://ci-beam.apache.org/job/beam_PostCommit_Python37/6827/display/redirect>

Changes:


------------------------------------------
[...truncated 24.95 MB...]
apache_beam/io/gcp/bigquery_write_it_test.py: 3 warnings
apache_beam/io/gcp/bigquery_test.py: 3 warnings
apache_beam/io/gcp/big_query_query_to_table_it_test.py: 4 warnings
  <https://ci-beam.apache.org/job/beam_PostCommit_Python37/ws/src/sdks/python/apache_beam/io/gcp/bigquery_file_loads.py>:1169: BeamDeprecationWarning: options is deprecated since First stable release. References to <pipeline>.options will not be supported
    self.project = self.project or p.options.view_as(GoogleCloudOptions).project

apache_beam/examples/cookbook/bigquery_tornadoes_it_test.py: 1 warning
apache_beam/examples/complete/game/hourly_team_score_it_test.py: 1 warning
apache_beam/io/gcp/bigquery_file_loads_test.py: 3 warnings
apache_beam/io/gcp/bigquery_write_it_test.py: 3 warnings
apache_beam/io/gcp/bigquery_test.py: 3 warnings
apache_beam/io/gcp/big_query_query_to_table_it_test.py: 4 warnings
  <https://ci-beam.apache.org/job/beam_PostCommit_Python37/ws/src/sdks/python/apache_beam/io/gcp/bigquery_file_loads.py>:1176: BeamDeprecationWarning: options is deprecated since First stable release. References to <pipeline>.options will not be supported
    temp_location = p.options.view_as(GoogleCloudOptions).temp_location

apache_beam/examples/cookbook/bigquery_tornadoes_it_test.py: 1 warning
apache_beam/examples/complete/game/hourly_team_score_it_test.py: 1 warning
apache_beam/io/gcp/bigquery_file_loads_test.py: 3 warnings
apache_beam/io/gcp/bigquery_write_it_test.py: 3 warnings
apache_beam/io/gcp/bigquery_test.py: 3 warnings
apache_beam/io/gcp/big_query_query_to_table_it_test.py: 4 warnings
  <https://ci-beam.apache.org/job/beam_PostCommit_Python37/ws/src/sdks/python/apache_beam/io/gcp/bigquery_file_loads.py>:1178: BeamDeprecationWarning: options is deprecated since First stable release. References to <pipeline>.options will not be supported
    p.options.view_as(GoogleCloudOptions).job_name or 'AUTOMATIC_JOB_NAME')

apache_beam/examples/cookbook/bigquery_tornadoes_it_test.py::BigqueryTornadoesIT::test_bigquery_tornadoes_it
  <https://ci-beam.apache.org/job/beam_PostCommit_Python37/ws/src/sdks/python/apache_beam/io/gcp/tests/utils.py>:100: PendingDeprecationWarning: Client.dataset is deprecated and will be removed in a future version. Use a string like 'my_project.my_dataset' or a cloud.google.bigquery.DatasetReference object, instead.
    table_ref = client.dataset(dataset_id).table(table_id)

apache_beam/dataframe/io_it_test.py: 2 warnings
apache_beam/io/gcp/bigquery_json_it_test.py: 1 warning
apache_beam/io/gcp/bigquery_read_it_test.py: 9 warnings
  <https://ci-beam.apache.org/job/beam_PostCommit_Python37/ws/src/sdks/python/apache_beam/io/gcp/bigquery.py>:2708: BeamDeprecationWarning: options is deprecated since First stable release. References to <pipeline>.options will not be supported
    project_id = pcoll.pipeline.options.view_as(GoogleCloudOptions).project

apache_beam/dataframe/io_it_test.py: 2 warnings
apache_beam/io/gcp/bigquery_json_it_test.py: 1 warning
apache_beam/io/gcp/bigquery_read_it_test.py: 9 warnings
  <https://ci-beam.apache.org/job/beam_PostCommit_Python37/ws/src/sdks/python/apache_beam/io/gcp/bigquery.py>:2736: BeamDeprecationWarning: options is deprecated since First stable release. References to <pipeline>.options will not be supported
    | _PassThroughThenCleanupTempDatasets(project_to_cleanup_pcoll))

apache_beam/examples/complete/game/hourly_team_score_it_test.py::HourlyTeamScoreIT::test_hourly_team_score_it
apache_beam/examples/complete/game/game_stats_it_test.py::GameStatsIT::test_game_stats_it
apache_beam/examples/complete/game/leader_board_it_test.py::LeaderBoardIT::test_leader_board_it
apache_beam/io/gcp/bigquery_test.py::PubSubBigQueryIT::test_file_loads
apache_beam/io/gcp/bigquery_test.py::PubSubBigQueryIT::test_streaming_inserts
  <https://ci-beam.apache.org/job/beam_PostCommit_Python37/ws/src/sdks/python/apache_beam/io/gcp/tests/utils.py>:63: PendingDeprecationWarning: Client.dataset is deprecated and will be removed in a future version. Use a string like 'my_project.my_dataset' or a cloud.google.bigquery.DatasetReference object, instead.
    dataset_ref = client.dataset(unique_dataset_name, project=project)

apache_beam/examples/dataframe/flight_delays_it_test.py::FlightDelaysTest::test_flight_delays
  <https://ci-beam.apache.org/job/beam_PostCommit_Python37/ws/src/sdks/python/apache_beam/examples/dataframe/flight_delays.py>:47: FutureWarning: Dropping of nuisance columns in DataFrame reductions (with 'numeric_only=None') is deprecated; in a future version this will raise TypeError.  Select only valid columns before calling the reduction.
    return airline_df[at_top_airports].mean()

apache_beam/examples/dataframe/flight_delays_it_test.py::FlightDelaysTest::test_flight_delays
apache_beam/examples/dataframe/taxiride_it_test.py::TaxirideIT::test_aggregation
apache_beam/examples/dataframe/taxiride_it_test.py::TaxirideIT::test_enrich
  <https://ci-beam.apache.org/job/beam_PostCommit_Python37/ws/src/sdks/python/apache_beam/io/fileio.py>:593: BeamDeprecationWarning: options is deprecated since First stable release. References to <pipeline>.options will not be supported
    p.options.view_as(GoogleCloudOptions).temp_location or

apache_beam/io/gcp/bigquery_read_it_test.py::ReadTests::test_native_source
  <https://ci-beam.apache.org/job/beam_PostCommit_Python37/ws/src/sdks/python/apache_beam/io/gcp/bigquery_read_it_test.py>:170: BeamDeprecationWarning: BigQuerySource is deprecated since 2.25.0. Use ReadFromBigQuery instead.
    beam.io.BigQuerySource(query=self.query, use_standard_sql=True)))

apache_beam/io/gcp/bigquery_test.py::BigQueryStreamingInsertTransformIntegrationTests::test_multiple_destinations_transform
  <https://ci-beam.apache.org/job/beam_PostCommit_Python37/ws/src/sdks/python/apache_beam/io/gcp/bigquery_test.py>:1694: BeamDeprecationWarning: options is deprecated since First stable release. References to <pipeline>.options will not be supported
    streaming = self.test_pipeline.options.view_as(StandardOptions).streaming

apache_beam/io/gcp/bigquery_read_it_test.py::ReadNewTypesTests::test_native_source
  <https://ci-beam.apache.org/job/beam_PostCommit_Python37/ws/src/sdks/python/apache_beam/io/gcp/bigquery_read_it_test.py>:693: BeamDeprecationWarning: BigQuerySource is deprecated since 2.25.0. Use ReadFromBigQuery instead.
    beam.io.BigQuerySource(query=self.query, use_standard_sql=True)))

apache_beam/io/gcp/bigquery_read_it_test.py::ReadAllBQTests::test_read_queries
  <https://ci-beam.apache.org/job/beam_PostCommit_Python37/ws/src/sdks/python/apache_beam/io/gcp/bigquery.py>:2836: BeamDeprecationWarning: options is deprecated since First stable release. References to <pipeline>.options will not be supported
    job_name = pcoll.pipeline.options.view_as(GoogleCloudOptions).job_name

apache_beam/io/gcp/bigquery_read_it_test.py::ReadAllBQTests::test_read_queries
  <https://ci-beam.apache.org/job/beam_PostCommit_Python37/ws/src/sdks/python/apache_beam/io/gcp/bigquery.py>:2837: BeamDeprecationWarning: options is deprecated since First stable release. References to <pipeline>.options will not be supported
    project = pcoll.pipeline.options.view_as(GoogleCloudOptions).project

apache_beam/io/gcp/bigquery_read_it_test.py::ReadAllBQTests::test_read_queries
  <https://ci-beam.apache.org/job/beam_PostCommit_Python37/ws/src/sdks/python/apache_beam/io/gcp/bigquery.py>:2850: BeamDeprecationWarning: options is deprecated since First stable release. References to <pipeline>.options will not be supported
    options=pcoll.pipeline.options,

-- Docs: https://docs.pytest.org/en/stable/how-to/capture-warnings.html
- generated xml file: <https://ci-beam.apache.org/job/beam_PostCommit_Python37/ws/src/sdks/python/pytest_postCommitIT-df-py37.xml> -
========== 83 passed, 39 skipped, 568 warnings in 8463.89s (2:21:03) ===========

> Task :sdks:python:test-suites:dataflow:py37:spannerioIT
>>> RUNNING integration tests with pipeline options: --runner=TestDataflowRunner --project=apache-beam-testing --region=us-central1 --staging_location=gs://temp-storage-for-end-to-end-tests/staging-it --temp_location=gs://temp-storage-for-end-to-end-tests/temp-it --output=gs://temp-storage-for-end-to-end-tests/py-it-cloud/output --sdk_location=<https://ci-beam.apache.org/job/beam_PostCommit_Python37/ws/src/sdks/python/build/apache_beam-2.49.0.dev0-cp37-cp37m-manylinux_2_17_x86_64.manylinux2014_x86_64.whl> --requirements_file=postcommit_requirements.txt --num_workers=1 --sleep_secs=20 --kms_key_name=projects/apache-beam-testing/locations/global/keyRings/beam-it/cryptoKeys/test --dataflow_kms_key=projects/apache-beam-testing/locations/global/keyRings/beam-it/cryptoKeys/test
>>>   pytest options: --capture=no --timeout=4500 --color=yes --log-cli-level=INFO --numprocesses=8 --dist=loadfile
>>>   collect markers: -m=spannerio_it
============================= test session starts ==============================
platform linux -- Python 3.7.12, pytest-7.3.2, pluggy-1.0.0
rootdir: <https://ci-beam.apache.org/job/beam_PostCommit_Python37/ws/src/sdks/python>
configfile: pytest.ini
plugins: hypothesis-6.79.1, xdist-3.3.1, requests-mock-1.11.0, timeout-2.1.0
timeout: 4500.0s
timeout method: signal
timeout func_only: False
created: 8/8 workers
8 workers [15 items]

scheduling tests via LoadFileScheduling

apache_beam/io/gcp/experimental/spannerio_read_it_test.py::SpannerReadIntegrationTest::test_read_via_sql 
apache_beam/io/gcp/experimental/spannerio_write_it_test.py::SpannerWriteIntegrationTest::test_metrics_error_call 
[gw1] SKIPPED apache_beam/io/gcp/experimental/spannerio_write_it_test.py::SpannerWriteIntegrationTest::test_metrics_error_call 
apache_beam/io/gcp/experimental/spannerio_write_it_test.py::SpannerWriteIntegrationTest::test_metrics_ok_call 
[gw1] SKIPPED apache_beam/io/gcp/experimental/spannerio_write_it_test.py::SpannerWriteIntegrationTest::test_metrics_ok_call 
apache_beam/io/gcp/experimental/spannerio_write_it_test.py::SpannerWriteIntegrationTest::test_spanner_error 
[gw1] PASSED apache_beam/io/gcp/experimental/spannerio_write_it_test.py::SpannerWriteIntegrationTest::test_spanner_error 
apache_beam/io/gcp/experimental/spannerio_write_it_test.py::SpannerWriteIntegrationTest::test_spanner_update 
[gw0] PASSED apache_beam/io/gcp/experimental/spannerio_read_it_test.py::SpannerReadIntegrationTest::test_read_via_sql 
apache_beam/io/gcp/experimental/spannerio_read_it_test.py::SpannerReadIntegrationTest::test_read_via_table 
[gw0] PASSED apache_beam/io/gcp/experimental/spannerio_read_it_test.py::SpannerReadIntegrationTest::test_read_via_table 
apache_beam/io/gcp/experimental/spannerio_read_it_test.py::SpannerReadIntegrationTest::test_sql_metrics_error_call 
[gw0] SKIPPED apache_beam/io/gcp/experimental/spannerio_read_it_test.py::SpannerReadIntegrationTest::test_sql_metrics_error_call 
apache_beam/io/gcp/experimental/spannerio_read_it_test.py::SpannerReadIntegrationTest::test_sql_metrics_ok_call 
[gw0] SKIPPED apache_beam/io/gcp/experimental/spannerio_read_it_test.py::SpannerReadIntegrationTest::test_sql_metrics_ok_call 
apache_beam/io/gcp/experimental/spannerio_read_it_test.py::SpannerReadIntegrationTest::test_table_metrics_error_call 
[gw0] SKIPPED apache_beam/io/gcp/experimental/spannerio_read_it_test.py::SpannerReadIntegrationTest::test_table_metrics_error_call 
apache_beam/io/gcp/experimental/spannerio_read_it_test.py::SpannerReadIntegrationTest::test_table_metrics_ok_call 
[gw0] SKIPPED apache_beam/io/gcp/experimental/spannerio_read_it_test.py::SpannerReadIntegrationTest::test_table_metrics_ok_call 
apache_beam/io/gcp/experimental/spannerio_read_it_test.py::SpannerReadIntegrationTest::test_transaction_sql_metrics_error_call 
[gw0] SKIPPED apache_beam/io/gcp/experimental/spannerio_read_it_test.py::SpannerReadIntegrationTest::test_transaction_sql_metrics_error_call 
apache_beam/io/gcp/experimental/spannerio_read_it_test.py::SpannerReadIntegrationTest::test_transaction_sql_metrics_ok_call 
[gw0] SKIPPED apache_beam/io/gcp/experimental/spannerio_read_it_test.py::SpannerReadIntegrationTest::test_transaction_sql_metrics_ok_call 
apache_beam/io/gcp/experimental/spannerio_read_it_test.py::SpannerReadIntegrationTest::test_transaction_table_metrics_error_call 
[gw0] SKIPPED apache_beam/io/gcp/experimental/spannerio_read_it_test.py::SpannerReadIntegrationTest::test_transaction_table_metrics_error_call 
apache_beam/io/gcp/experimental/spannerio_read_it_test.py::SpannerReadIntegrationTest::test_transaction_table_metrics_ok_call 
[gw0] SKIPPED apache_beam/io/gcp/experimental/spannerio_read_it_test.py::SpannerReadIntegrationTest::test_transaction_table_metrics_ok_call 
[gw1] PASSED apache_beam/io/gcp/experimental/spannerio_write_it_test.py::SpannerWriteIntegrationTest::test_spanner_update 
apache_beam/io/gcp/experimental/spannerio_write_it_test.py::SpannerWriteIntegrationTest::test_write_batches 
[gw1] PASSED apache_beam/io/gcp/experimental/spannerio_write_it_test.py::SpannerWriteIntegrationTest::test_write_batches 

=============================== warnings summary ===============================
../../build/gradleenv/-1734967052/lib/python3.7/site-packages/hdfs/config.py:15
../../build/gradleenv/-1734967052/lib/python3.7/site-packages/hdfs/config.py:15
../../build/gradleenv/-1734967052/lib/python3.7/site-packages/hdfs/config.py:15
../../build/gradleenv/-1734967052/lib/python3.7/site-packages/hdfs/config.py:15
../../build/gradleenv/-1734967052/lib/python3.7/site-packages/hdfs/config.py:15
../../build/gradleenv/-1734967052/lib/python3.7/site-packages/hdfs/config.py:15
../../build/gradleenv/-1734967052/lib/python3.7/site-packages/hdfs/config.py:15
../../build/gradleenv/-1734967052/lib/python3.7/site-packages/hdfs/config.py:15
../../build/gradleenv/-1734967052/lib/python3.7/site-packages/hdfs/config.py:15
  <https://ci-beam.apache.org/job/beam_PostCommit_Python37/ws/src/build/gradleenv/-1734967052/lib/python3.7/site-packages/hdfs/config.py>:15: DeprecationWarning: the imp module is deprecated in favour of importlib; see the module's documentation for alternative uses
    from imp import load_source

../../build/gradleenv/-1734967052/lib/python3.7/site-packages/google/rpc/__init__.py:18
../../build/gradleenv/-1734967052/lib/python3.7/site-packages/google/rpc/__init__.py:18
../../build/gradleenv/-1734967052/lib/python3.7/site-packages/google/rpc/__init__.py:18
../../build/gradleenv/-1734967052/lib/python3.7/site-packages/google/rpc/__init__.py:18
../../build/gradleenv/-1734967052/lib/python3.7/site-packages/google/rpc/__init__.py:18
../../build/gradleenv/-1734967052/lib/python3.7/site-packages/google/rpc/__init__.py:18
../../build/gradleenv/-1734967052/lib/python3.7/site-packages/google/rpc/__init__.py:18
../../build/gradleenv/-1734967052/lib/python3.7/site-packages/google/rpc/__init__.py:18
../../build/gradleenv/-1734967052/lib/python3.7/site-packages/google/rpc/__init__.py:18
  <https://ci-beam.apache.org/job/beam_PostCommit_Python37/ws/src/build/gradleenv/-1734967052/lib/python3.7/site-packages/google/rpc/__init__.py>:18: DeprecationWarning: pkg_resources is deprecated as an API. See https://setuptools.pypa.io/en/latest/pkg_resources.html
    import pkg_resources

../../build/gradleenv/-1734967052/lib/python3.7/site-packages/pkg_resources/__init__.py:2871: 162 warnings
  <https://ci-beam.apache.org/job/beam_PostCommit_Python37/ws/src/build/gradleenv/-1734967052/lib/python3.7/site-packages/pkg_resources/__init__.py>:2871: DeprecationWarning: Deprecated call to `pkg_resources.declare_namespace('google')`.
  Implementing implicit namespace packages (as specified in PEP 420) is preferred to `pkg_resources.declare_namespace`. See https://setuptools.pypa.io/en/latest/references/keywords.html#keyword-namespace-packages
    declare_namespace(pkg)

../../build/gradleenv/-1734967052/lib/python3.7/site-packages/pkg_resources/__init__.py:2871: 117 warnings
  <https://ci-beam.apache.org/job/beam_PostCommit_Python37/ws/src/build/gradleenv/-1734967052/lib/python3.7/site-packages/pkg_resources/__init__.py>:2871: DeprecationWarning: Deprecated call to `pkg_resources.declare_namespace('google.cloud')`.
  Implementing implicit namespace packages (as specified in PEP 420) is preferred to `pkg_resources.declare_namespace`. See https://setuptools.pypa.io/en/latest/references/keywords.html#keyword-namespace-packages
    declare_namespace(pkg)

../../build/gradleenv/-1734967052/lib/python3.7/site-packages/pkg_resources/__init__.py:2350: 36 warnings
  <https://ci-beam.apache.org/job/beam_PostCommit_Python37/ws/src/build/gradleenv/-1734967052/lib/python3.7/site-packages/pkg_resources/__init__.py>:2350: DeprecationWarning: Deprecated call to `pkg_resources.declare_namespace('google')`.
  Implementing implicit namespace packages (as specified in PEP 420) is preferred to `pkg_resources.declare_namespace`. See https://setuptools.pypa.io/en/latest/references/keywords.html#keyword-namespace-packages
    declare_namespace(parent)

../../build/gradleenv/-1734967052/lib/python3.7/site-packages/pkg_resources/__init__.py:2871
../../build/gradleenv/-1734967052/lib/python3.7/site-packages/pkg_resources/__init__.py:2871
../../build/gradleenv/-1734967052/lib/python3.7/site-packages/pkg_resources/__init__.py:2871
../../build/gradleenv/-1734967052/lib/python3.7/site-packages/pkg_resources/__init__.py:2871
../../build/gradleenv/-1734967052/lib/python3.7/site-packages/pkg_resources/__init__.py:2871
../../build/gradleenv/-1734967052/lib/python3.7/site-packages/pkg_resources/__init__.py:2871
../../build/gradleenv/-1734967052/lib/python3.7/site-packages/pkg_resources/__init__.py:2871
../../build/gradleenv/-1734967052/lib/python3.7/site-packages/pkg_resources/__init__.py:2871
../../build/gradleenv/-1734967052/lib/python3.7/site-packages/pkg_resources/__init__.py:2871
  <https://ci-beam.apache.org/job/beam_PostCommit_Python37/ws/src/build/gradleenv/-1734967052/lib/python3.7/site-packages/pkg_resources/__init__.py>:2871: DeprecationWarning: Deprecated call to `pkg_resources.declare_namespace('google.logging')`.
  Implementing implicit namespace packages (as specified in PEP 420) is preferred to `pkg_resources.declare_namespace`. See https://setuptools.pypa.io/en/latest/references/keywords.html#keyword-namespace-packages
    declare_namespace(pkg)

../../build/gradleenv/-1734967052/lib/python3.7/site-packages/pkg_resources/__init__.py:2871
../../build/gradleenv/-1734967052/lib/python3.7/site-packages/pkg_resources/__init__.py:2871
../../build/gradleenv/-1734967052/lib/python3.7/site-packages/pkg_resources/__init__.py:2871
../../build/gradleenv/-1734967052/lib/python3.7/site-packages/pkg_resources/__init__.py:2871
../../build/gradleenv/-1734967052/lib/python3.7/site-packages/pkg_resources/__init__.py:2871
../../build/gradleenv/-1734967052/lib/python3.7/site-packages/pkg_resources/__init__.py:2871
../../build/gradleenv/-1734967052/lib/python3.7/site-packages/pkg_resources/__init__.py:2871
../../build/gradleenv/-1734967052/lib/python3.7/site-packages/pkg_resources/__init__.py:2871
../../build/gradleenv/-1734967052/lib/python3.7/site-packages/pkg_resources/__init__.py:2871
  <https://ci-beam.apache.org/job/beam_PostCommit_Python37/ws/src/build/gradleenv/-1734967052/lib/python3.7/site-packages/pkg_resources/__init__.py>:2871: DeprecationWarning: Deprecated call to `pkg_resources.declare_namespace('google.iam')`.
  Implementing implicit namespace packages (as specified in PEP 420) is preferred to `pkg_resources.declare_namespace`. See https://setuptools.pypa.io/en/latest/references/keywords.html#keyword-namespace-packages
    declare_namespace(pkg)

../../build/gradleenv/-1734967052/lib/python3.7/site-packages/google/rpc/__init__.py:20
../../build/gradleenv/-1734967052/lib/python3.7/site-packages/google/rpc/__init__.py:20
../../build/gradleenv/-1734967052/lib/python3.7/site-packages/google/rpc/__init__.py:20
../../build/gradleenv/-1734967052/lib/python3.7/site-packages/google/rpc/__init__.py:20
../../build/gradleenv/-1734967052/lib/python3.7/site-packages/google/rpc/__init__.py:20
../../build/gradleenv/-1734967052/lib/python3.7/site-packages/google/rpc/__init__.py:20
../../build/gradleenv/-1734967052/lib/python3.7/site-packages/google/rpc/__init__.py:20
../../build/gradleenv/-1734967052/lib/python3.7/site-packages/google/rpc/__init__.py:20
../../build/gradleenv/-1734967052/lib/python3.7/site-packages/google/rpc/__init__.py:20
  <https://ci-beam.apache.org/job/beam_PostCommit_Python37/ws/src/build/gradleenv/-1734967052/lib/python3.7/site-packages/google/rpc/__init__.py>:20: DeprecationWarning: Deprecated call to `pkg_resources.declare_namespace('google.rpc')`.
  Implementing implicit namespace packages (as specified in PEP 420) is preferred to `pkg_resources.declare_namespace`. See https://setuptools.pypa.io/en/latest/references/keywords.html#keyword-namespace-packages
    pkg_resources.declare_namespace(__name__)

-- Docs: https://docs.pytest.org/en/stable/how-to/capture-warnings.html
- generated xml file: <https://ci-beam.apache.org/job/beam_PostCommit_Python37/ws/src/sdks/python/pytest_postCommitIT-df-py37.xml> -
=========== 5 passed, 19 skipped, 360 warnings in 1275.53s (0:21:15) ===========

FAILURE: Build failed with an exception.

* Where:
Script '<https://ci-beam.apache.org/job/beam_PostCommit_Python37/ws/src/sdks/python/test-suites/direct/common.gradle'> line: 74

* What went wrong:
Execution failed for task ':sdks:python:test-suites:direct:py37:spannerioIT'.
> Process 'command 'sh'' finished with non-zero exit value 1

* Try:
> Run with --stacktrace option to get the stack trace.
> Run with --info or --debug option to get more log output.

* Get more help at https://help.gradle.org

Deprecated Gradle features were used in this build, making it incompatible with Gradle 8.0.

You can use '--warning-mode all' to show the individual deprecation warnings and determine if they come from your own scripts or plugins.

See https://docs.gradle.org/7.5.1/userguide/command_line_interface.html#sec:command_line_warnings

Execution optimizations have been disabled for 1 invalid unit(s) of work during this build to ensure correctness.
Please consult deprecation warnings for more details.

BUILD FAILED in 2h 48m 13s
214 actionable tasks: 149 executed, 59 from cache, 6 up-to-date

Publishing build scan...
https://ge.apache.org/s/gkboc55c5po5o

Build step 'Invoke Gradle script' changed build result to FAILURE
Build step 'Invoke Gradle script' marked build as failure

---------------------------------------------------------------------
To unsubscribe, e-mail: builds-unsubscribe@beam.apache.org
For additional commands, e-mail: builds-help@beam.apache.org