You are viewing a plain text version of this content. The canonical link for it is here.
Posted to builds@beam.apache.org by Apache Jenkins Server <je...@builds.apache.org> on 2021/12/03 18:46:58 UTC

Build failed in Jenkins: beam_PostCommit_XVR_Direct #2015

See <https://ci-beam.apache.org/job/beam_PostCommit_XVR_Direct/2015/display/redirect?page=changes>

Changes:

[noreply] Merge pull request #16117 from [BEAM-13368][Playground][Bugfix] Fix CI

[noreply] Run python SpannerIO IT with python 3.7 only to avoid overload spanner

[noreply] Merge pull request #15378 from [RFC] Define and document per-key


------------------------------------------
[...truncated 842.01 KB...]
  coders: <
    key: "c1"
    value: <
      spec: <
        urn: "beam:coder:global_window:v1"
      >
    >
  >
  coders: <
    key: "c1@usTarArRCX"
    value: <
      spec: <
        urn: "beam:coder:global_window:v1"
      >
    >
  >
  coders: <
    key: "c2"
    value: <
      spec: <
        urn: "beam:coder:varint:v1"
      >
    >
  >
  coders: <
    key: "c3"
    value: <
      spec: <
        urn: "beam:coder:string_utf8:v1"
      >
    >
  >
  coders: <
    key: "c4"
    value: <
      spec: <
        urn: "beam:coder:kv:v1"
      >
      component_coder_ids: "c0"
      component_coder_ids: "c3"
    >
  >
  coders: <
    key: "usTarArRCXVoidCoder"
    value: <
      spec: <
        urn: "beam:coders:javasdk:0.1"
        payload: "\202SNAPPY\000\000\000\000\001\000\000\000\001\000\000\000\210\326\001\350\254\355\000\005sr\000$org.apache.beam.sdk.coders.VoidCoder\271\277U\233\350\r\257U\002\000\000xr\000&j3\000\024Atomic\0055 \307\354\265\314\205tPF\002\0055\000*j5\000$Structured\0059\034s\277\022\016\325\3246\021\t9\000 j9\000\005/0C\335\325\211\256\274~\370\002\000\000xp"
      >
    >
  >
  environments: <
    key: "go"
    value: <
      urn: "beam:env:docker:v1"
      payload: "\n\026apache/beam_go_sdk:dev"
      capabilities: "beam:protocol:progress_reporting:v0"
      capabilities: "beam:protocol:multi_core_bundle_processing:v1"
      capabilities: "beam:version:sdk_base:go"
      capabilities: "beam:coder:bytes:v1"
      capabilities: "beam:coder:bool:v1"
      capabilities: "beam:coder:varint:v1"
      capabilities: "beam:coder:double:v1"
      capabilities: "beam:coder:string_utf8:v1"
      capabilities: "beam:coder:length_prefix:v1"
      capabilities: "beam:coder:kv:v1"
      capabilities: "beam:coder:iterable:v1"
      capabilities: "beam:coder:state_backed_iterable:v1"
      capabilities: "beam:coder:windowed_value:v1"
      capabilities: "beam:coder:global_window:v1"
      capabilities: "beam:coder:interval_window:v1"
      capabilities: "beam:coder:row:v1"
      dependencies: <
        type_urn: "beam:artifact:type:go_worker_binary:v1"
        role_urn: "beam:artifact:role:staging_to:v1"
        role_payload: "\n\006worker"
      >
    >
  >
  environments: <
    key: "usTarArRCXbeam:env:docker:v1"
    value: <
      urn: "beam:env:docker:v1"
      payload: "\n apache/beam_java8_sdk:2.36.0.dev"
      capabilities: "beam:coder:bytes:v1"
      capabilities: "beam:coder:bool:v1"
      capabilities: "beam:coder:varint:v1"
      capabilities: "beam:coder:string_utf8:v1"
      capabilities: "beam:coder:iterable:v1"
      capabilities: "beam:coder:timer:v1"
      capabilities: "beam:coder:kv:v1"
      capabilities: "beam:coder:length_prefix:v1"
      capabilities: "beam:coder:global_window:v1"
      capabilities: "beam:coder:interval_window:v1"
      capabilities: "beam:coder:custom_window:v1"
      capabilities: "beam:coder:windowed_value:v1"
      capabilities: "beam:coder:double:v1"
      capabilities: "beam:coder:row:v1"
      capabilities: "beam:coder:param_windowed_value:v1"
      capabilities: "beam:coder:state_backed_iterable:v1"
      capabilities: "beam:coder:sharded_key:v1"
      capabilities: "beam:protocol:multi_core_bundle_processing:v1"
      capabilities: "beam:protocol:progress_reporting:v1"
      capabilities: "beam:protocol:harness_monitoring_infos:v1"
      capabilities: "beam:protocol:control_request_elements_embedding:v1"
      capabilities: "beam:version:sdk_base:apache/beam_java8_sdk:2.36.0.dev"
      capabilities: "beam:transform:sdf_truncate_sized_restrictions:v1"
      capabilities: "beam:transform:to_string:v1"
      dependencies: <
        type_urn: "beam:artifact:type:file:v1"
        type_payload: "\nL/tmp/artifacts/icedtea-sound-Bdoi2wYa757-fzq5vconCy4SSQ22ZaOq7yuC98fKPs8.jar\022@05da22db061aef9efe7f3ab9bdca270b2e12490db665a3aaef2b82f7c7ca3ecf"
        role_urn: "beam:artifact:role:staging_to:v1"
        role_payload: "\n=icedtea-sound-Bdoi2wYa757-fzq5vconCy4SSQ22ZaOq7yuC98fKPs8.jar"
      >
      dependencies: <
        type_urn: "beam:artifact:type:file:v1"
        type_payload: "\nF/tmp/artifacts/jaccess-CMbK-IOdQPLKHEqCuDnE-yBk-VpbtVT-hgjbHRUGO78.jar\022@08c6caf8839d40f2ca1c4a82b839c4fb2064f95a5bb554fe8608db1d15063bbf"
        role_urn: "beam:artifact:role:staging_to:v1"
        role_payload: "\n7jaccess-CMbK-IOdQPLKHEqCuDnE-yBk-VpbtVT-hgjbHRUGO78.jar"
      >
      dependencies: <
        type_urn: "beam:artifact:type:file:v1"
        type_payload: "\nI/tmp/artifacts/localedata-ae5Z0L6ak4922fztWeWy7ajiWXdG3ubNrwerJRFoFj0.jar\022@69ee59d0be9a938f76d9fced59e5b2eda8e2597746dee6cdaf07ab251168163d"
        role_urn: "beam:artifact:role:staging_to:v1"
        role_payload: "\n:localedata-ae5Z0L6ak4922fztWeWy7ajiWXdG3ubNrwerJRFoFj0.jar"
      >
      dependencies: <
        type_urn: "beam:artifact:type:file:v1"
        type_payload: "\nF/tmp/artifacts/nashorn-XHtz_UehGpYcLTOrATrTnMNVUgEVa_ttoWkPxnVfqTo.jar\022@5c7b73fd47a11a961c2d33ab013ad39cc3555201156bfb6da1690fc6755fa93a"
        role_urn: "beam:artifact:role:staging_to:v1"
        role_payload: "\n7nashorn-XHtz_UehGpYcLTOrATrTnMNVUgEVa_ttoWkPxnVfqTo.jar"
      >
      dependencies: <
        type_urn: "beam:artifact:type:file:v1"
        type_payload: "\nG/tmp/artifacts/cldrdata-k07I6K9W3X5KTQbcDIEsqM0LXyM18f0eR6IaJw-P_xk.jar\022@934ec8e8af56dd7e4a4d06dc0c812ca8cd0b5f2335f1fd1e47a21a270f8fff19"
        role_urn: "beam:artifact:role:staging_to:v1"
        role_payload: "\n8cldrdata-k07I6K9W3X5KTQbcDIEsqM0LXyM18f0eR6IaJw-P_xk.jar"
      >
      dependencies: <
        type_urn: "beam:artifact:type:file:v1"
        type_payload: "\nD/tmp/artifacts/dnsns-RGhCDg3GVOQVC2r6ka2N0hmI4eqQH6VobuoAnQ74MnE.jar\022@4468420e0dc654e4150b6afa91ad8dd21988e1ea901fa5686eea009d0ef83271"
        role_urn: "beam:artifact:role:staging_to:v1"
        role_payload: "\n5dnsns-RGhCDg3GVOQVC2r6ka2N0hmI4eqQH6VobuoAnQ74MnE.jar"
      >
      dependencies: <
        type_urn: "beam:artifact:type:file:v1"
        type_payload: "\n\214\001/tmp/artifacts/beam-sdks-java-testing-expansion-service-testExpansionService-2.36.0-SNAPSHOT-lU4HGVG5fri3SjYWKazpHif7BqKDQHOTgcxJwztKpso.jar\022@954e071951b97eb8b74a361629ace91e27fb06a28340739381cc49c33b4aa6ca"
        role_urn: "beam:artifact:role:staging_to:v1"
        role_payload: "\n}beam-sdks-java-testing-expansion-service-testExpansionService-2.36.0-SNAPSHOT-lU4HGVG5fri3SjYWKazpHif7BqKDQHOTgcxJwztKpso.jar"
      >
    >
  >
>
root_transform_ids: "e1"
root_transform_ids: "e2"
root_transform_ids: "s1"
root_transform_ids: "e5"
root_transform_ids: "s3"
root_transform_ids: "e4"
root_transform_ids: "s2"
2021/12/03 18:25:13 Prepared job with id: go-job-8-1638555913224048218-f47ede7e-979d-4749-acb1-ca1eefc15850 and staging token: go-job-8-1638555913224048218-f47ede7e-979d-4749-acb1-ca1eefc15850
2021/12/03 18:25:13 Cross-compiling <https://ci-beam.apache.org/job/beam_PostCommit_XVR_Direct/ws/src/sdks/go/test/integration/xlang/xlang_test.go> as /tmp/worker-8-1638555913226326350
2021/12/03 18:25:14 Staged binary artifact with token: 
2021/12/03 18:25:14 Submitted job: go-job-8-1638555913224048218-f47ede7e-979d-4749-acb1-ca1eefc15850
2021/12/03 18:25:14 2021-12-03 18:25:14. (1): Make sure that locally built Python SDK docker image has Python 3.6 interpreter.
2021/12/03 18:25:14 2021-12-03 18:25:14. (7): ==================== <function expand_sdf at 0x7f6e96c9aea0> ====================
2021/12/03 18:25:14 2021-12-03 18:25:14. (8): ==================== <function expand_gbk at 0x7f6e96c9af28> ====================
2021/12/03 18:25:14 2021-12-03 18:25:14. (9): ==================== <function sink_flattens at 0x7f6e96c9c0d0> ====================
2021/12/03 18:25:14 2021-12-03 18:25:14. (10): ==================== <function greedily_fuse at 0x7f6e96c9c158> ====================
2021/12/03 18:25:14 2021-12-03 18:25:14. (11): ==================== <function read_to_impulse at 0x7f6e96c9c1e0> ====================
2021/12/03 18:25:14 2021-12-03 18:25:14. (12): ==================== <function impulse_to_input at 0x7f6e96c9c268> ====================
2021/12/03 18:25:14 2021-12-03 18:25:14. (13): ==================== <function sort_stages at 0x7f6e96c9c488> ====================
2021/12/03 18:25:14 2021-12-03 18:25:14. (14): ==================== <function setup_timer_mapping at 0x7f6e96c9c400> ====================
2021/12/03 18:25:14 2021-12-03 18:25:14. (15): ==================== <function populate_data_channel_coders at 0x7f6e96c9c510> ====================
2021/12/03 18:25:14 Job state: STOPPED
2021/12/03 18:25:14 Job state: STARTING
2021/12/03 18:25:14 Job state: RUNNING
2021/12/03 18:25:14 2021-12-03 18:25:14. (16): starting control server on port 37663
2021/12/03 18:25:14 2021-12-03 18:25:14. (17): starting data server on port 34223
2021/12/03 18:25:14 2021-12-03 18:25:14. (18): starting state server on port 39301
2021/12/03 18:25:14 2021-12-03 18:25:14. (19): starting logging server on port 39867
2021/12/03 18:25:14 2021-12-03 18:25:14. (20): Created Worker handler <apache_beam.runners.portability.fn_api_runner.worker_handlers.DockerSdkWorkerHandler object at 0x7f6e94f10dd8> for environment go (beam:env:docker:v1, b'\n\x16apache/beam_go_sdk:dev')
2021/12/03 18:25:14 2021-12-03 18:25:14. (21): Attempting to pull image apache/beam_go_sdk:dev
2021/12/03 18:25:15 2021-12-03 18:25:15. (22): Unable to pull image apache/beam_go_sdk:dev, defaulting to local image if it exists
2021/12/03 18:25:26 2021-12-03 18:25:26. (23): Waiting for docker to start up. Current status is running
2021/12/03 18:25:26 2021-12-03 18:25:26. (24): Docker container is running. container_id = b'70d8f8090f057bd44aa750c20a8a9f7557f4ebc43b87385a26b71a67572cb542', worker_id = worker_11
2021/12/03 18:25:27 2021-12-03 18:25:27. (25): Running ((e1)+(e2))+(n2/Write)
2021/12/03 18:25:27 2021-12-03 18:25:27. (26): Created Worker handler <apache_beam.runners.portability.fn_api_runner.worker_handlers.DockerSdkWorkerHandler object at 0x7f6e94f46be0> for environment usTarArRCXbeam:env:docker:v1 (beam:env:docker:v1, b'\n apache/beam_java8_sdk:2.36.0.dev')
2021/12/03 18:25:27 2021-12-03 18:25:27. (27): Attempting to pull image apache/beam_java8_sdk:2.36.0.dev
2021/12/03 18:25:27 2021-12-03 18:25:27. (28): Unable to pull image apache/beam_java8_sdk:2.36.0.dev, defaulting to local image if it exists
2021/12/03 18:25:29 2021-12-03 18:25:29. (29): Waiting for docker to start up. Current status is running
2021/12/03 18:25:29 2021-12-03 18:25:29. (30): Docker container is running. container_id = b'90fe2638222c2ba00d127e6b038ba355ef2ae74edc29450e2f597983bdaab93b', worker_id = worker_12
2021/12/03 18:25:30 2021-12-03 18:25:30. (31): Running (((n2/Read)+(usTarArRCXExternal-ParMultiDo-Partition-))+(usTarArRCXExternal/ParMultiDo(Partition).out2/Write))+(usTarArRCXExternal/ParMultiDo(Partition).out1/Write)
2021/12/03 18:25:32 2021-12-03 18:25:32. (32): Running (((usTarArRCXExternal/ParMultiDo(Partition).out2/Read)+(e5))+(e15_keyed1))+(n6_keyede15_1/Write)
2021/12/03 18:25:32 2021-12-03 18:25:32. (33): Running (((e12)+(e13))+(e15_keyed2))+(n15_keyede15_2/Write)
2021/12/03 18:25:32 2021-12-03 18:25:32. (34): Running (((((((e14)+(e15))+(e17_keyed3))+(e17_keyed1))+(e17_keyed2))+(n19_keyede17_3/Write))+(n18_keyede17_2/Write))+(n17_keyede17_1/Write)
2021/12/03 18:25:32 2021-12-03 18:25:32. (35): Running (((usTarArRCXExternal/ParMultiDo(Partition).out1/Read)+(e4))+(e9_keyed1))+(n5_keyede9_1/Write)
2021/12/03 18:25:32 2021-12-03 18:25:32. (36): Running (((e6)+(e7))+(e9_keyed2))+(n8_keyede9_2/Write)
2021/12/03 18:25:32 2021-12-03 18:25:32. (37): Running (((((((e8)+(e9))+(e11_keyed3))+(e11_keyed1))+(e11_keyed2))+(n12_keyede11_3/Write))+(n11_keyede11_2/Write))+(n10_keyede11_1/Write)
2021/12/03 18:25:32 2021-12-03 18:25:32. (38): Running (e16)+(e17)
2021/12/03 18:25:32 2021-12-03 18:25:32. (39): Running (e10)+(e11)
2021/12/03 18:25:35 2021-12-03 18:25:35. (40): Successfully completed job in 20.971075773239136 seconds.
2021/12/03 18:25:35 Job state: DONE
--- PASS: TestXLang_Partition (24.14s)
FAIL
FAIL	github.com/apache/beam/sdks/v2/go/test/integration/xlang	126.731s
=== RUN   TestKafkaIO_BasicReadWrite
    integration.go:181: Test TestKafkaIO_BasicReadWrite is currently filtered for runner portable
--- SKIP: TestKafkaIO_BasicReadWrite (0.00s)
PASS
ok  	github.com/apache/beam/sdks/v2/go/test/integration/io/xlang/kafka	3.033s
FAIL

> Task :sdks:python:test-suites:direct:xlang:validatesCrossLanguageRunnerGoUsingJava FAILED
> Task :sdks:python:test-suites:direct:xlang:validatesCrossLanguageRunnerJavaUsingJava
> Task :sdks:python:test-suites:direct:xlang:validatesCrossLanguageRunnerJavaUsingPython
> Task :sdks:python:test-suites:direct:xlang:validatesCrossLanguageRunnerJavaUsingPythonOnly
> Task :sdks:python:test-suites:direct:xlang:validatesCrossLanguageRunnerPythonUsingJava
> Task :sdks:python:test-suites:direct:xlang:validatesCrossLanguageRunnerPythonUsingPython
> Task :sdks:python:test-suites:direct:xlang:validatesCrossLanguageRunnerPythonUsingSql
> Task :sdks:python:test-suites:direct:xlang:validatesCrossLanguageRunnerCleanup
> Task :sdks:python:test-suites:direct:xlang:fnApiJobServerCleanup

FAILURE: Build failed with an exception.

* Where:
Build file '<https://ci-beam.apache.org/job/beam_PostCommit_XVR_Direct/ws/src/sdks/go/test/build.gradle'> line: 212

* What went wrong:
Execution failed for task ':sdks:python:test-suites:direct:xlang:validatesCrossLanguageRunnerGoUsingJava'.
> Process 'command 'sh'' finished with non-zero exit value 1

* Try:
Run with --stacktrace option to get the stack trace. Run with --info or --debug option to get more log output. Run with --scan to get full insights.

* Get more help at https://help.gradle.org

Deprecated Gradle features were used in this build, making it incompatible with Gradle 7.0.
Use '--warning-mode all' to show the individual deprecation warnings.
See https://docs.gradle.org/6.9.1/userguide/command_line_interface.html#sec:command_line_warnings

BUILD FAILED in 36m 9s
199 actionable tasks: 156 executed, 36 from cache, 7 up-to-date

Publishing build scan...
https://gradle.com/s/pyhyvyntb3on2

Build step 'Invoke Gradle script' changed build result to FAILURE
Build step 'Invoke Gradle script' marked build as failure

---------------------------------------------------------------------
To unsubscribe, e-mail: builds-unsubscribe@beam.apache.org
For additional commands, e-mail: builds-help@beam.apache.org


Jenkins build is back to normal : beam_PostCommit_XVR_Direct #2016

Posted by Apache Jenkins Server <je...@builds.apache.org>.
See <https://ci-beam.apache.org/job/beam_PostCommit_XVR_Direct/2016/display/redirect?page=changes>


---------------------------------------------------------------------
To unsubscribe, e-mail: builds-unsubscribe@beam.apache.org
For additional commands, e-mail: builds-help@beam.apache.org