You are viewing a plain text version of this content. The canonical link for it is here.
Posted to builds@beam.apache.org by Apache Jenkins Server <je...@builds.apache.org> on 2022/05/12 12:06:22 UTC

Build failed in Jenkins: beam_LoadTests_Java_GBK_Dataflow_V2_Streaming_Java11 #327

See <https://ci-beam.apache.org/job/beam_LoadTests_Java_GBK_Dataflow_V2_Streaming_Java11/327/display/redirect?page=changes>

Changes:

[randomstep] [BEAM-14096] bump junit-quickcheck to 1.0

[noreply] [BEAM-5492] Python Dataflow integration tests should export the pipeline

[noreply] [BEAM-14396] Bump httplib2 upper bound. (#17602)

[noreply] [BEAM-11104] Add self-checkpointing to CHANGES.md (#17612)

[noreply] [BEAM-14081] [CdapIO] Add context classes for CDAP plugins (#17104)

[noreply] [BEAM-12526] Add Dependabot (#17563)

[noreply] Remove python 3.6 postcommit from mass_comment.py (#17630)

[noreply] [BEAM-14347] Add some benchmarks for generic registration (#17613)

[noreply] Correctly route go dependency changes to go label (#17632)

[noreply] [BEAM-13695] Add jamm jvm options to Java 11 (#17178)


------------------------------------------
[...truncated 1.96 KB...]
[EnvInject] - Executing scripts and injecting environment variables after the SCM step.
[EnvInject] - Injecting as environment variables the properties content 
SPARK_LOCAL_IP=127.0.0.1
SETUPTOOLS_USE_DISTUTILS=stdlib

[EnvInject] - Variables injected successfully.
[beam_LoadTests_Java_GBK_Dataflow_V2_Streaming_Java11] $ /bin/bash -xe /tmp/jenkins7503363679353532126.sh
+ echo '*** Load test: 2GB of 10B records ***'
*** Load test: 2GB of 10B records ***
[Gradle] - Launching build.
[src] $ <https://ci-beam.apache.org/job/beam_LoadTests_Java_GBK_Dataflow_V2_Streaming_Java11/ws/src/gradlew> -PloadTest.mainClass=org.apache.beam.sdk.loadtests.GroupByKeyLoadTest -Prunner=:runners:google-cloud-dataflow-java '-PloadTest.args=--project=apache-beam-testing --region=us-central1 --appName=load_tests_Java11_Dataflow_V2_streaming_GBK_1 --tempLocation=gs://temp-storage-for-perf-tests/loadtests --influxMeasurement=java_streaming_gbk_1 --influxTags={"runnerVersion":"v2","jdk":"java11"} --publishToInfluxDB=true --sourceOptions={"numRecords":200000000,"keySizeBytes":1,"valueSizeBytes":9,"forceNumInitialBundles":1} --fanout=1 --iterations=1 --numWorkers=5 --autoscalingAlgorithm=NONE --streaming=true --influxDatabase=beam_test_metrics --influxHost=http://10.128.0.96:8086 --inputWindowDurationSec=1200 --runner=DataflowRunner' -Prunner.version=V2 -PcompileAndRunTestsWithJava11 -Pjava11Home=/usr/lib/jvm/java-11-openjdk-amd64 --continue --max-****s=12 -Dorg.gradle.jvmargs=-Xms2g -Dorg.gradle.jvmargs=-Xmx4g -Dorg.gradle.vfs.watch=false -Pdocker-pull-licenses :sdks:java:testing:load-tests:run
Starting a Gradle Daemon (subsequent builds will be faster)
Configuration on demand is an incubating feature.
> Task :buildSrc:compileJava NO-SOURCE
> Task :buildSrc:compileGroovy FROM-CACHE
> Task :buildSrc:pluginDescriptors
> Task :buildSrc:processResources
> Task :buildSrc:classes
> Task :buildSrc:jar
> Task :buildSrc:assemble
> Task :buildSrc:spotlessGroovy FROM-CACHE
> Task :buildSrc:spotlessGroovyCheck UP-TO-DATE
> Task :buildSrc:spotlessGroovyGradle FROM-CACHE
> Task :buildSrc:spotlessGroovyGradleCheck UP-TO-DATE
> Task :buildSrc:spotlessCheck UP-TO-DATE
> Task :buildSrc:pluginUnderTestMetadata
> Task :buildSrc:compileTestJava NO-SOURCE
> Task :buildSrc:compileTestGroovy NO-SOURCE
> Task :buildSrc:processTestResources NO-SOURCE
> Task :buildSrc:testClasses UP-TO-DATE
> Task :buildSrc:test NO-SOURCE
> Task :buildSrc:validatePlugins FROM-CACHE
> Task :buildSrc:check UP-TO-DATE
> Task :buildSrc:build
System Go installation: /snap/bin/go is go version go1.16.15 linux/amd64; Preparing to use /home/jenkins/go/bin/go1.18.1
go1.18.1: already downloaded in /home/jenkins/sdk/go1.18.1
GOCMD=/home/jenkins/go/bin/go1.18.1
> Task :model:fn-execution:createCheckerFrameworkManifest
> Task :sdks:java:core:createCheckerFrameworkManifest
> Task :sdks:java:fn-execution:createCheckerFrameworkManifest
> Task :runners:java-fn-execution:createCheckerFrameworkManifest
> Task :sdks:java:expansion-service:createCheckerFrameworkManifest
> Task :sdks:java:harness:createCheckerFrameworkManifest
> Task :model:job-management:createCheckerFrameworkManifest
> Task :runners:core-java:createCheckerFrameworkManifest
> Task :sdks:java:extensions:google-cloud-platform-core:createCheckerFrameworkManifest
> Task :runners:core-construction-java:createCheckerFrameworkManifest
> Task :model:pipeline:createCheckerFrameworkManifest
> Task :sdks:java:fn-execution:processResources NO-SOURCE
> Task :sdks:java:core:generateAvroProtocol NO-SOURCE
> Task :sdks:java:harness:processResources NO-SOURCE
> Task :runners:java-fn-execution:processResources NO-SOURCE
> Task :sdks:java:extensions:google-cloud-platform-core:processResources NO-SOURCE
> Task :runners:core-java:processResources NO-SOURCE
> Task :runners:core-construction-java:processResources NO-SOURCE
> Task :sdks:java:expansion-service:processResources NO-SOURCE
> Task :sdks:java:core:generateAvroJava NO-SOURCE
> Task :model:job-management:extractProto
> Task :model:fn-execution:extractProto
> Task :sdks:java:io:kafka:createCheckerFrameworkManifest
> Task :sdks:java:io:kafka:processResources NO-SOURCE
> Task :runners:google-cloud-dataflow-java:createCheckerFrameworkManifest
> Task :sdks:java:extensions:arrow:createCheckerFrameworkManifest
> Task :sdks:java:io:google-cloud-platform:createCheckerFrameworkManifest
> Task :sdks:java:extensions:protobuf:createCheckerFrameworkManifest
> Task :sdks:java:io:kinesis:createCheckerFrameworkManifest
> Task :sdks:java:container:java11:copyJdkOptions
> Task :release:go-licenses:java:copyLicenses
> Task :sdks:java:extensions:arrow:processResources NO-SOURCE
> Task :sdks:java:io:kinesis:processResources NO-SOURCE
> Task :sdks:java:io:google-cloud-platform:processResources NO-SOURCE
> Task :release:go-licenses:java:dockerClean UP-TO-DATE
> Task :sdks:java:extensions:protobuf:extractProto
> Task :model:job-management:processResources
> Task :sdks:java:extensions:protobuf:processResources NO-SOURCE
> Task :sdks:java:io:synthetic:createCheckerFrameworkManifest
> Task :sdks:java:testing:load-tests:createCheckerFrameworkManifest
> Task :model:fn-execution:processResources
> Task :sdks:java:testing:test-utils:createCheckerFrameworkManifest
> Task :sdks:java:io:synthetic:processResources NO-SOURCE
> Task :sdks:java:core:generateGrammarSource FROM-CACHE
> Task :sdks:java:testing:load-tests:processResources NO-SOURCE
> Task :release:go-licenses:java:dockerPrepare
> Task :sdks:java:testing:test-utils:processResources NO-SOURCE
> Task :sdks:java:container:java11:copyLicenses
> Task :sdks:java:container:java11:dockerClean UP-TO-DATE
> Task :sdks:java:core:processResources
> Task :runners:google-cloud-dataflow-java:processResources

> Task :sdks:java:container:downloadCloudProfilerAgent
version.txt
NOTICES
profiler_java_agent.so

> Task :model:pipeline:extractIncludeProto
> Task :model:pipeline:extractProto
> Task :model:pipeline:generateProto FROM-CACHE
> Task :model:pipeline:compileJava FROM-CACHE
> Task :model:pipeline:processResources
> Task :model:pipeline:classes
> Task :model:pipeline:jar
> Task :model:pipeline:shadowJar FROM-CACHE
> Task :model:job-management:extractIncludeProto
> Task :model:fn-execution:extractIncludeProto
> Task :model:job-management:generateProto FROM-CACHE
> Task :model:fn-execution:generateProto FROM-CACHE
> Task :model:job-management:compileJava FROM-CACHE
> Task :model:job-management:classes
> Task :model:fn-execution:compileJava FROM-CACHE
> Task :model:fn-execution:classes
> Task :model:job-management:shadowJar FROM-CACHE
> Task :model:fn-execution:shadowJar FROM-CACHE
> Task :sdks:java:core:compileJava FROM-CACHE
> Task :sdks:java:core:classes
> Task :sdks:java:core:shadowJar FROM-CACHE
> Task :sdks:java:extensions:arrow:compileJava FROM-CACHE
> Task :sdks:java:extensions:arrow:classes UP-TO-DATE
> Task :sdks:java:io:synthetic:compileJava FROM-CACHE
> Task :sdks:java:io:synthetic:classes UP-TO-DATE
> Task :sdks:java:testing:test-utils:compileJava FROM-CACHE
> Task :sdks:java:testing:test-utils:classes UP-TO-DATE
> Task :sdks:java:io:kinesis:compileJava FROM-CACHE
> Task :sdks:java:io:kinesis:classes UP-TO-DATE
> Task :sdks:java:io:synthetic:jar
> Task :sdks:java:extensions:arrow:jar
> Task :sdks:java:fn-execution:compileJava FAILED
> Task :sdks:java:testing:test-utils:jar
> Task :sdks:java:io:kinesis:jar
> Task :sdks:java:extensions:protobuf:extractIncludeProto
> Task :sdks:java:extensions:protobuf:generateProto NO-SOURCE
> Task :sdks:java:extensions:protobuf:compileJava FROM-CACHE
> Task :sdks:java:extensions:protobuf:classes UP-TO-DATE
> Task :sdks:java:extensions:protobuf:jar
> Task :sdks:java:container:generateLicenseReport

> Task :release:go-licenses:java:docker
 ---> Running in 4304f2a095a2
Removing intermediate container 4304f2a095a2
 ---> a5d73dc2e96d
Step 6/6 : ENTRYPOINT /opt/apache/beam/get-licenses.sh
 ---> Running in c70496898834
Removing intermediate container c70496898834
 ---> 35729be5562a
Successfully built 35729be5562a
Successfully tagged golicenses-java:latest

> Task :sdks:java:container:pullLicenses
Copying already-fetched licenses from <https://ci-beam.apache.org/job/beam_LoadTests_Java_GBK_Dataflow_V2_Streaming_Java11/ws/src/sdks/java/container/build/reports/dependency-license> to <https://ci-beam.apache.org/job/beam_LoadTests_Java_GBK_Dataflow_V2_Streaming_Java11/ws/src/sdks/java/container/build/target/java_third_party_licenses>
Collecting pip
  Using cached pip-22.1-py3-none-any.whl (2.1 MB)
Collecting setuptools
  Using cached setuptools-62.2.0-py3-none-any.whl (1.1 MB)
Collecting wheel
  Using cached wheel-0.37.1-py2.py3-none-any.whl (35 kB)
Installing collected packages: pip, setuptools, wheel
  Attempting uninstall: pip
    Found existing installation: pip 20.0.2
    Uninstalling pip-20.0.2:
      Successfully uninstalled pip-20.0.2
  Attempting uninstall: setuptools
    Found existing installation: setuptools 44.0.0
    Uninstalling setuptools-44.0.0:
      Successfully uninstalled setuptools-44.0.0
Successfully installed pip-22.1 setuptools-62.2.0 wheel-0.37.1
Collecting beautifulsoup4<5.0,>=4.9.0
  Using cached beautifulsoup4-4.11.1-py3-none-any.whl (128 kB)
Collecting pyyaml<6.0.0,>=3.12
  Using cached PyYAML-5.4.1-cp38-cp38-manylinux1_x86_64.whl (662 kB)
Collecting tenacity<6.0,>=5.0.2
  Using cached tenacity-5.1.5-py2.py3-none-any.whl (34 kB)
Collecting soupsieve>1.2
  Using cached soupsieve-2.3.2.post1-py3-none-any.whl (37 kB)
Collecting six>=1.9.0
  Using cached six-1.16.0-py2.py3-none-any.whl (11 kB)
Installing collected packages: soupsieve, six, pyyaml, tenacity, beautifulsoup4
Successfully installed beautifulsoup4-4.11.1 pyyaml-5.4.1 six-1.16.0 soupsieve-2.3.2.post1 tenacity-5.1.5
Executing python <https://ci-beam.apache.org/job/beam_LoadTests_Java_GBK_Dataflow_V2_Streaming_Java11/ws/src/sdks/java/container/license_scripts/pull_licenses_java.py> --license_index=<https://ci-beam.apache.org/job/beam_LoadTests_Java_GBK_Dataflow_V2_Streaming_Java11/ws/src/sdks/java/container/build/reports/dependency-license/index.json>        --output_dir=<https://ci-beam.apache.org/job/beam_LoadTests_Java_GBK_Dataflow_V2_Streaming_Java11/ws/src/sdks/java/container/build/target/java_third_party_licenses>        --dep_url_yaml=<https://ci-beam.apache.org/job/beam_LoadTests_Java_GBK_Dataflow_V2_Streaming_Java11/ws/src/sdks/java/container/license_scripts/dep_urls_java.yaml>        --manual_license_path=<https://ci-beam.apache.org/job/beam_LoadTests_Java_GBK_Dataflow_V2_Streaming_Java11/ws/src/sdks/java/container/license_scripts/manual_licenses>
INFO:root:Pulling license for 242 dependencies using 16 threads.
INFO:root:Replaced local file URL with file://<https://ci-beam.apache.org/job/beam_LoadTests_Java_GBK_Dataflow_V2_Streaming_Java11/ws/src/sdks/java/container/license_scripts/manual_licenses/xz/COPYING> for xz-1.5
INFO:root:pull_licenses_java.py succeed. It took 10.292893 seconds with 16 threads.
Copying licenses from <https://ci-beam.apache.org/job/beam_LoadTests_Java_GBK_Dataflow_V2_Streaming_Java11/ws/src/sdks/java/container/build/target/java_third_party_licenses> to <https://ci-beam.apache.org/job/beam_LoadTests_Java_GBK_Dataflow_V2_Streaming_Java11/ws/src/sdks/java/container/build/target/third_party_licenses.>
Finished license_scripts.sh

> Task :sdks:java:container:goPrepare UP-TO-DATE

> Task :release:go-licenses:java:dockerRun
+ rm -rf '/output/*'
+ export GO111MODULE=off
+ GO111MODULE=off
+ go get github.com/apache/beam/sdks/java/container

> Task :sdks:java:container:java11:copyJavaThirdPartyLicenses

> Task :sdks:java:container:goBuild
/home/jenkins/go/bin/go1.18.1 build -o ./build/target/linux_amd64/boot boot.go boot_test.go

> Task :sdks:java:container:java11:copySdkHarnessLauncher
Execution optimizations have been disabled for task ':sdks:java:container:java11:copySdkHarnessLauncher' to ensure correctness due to the following reasons:
  - Gradle detected a problem with the following location: '<https://ci-beam.apache.org/job/beam_LoadTests_Java_GBK_Dataflow_V2_Streaming_Java11/ws/src/sdks/java/container/build/target'.> Reason: Task ':sdks:java:container:java11:copySdkHarnessLauncher' uses this output of task ':sdks:java:container:downloadCloudProfilerAgent' without declaring an explicit or implicit dependency. This can lead to incorrect results being produced, depending on what order the tasks are executed. Please refer to https://docs.gradle.org/7.4/userguide/validation_problems.html#implicit_dependency for more details about this problem.
  - Gradle detected a problem with the following location: '<https://ci-beam.apache.org/job/beam_LoadTests_Java_GBK_Dataflow_V2_Streaming_Java11/ws/src/sdks/java/container/build/target'.> Reason: Task ':sdks:java:container:java11:copySdkHarnessLauncher' uses this output of task ':sdks:java:container:pullLicenses' without declaring an explicit or implicit dependency. This can lead to incorrect results being produced, depending on what order the tasks are executed. Please refer to https://docs.gradle.org/7.4/userguide/validation_problems.html#implicit_dependency for more details about this problem.

> Task :release:go-licenses:java:dockerRun
+ go-licenses save github.com/apache/beam/sdks/java/container --save_path=/output/licenses
+ go-licenses csv github.com/apache/beam/sdks/java/container
+ tee /output/licenses/list.csv
google.golang.org/protobuf,https://go.googlesource.com/protobuf/+/refs/heads/master/LICENSE,BSD-3-Clause
golang.org/x/text,https://go.googlesource.com/text/+/refs/heads/master/LICENSE,BSD-3-Clause
github.com/apache/beam/sdks/go/pkg/beam,https://github.com/apache/beam/blob/master/sdks/go/README.md,Apache-2.0
golang.org/x/net,https://go.googlesource.com/net/+/refs/heads/master/LICENSE,BSD-3-Clause
github.com/golang/protobuf,https://github.com/golang/protobuf/blob/master/LICENSE,BSD-3-Clause
google.golang.org/genproto/googleapis/rpc/status,https://github.com/googleapis/go-genproto/blob/master/LICENSE,Apache-2.0
github.com/apache/beam/sdks/java/container,https://github.com/apache/beam/blob/master/LICENSE,Apache-2.0
google.golang.org/grpc,https://github.com/grpc/grpc-go/blob/master/LICENSE,Apache-2.0
golang.org/x/sys,https://go.googlesource.com/sys/+/refs/heads/master/LICENSE,BSD-3-Clause
+ chmod -R a+w /output/licenses

> Task :release:go-licenses:java:createLicenses
> Task :sdks:java:container:java11:copyGolangLicenses

FAILURE: Build failed with an exception.

* What went wrong:
Execution failed for task ':sdks:java:fn-execution:compileJava'.
> java.util.ConcurrentModificationException (no error message)

* Try:
> Run with --stacktrace option to get the stack trace.
> Run with --info or --debug option to get more log output.
> Run with --scan to get full insights.

* Get more help at https://help.gradle.org

Deprecated Gradle features were used in this build, making it incompatible with Gradle 8.0.

You can use '--warning-mode all' to show the individual deprecation warnings and determine if they come from your own scripts or plugins.

See https://docs.gradle.org/7.4/userguide/command_line_interface.html#sec:command_line_warnings

Execution optimizations have been disabled for 1 invalid unit(s) of work during this build to ensure correctness.
Please consult deprecation warnings for more details.

BUILD FAILED in 1m 47s
82 actionable tasks: 57 executed, 21 from cache, 4 up-to-date

Publishing build scan...
https://gradle.com/s/myvuo26hv35cg

Build step 'Invoke Gradle script' changed build result to FAILURE
Build step 'Invoke Gradle script' marked build as failure

---------------------------------------------------------------------
To unsubscribe, e-mail: builds-unsubscribe@beam.apache.org
For additional commands, e-mail: builds-help@beam.apache.org


Jenkins build is back to normal : beam_LoadTests_Java_GBK_Dataflow_V2_Streaming_Java11 #328

Posted by Apache Jenkins Server <je...@builds.apache.org>.
See <https://ci-beam.apache.org/job/beam_LoadTests_Java_GBK_Dataflow_V2_Streaming_Java11/328/display/redirect?page=changes>


---------------------------------------------------------------------
To unsubscribe, e-mail: builds-unsubscribe@beam.apache.org
For additional commands, e-mail: builds-help@beam.apache.org