You are viewing a plain text version of this content. The canonical link for it is here.
Posted to yarn-dev@hadoop.apache.org by Apache Jenkins Server <je...@builds.apache.org> on 2015/04/24 04:34:05 UTC
Failed: YARN-3458 PreCommit Build #7488
Jira: https://issues.apache.org/jira/browse/YARN-3458
Build: https://builds.apache.org/job/PreCommit-YARN-Build/7488/
###################################################################################
########################## LAST 60 LINES OF THE CONSOLE ###########################
[...truncated 267 lines...]
| +1 | javac | 7m 46s | There were no new javac warning
| | | | messages.
| +1 | javadoc | 9m 44s | There were no new javadoc warning
| | | | messages.
| +1 | release audit | 0m 23s | The applied patch does not increase
| | | | the total number of release audit
| | | | warnings.
| -1 | checkstyle | 5m 24s | The applied patch generated 1
| | | | additional checkstyle issues.
| +1 | install | 1m 34s | mvn install still works.
| +1 | eclipse:eclipse | 0m 33s | The patch built with
| | | | eclipse:eclipse.
| +1 | findbugs | 1m 24s | The patch does not introduce any
| | | | new Findbugs (version 2.0.3)
| | | | warnings.
| +1 | yarn tests | 1m 57s | Tests passed in hadoop-yarn-common.
| | | 43m 35s |
|| Subsystem || Report/Notes ||
============================================================================
| Patch URL | http://issues.apache.org/jira/secure/attachment/12727790/YARN-3458-4.patch |
| Optional Tests | javadoc javac unit findbugs checkstyle |
| git revision | trunk / bcf89dd |
| checkstyle | /home/jenkins/jenkins-slave/workspace/PreCommit-YARN-Build/../patchprocess/checkstyle-result-diff.txt |
| hadoop-yarn-common test log | /home/jenkins/jenkins-slave/workspace/PreCommit-YARN-Build/../patchprocess/testrun_hadoop-yarn-common.txt |
| Test Results | https://builds.apache.org/job/PreCommit-YARN-Build/7488/testReport/ |
============================================================================
============================================================================
Adding comment to JIRA
============================================================================
============================================================================
Comment added.
f9ddcaa8237413df524e684ef2896712b0f9940e logged out
============================================================================
============================================================================
Finished build.
============================================================================
============================================================================
Build step 'Execute shell' marked build as failure
Archiving artifacts
Sending artifact delta relative to PreCommit-YARN-Build #7481
Archived 21 artifacts
Archive block size is 32768
Received 5164 blocks and 5374642 bytes
Compression is 96.9%
Took 6.3 sec
[description-setter] Could not determine description.
Recording test results
Email was triggered for: Failure
Sending email for trigger: Failure
###################################################################################
############################## FAILED TESTS (if any) ##############################
All tests passed
Failed: YARN-3480 PreCommit Build #7494
Posted by Apache Jenkins Server <je...@builds.apache.org>.
Jira: https://issues.apache.org/jira/browse/YARN-3480
Build: https://builds.apache.org/job/PreCommit-YARN-Build/7494/
###################################################################################
########################## LAST 60 LINES OF THE CONSOLE ###########################
[...truncated 361 lines...]
| | | | warnings.
| +1 | yarn tests | 0m 23s | Tests passed in hadoop-yarn-api.
| -1 | yarn tests | 70m 4s | Tests failed in
| | | | hadoop-yarn-server-resourcemanager.
| | | 113m 4s |
Reason | Tests
Failed unit tests | hadoop.yarn.server.resourcemanager.rmapp.TestRMAppTransitions
| hadoop.yarn.server.resourcemanager.TestApplicationCleanup
| hadoop.yarn.server.resourcemanager.TestRM
| hadoop.yarn.server.resourcemanager.webapp.TestRMWebServicesApps
| hadoop.yarn.server.resourcemanager.TestWorkPreservingRMRestart
| hadoop.yarn.server.resourcemanager.applicationsmanager.TestAMRestart
| hadoop.yarn.server.resourcemanager.TestRMRestart
|| Subsystem || Report/Notes ||
============================================================================
| Patch URL | http://issues.apache.org/jira/secure/attachment/12727920/YARN-3480.02.patch |
| Optional Tests | javadoc javac unit findbugs checkstyle |
| git revision | trunk / 91b97c2 |
| javac | /home/jenkins/jenkins-slave/workspace/PreCommit-YARN-Build/../patchprocess/diffJavacWarnings.txt |
| checkstyle | /home/jenkins/jenkins-slave/workspace/PreCommit-YARN-Build/../patchprocess/checkstyle-result-diff.txt |
| hadoop-yarn-api test log | /home/jenkins/jenkins-slave/workspace/PreCommit-YARN-Build/../patchprocess/testrun_hadoop-yarn-api.txt |
| hadoop-yarn-server-resourcemanager test log | /home/jenkins/jenkins-slave/workspace/PreCommit-YARN-Build/../patchprocess/testrun_hadoop-yarn-server-resourcemanager.txt |
| Test Results | https://builds.apache.org/job/PreCommit-YARN-Build/7494/testReport/ |
============================================================================
============================================================================
Adding comment to JIRA
============================================================================
============================================================================
Comment added.
6bc4446c81b7cf1dd4ce329bc624a68aed635acd logged out
============================================================================
============================================================================
Finished build.
============================================================================
============================================================================
Build step 'Execute shell' marked build as failure
Archiving artifacts
Sending artifact delta relative to PreCommit-YARN-Build #7481
Archived 27 artifacts
Archive block size is 32768
Received 5072 blocks and 9315924 bytes
Compression is 94.7%
Took 6.4 sec
[description-setter] Could not determine description.
Recording test results
Email was triggered for: Failure
Sending email for trigger: Failure
###################################################################################
############################## FAILED TESTS (if any) ##############################
23 tests failed.
FAILED: org.apache.hadoop.yarn.server.resourcemanager.TestApplicationCleanup.testAppCleanupWhenRMRestartedAfterAppFinished
Error Message:
test timed out after 60000 milliseconds
Stack Trace:
java.lang.Exception: test timed out after 60000 milliseconds
at java.lang.Thread.sleep(Native Method)
at org.apache.hadoop.yarn.server.resourcemanager.MockRM.waitForState(MockRM.java:133)
at org.apache.hadoop.yarn.server.resourcemanager.TestApplicationCleanup.testAppCleanupWhenRMRestartedAfterAppFinished(TestApplicationCleanup.java:326)
FAILED: org.apache.hadoop.yarn.server.resourcemanager.TestApplicationCleanup.testAppCleanupWhenRMRestartedBeforeAppFinished
Error Message:
test timed out after 60000 milliseconds
Stack Trace:
java.lang.Exception: test timed out after 60000 milliseconds
at java.lang.Thread.sleep(Native Method)
at org.apache.hadoop.yarn.server.resourcemanager.MockRM.waitForState(MockRM.java:133)
at org.apache.hadoop.yarn.server.resourcemanager.TestApplicationCleanup.testAppCleanupWhenRMRestartedBeforeAppFinished(TestApplicationCleanup.java:391)
FAILED: org.apache.hadoop.yarn.server.resourcemanager.TestApplicationCleanup.testProcessingNMContainerStatusesOnNMRestart
Error Message:
expected:<3072> but was:<5120>
Stack Trace:
java.lang.AssertionError: expected:<3072> but was:<5120>
at org.junit.Assert.fail(Assert.java:88)
at org.junit.Assert.failNotEquals(Assert.java:743)
at org.junit.Assert.assertEquals(Assert.java:118)
at org.junit.Assert.assertEquals(Assert.java:555)
at org.junit.Assert.assertEquals(Assert.java:542)
at org.apache.hadoop.yarn.server.resourcemanager.TestApplicationCleanup.testProcessingNMContainerStatusesOnNMRestart(TestApplicationCleanup.java:533)
FAILED: org.apache.hadoop.yarn.server.resourcemanager.TestApplicationCleanup.testAppCleanupWhenNMReconnects
Error Message:
test timed out after 60000 milliseconds
Stack Trace:
java.lang.Exception: test timed out after 60000 milliseconds
at java.lang.Thread.sleep(Native Method)
at org.apache.hadoop.yarn.server.resourcemanager.MockRM.waitForState(MockRM.java:133)
at org.apache.hadoop.yarn.server.resourcemanager.TestApplicationCleanup.testAppCleanupWhenNMReconnects(TestApplicationCleanup.java:472)
FAILED: org.apache.hadoop.yarn.server.resourcemanager.TestRM.testInvalidateAMHostPortWhenAMFailedOrKilled[0]
Error Message:
test timed out after 80000 milliseconds
Stack Trace:
java.lang.Exception: test timed out after 80000 milliseconds
at java.lang.Thread.sleep(Native Method)
at org.apache.hadoop.yarn.server.resourcemanager.MockRM.waitForState(MockRM.java:133)
at org.apache.hadoop.yarn.server.resourcemanager.TestRM.testInvalidateAMHostPortWhenAMFailedOrKilled(TestRM.java:506)
FAILED: org.apache.hadoop.yarn.server.resourcemanager.TestRM.testInvalidateAMHostPortWhenAMFailedOrKilled[1]
Error Message:
test timed out after 80000 milliseconds
Stack Trace:
java.lang.Exception: test timed out after 80000 milliseconds
at java.lang.Thread.sleep(Native Method)
at org.apache.hadoop.yarn.server.resourcemanager.MockRM.waitForState(MockRM.java:133)
at org.apache.hadoop.yarn.server.resourcemanager.TestRM.testInvalidateAMHostPortWhenAMFailedOrKilled(TestRM.java:506)
FAILED: org.apache.hadoop.yarn.server.resourcemanager.TestRMRestart.testRMRestartGetApplicationList[0]
Error Message:
test timed out after 60000 milliseconds
Stack Trace:
java.lang.Exception: test timed out after 60000 milliseconds
at java.lang.Thread.sleep(Native Method)
at org.apache.hadoop.yarn.server.resourcemanager.MockRM.waitForState(MockRM.java:133)
at org.apache.hadoop.yarn.server.resourcemanager.TestRMRestart.testRMRestartGetApplicationList(TestRMRestart.java:906)
FAILED: org.apache.hadoop.yarn.server.resourcemanager.TestRMRestart.testRMRestartOnMaxAppAttempts[0]
Error Message:
test timed out after 60000 milliseconds
Stack Trace:
java.lang.Exception: test timed out after 60000 milliseconds
at java.lang.Thread.sleep(Native Method)
at org.apache.hadoop.yarn.server.resourcemanager.MockRM.waitForState(MockRM.java:133)
at org.apache.hadoop.yarn.server.resourcemanager.TestRMRestart.testRMRestartOnMaxAppAttempts(TestRMRestart.java:1085)
FAILED: org.apache.hadoop.yarn.server.resourcemanager.TestRMRestart.testRMRestartFailedApp[0]
Error Message:
test timed out after 60000 milliseconds
Stack Trace:
java.lang.Exception: test timed out after 60000 milliseconds
at java.lang.Thread.sleep(Native Method)
at org.apache.hadoop.yarn.server.resourcemanager.MockRM.waitForState(MockRM.java:133)
at org.apache.hadoop.yarn.server.resourcemanager.TestRMRestart.testRMRestartFailedApp(TestRMRestart.java:717)
FAILED: org.apache.hadoop.yarn.server.resourcemanager.TestRMRestart.testRMRestartWaitForPreviousAMToFinish[0]
Error Message:
expected:<4> but was:<3>
Stack Trace:
java.lang.AssertionError: expected:<4> but was:<3>
at org.junit.Assert.fail(Assert.java:88)
at org.junit.Assert.failNotEquals(Assert.java:743)
at org.junit.Assert.assertEquals(Assert.java:118)
at org.junit.Assert.assertEquals(Assert.java:555)
at org.junit.Assert.assertEquals(Assert.java:542)
at org.apache.hadoop.yarn.server.resourcemanager.TestRMRestart.testRMRestartWaitForPreviousAMToFinish(TestRMRestart.java:592)
FAILED: org.apache.hadoop.yarn.server.resourcemanager.TestRMRestart.testRMRestartGetApplicationList[1]
Error Message:
test timed out after 60000 milliseconds
Stack Trace:
java.lang.Exception: test timed out after 60000 milliseconds
at java.lang.Thread.sleep(Native Method)
at org.apache.hadoop.yarn.server.resourcemanager.MockRM.waitForState(MockRM.java:133)
at org.apache.hadoop.yarn.server.resourcemanager.TestRMRestart.testRMRestartGetApplicationList(TestRMRestart.java:906)
FAILED: org.apache.hadoop.yarn.server.resourcemanager.TestRMRestart.testRMRestartOnMaxAppAttempts[1]
Error Message:
test timed out after 60000 milliseconds
Stack Trace:
java.lang.Exception: test timed out after 60000 milliseconds
at java.lang.Thread.sleep(Native Method)
at org.apache.hadoop.yarn.server.resourcemanager.MockRM.waitForState(MockRM.java:133)
at org.apache.hadoop.yarn.server.resourcemanager.TestRMRestart.testRMRestartOnMaxAppAttempts(TestRMRestart.java:1085)
FAILED: org.apache.hadoop.yarn.server.resourcemanager.TestRMRestart.testRMRestartFailedApp[1]
Error Message:
test timed out after 60000 milliseconds
Stack Trace:
java.lang.Exception: test timed out after 60000 milliseconds
at java.lang.Thread.sleep(Native Method)
at org.apache.hadoop.yarn.server.resourcemanager.MockRM.waitForState(MockRM.java:133)
at org.apache.hadoop.yarn.server.resourcemanager.TestRMRestart.testRMRestartFailedApp(TestRMRestart.java:717)
FAILED: org.apache.hadoop.yarn.server.resourcemanager.TestRMRestart.testRMRestartWaitForPreviousAMToFinish[1]
Error Message:
expected:<4> but was:<3>
Stack Trace:
java.lang.AssertionError: expected:<4> but was:<3>
at org.junit.Assert.fail(Assert.java:88)
at org.junit.Assert.failNotEquals(Assert.java:743)
at org.junit.Assert.assertEquals(Assert.java:118)
at org.junit.Assert.assertEquals(Assert.java:555)
at org.junit.Assert.assertEquals(Assert.java:542)
at org.apache.hadoop.yarn.server.resourcemanager.TestRMRestart.testRMRestartWaitForPreviousAMToFinish(TestRMRestart.java:592)
FAILED: org.apache.hadoop.yarn.server.resourcemanager.TestWorkPreservingRMRestart.testAppFailedToRenewTokenOnRecovery[0]
Error Message:
test timed out after 30000 milliseconds
Stack Trace:
java.lang.Exception: test timed out after 30000 milliseconds
at java.lang.Thread.sleep(Native Method)
at org.apache.hadoop.yarn.server.resourcemanager.MockRM.waitForState(MockRM.java:133)
at org.apache.hadoop.yarn.server.resourcemanager.TestWorkPreservingRMRestart.testAppFailedToRenewTokenOnRecovery(TestWorkPreservingRMRestart.java:1012)
FAILED: org.apache.hadoop.yarn.server.resourcemanager.TestWorkPreservingRMRestart.testAppFailedToRenewTokenOnRecovery[1]
Error Message:
test timed out after 30000 milliseconds
Stack Trace:
java.lang.Exception: test timed out after 30000 milliseconds
at java.lang.Thread.sleep(Native Method)
at org.apache.hadoop.yarn.server.resourcemanager.MockRM.waitForState(MockRM.java:133)
at org.apache.hadoop.yarn.server.resourcemanager.TestWorkPreservingRMRestart.testAppFailedToRenewTokenOnRecovery(TestWorkPreservingRMRestart.java:1012)
FAILED: org.apache.hadoop.yarn.server.resourcemanager.applicationsmanager.TestAMRestart.testRMAppAttemptFailuresValidityInterval
Error Message:
test timed out after 50000 milliseconds
Stack Trace:
java.lang.Exception: test timed out after 50000 milliseconds
at java.lang.Thread.sleep(Native Method)
at org.apache.hadoop.yarn.server.resourcemanager.MockRM.waitForState(MockRM.java:133)
at org.apache.hadoop.yarn.server.resourcemanager.applicationsmanager.TestAMRestart.testRMAppAttemptFailuresValidityInterval(TestAMRestart.java:636)
FAILED: org.apache.hadoop.yarn.server.resourcemanager.applicationsmanager.TestAMRestart.testShouldNotCountFailureToMaxAttemptRetry
Error Message:
AppAttempt state is not correct (timedout) expected:<ALLOCATED> but was:<SCHEDULED>
Stack Trace:
java.lang.AssertionError: AppAttempt state is not correct (timedout) expected:<ALLOCATED> but was:<SCHEDULED>
at org.junit.Assert.fail(Assert.java:88)
at org.junit.Assert.failNotEquals(Assert.java:743)
at org.junit.Assert.assertEquals(Assert.java:118)
at org.apache.hadoop.yarn.server.resourcemanager.MockAM.waitForState(MockAM.java:86)
at org.apache.hadoop.yarn.server.resourcemanager.MockRM.sendAMLaunched(MockRM.java:507)
at org.apache.hadoop.yarn.server.resourcemanager.MockRM.launchAM(MockRM.java:689)
at org.apache.hadoop.yarn.server.resourcemanager.MockRM.launchAndRegisterAM(MockRM.java:696)
at org.apache.hadoop.yarn.server.resourcemanager.MockRM.waitForNewAMToLaunchAndRegister(MockRM.java:194)
at org.apache.hadoop.yarn.server.resourcemanager.applicationsmanager.TestAMRestart.testShouldNotCountFailureToMaxAttemptRetry(TestAMRestart.java:392)
FAILED: org.apache.hadoop.yarn.server.resourcemanager.rmapp.TestRMAppTransitions.testAppAcceptedFailed[0]
Error Message:
application finish time is not greater then 0
Stack Trace:
java.lang.AssertionError: application finish time is not greater then 0
at org.junit.Assert.fail(Assert.java:88)
at org.junit.Assert.assertTrue(Assert.java:41)
at org.apache.hadoop.yarn.server.resourcemanager.rmapp.TestRMAppTransitions.assertTimesAtFinish(TestRMAppTransitions.java:322)
at org.apache.hadoop.yarn.server.resourcemanager.rmapp.TestRMAppTransitions.assertFailed(TestRMAppTransitions.java:348)
at org.apache.hadoop.yarn.server.resourcemanager.rmapp.TestRMAppTransitions.testAppAcceptedFailed(TestRMAppTransitions.java:694)
FAILED: org.apache.hadoop.yarn.server.resourcemanager.rmapp.TestRMAppTransitions.testAppRunningFailed[0]
Error Message:
application finish time is not greater then 0
Stack Trace:
java.lang.AssertionError: application finish time is not greater then 0
at org.junit.Assert.fail(Assert.java:88)
at org.junit.Assert.assertTrue(Assert.java:41)
at org.apache.hadoop.yarn.server.resourcemanager.rmapp.TestRMAppTransitions.assertTimesAtFinish(TestRMAppTransitions.java:322)
at org.apache.hadoop.yarn.server.resourcemanager.rmapp.TestRMAppTransitions.assertFailed(TestRMAppTransitions.java:348)
at org.apache.hadoop.yarn.server.resourcemanager.rmapp.TestRMAppTransitions.testAppRunningFailed(TestRMAppTransitions.java:806)
FAILED: org.apache.hadoop.yarn.server.resourcemanager.rmapp.TestRMAppTransitions.testAppAcceptedFailed[1]
Error Message:
application finish time is not greater then 0
Stack Trace:
java.lang.AssertionError: application finish time is not greater then 0
at org.junit.Assert.fail(Assert.java:88)
at org.junit.Assert.assertTrue(Assert.java:41)
at org.apache.hadoop.yarn.server.resourcemanager.rmapp.TestRMAppTransitions.assertTimesAtFinish(TestRMAppTransitions.java:322)
at org.apache.hadoop.yarn.server.resourcemanager.rmapp.TestRMAppTransitions.assertFailed(TestRMAppTransitions.java:348)
at org.apache.hadoop.yarn.server.resourcemanager.rmapp.TestRMAppTransitions.testAppAcceptedFailed(TestRMAppTransitions.java:694)
FAILED: org.apache.hadoop.yarn.server.resourcemanager.rmapp.TestRMAppTransitions.testAppRunningFailed[1]
Error Message:
application finish time is not greater then 0
Stack Trace:
java.lang.AssertionError: application finish time is not greater then 0
at org.junit.Assert.fail(Assert.java:88)
at org.junit.Assert.assertTrue(Assert.java:41)
at org.apache.hadoop.yarn.server.resourcemanager.rmapp.TestRMAppTransitions.assertTimesAtFinish(TestRMAppTransitions.java:322)
at org.apache.hadoop.yarn.server.resourcemanager.rmapp.TestRMAppTransitions.assertFailed(TestRMAppTransitions.java:348)
at org.apache.hadoop.yarn.server.resourcemanager.rmapp.TestRMAppTransitions.testAppRunningFailed(TestRMAppTransitions.java:806)
FAILED: org.apache.hadoop.yarn.server.resourcemanager.webapp.TestRMWebServicesApps.testMultipleAppAttempts
Error Message:
test timed out after 20000 milliseconds
Stack Trace:
java.lang.Exception: test timed out after 20000 milliseconds
at java.lang.Thread.sleep(Native Method)
at org.apache.hadoop.yarn.server.resourcemanager.MockRM.waitForState(MockRM.java:133)
at org.apache.hadoop.yarn.server.resourcemanager.webapp.TestRMWebServicesApps.testMultipleAppAttempts(TestRMWebServicesApps.java:1424)
Failed: YARN-3477 PreCommit Build #7493
Posted by Apache Jenkins Server <je...@builds.apache.org>.
Jira: https://issues.apache.org/jira/browse/YARN-3477
Build: https://builds.apache.org/job/PreCommit-YARN-Build/7493/
###################################################################################
########################## LAST 60 LINES OF THE CONSOLE ###########################
[...truncated 285 lines...]
| +1 | javadoc | 9m 29s | There were no new javadoc warning
| | | | messages.
| +1 | release audit | 0m 23s | The applied patch does not increase
| | | | the total number of release audit
| | | | warnings.
| -1 | checkstyle | 7m 53s | The applied patch generated 2
| | | | additional checkstyle issues.
| +1 | install | 1m 33s | mvn install still works.
| +1 | eclipse:eclipse | 0m 32s | The patch built with
| | | | eclipse:eclipse.
| +1 | findbugs | 2m 6s | The patch does not introduce any
| | | | new Findbugs (version 2.0.3)
| | | | warnings.
| +1 | yarn tests | 7m 6s | Tests passed in hadoop-yarn-client.
| +1 | yarn tests | 1m 56s | Tests passed in hadoop-yarn-common.
| | | 53m 8s |
|| Subsystem || Report/Notes ||
============================================================================
| Patch URL | http://issues.apache.org/jira/secure/attachment/12727898/YARN-3477-002.patch |
| Optional Tests | javadoc javac unit findbugs checkstyle |
| git revision | trunk / 91b97c2 |
| checkstyle | /home/jenkins/jenkins-slave/workspace/PreCommit-YARN-Build/../patchprocess/checkstyle-result-diff.txt |
| hadoop-yarn-client test log | /home/jenkins/jenkins-slave/workspace/PreCommit-YARN-Build/../patchprocess/testrun_hadoop-yarn-client.txt |
| hadoop-yarn-common test log | /home/jenkins/jenkins-slave/workspace/PreCommit-YARN-Build/../patchprocess/testrun_hadoop-yarn-common.txt |
| Test Results | https://builds.apache.org/job/PreCommit-YARN-Build/7493/testReport/ |
============================================================================
============================================================================
Adding comment to JIRA
============================================================================
============================================================================
Comment added.
971f50c0f97e7a65cf35d60effa7ceae886b2e37 logged out
============================================================================
============================================================================
Finished build.
============================================================================
============================================================================
Build step 'Execute shell' marked build as failure
Archiving artifacts
Sending artifact delta relative to PreCommit-YARN-Build #7481
Archived 26 artifacts
Archive block size is 32768
Received 659 blocks and 155466815 bytes
Compression is 12.2%
Took 51 sec
[description-setter] Could not determine description.
Recording test results
Email was triggered for: Failure
Sending email for trigger: Failure
###################################################################################
############################## FAILED TESTS (if any) ##############################
All tests passed
Failed: YARN-2123 PreCommit Build #7492
Posted by Apache Jenkins Server <je...@builds.apache.org>.
Jira: https://issues.apache.org/jira/browse/YARN-2123
Build: https://builds.apache.org/job/PreCommit-YARN-Build/7492/
###################################################################################
########################## LAST 60 LINES OF THE CONSOLE ###########################
[...truncated 296 lines...]
| +1 | eclipse:eclipse | 0m 33s | The patch built with
| | | | eclipse:eclipse.
| +1 | findbugs | 3m 31s | The patch does not introduce any
| | | | new Findbugs (version 2.0.3)
| | | | warnings.
| +1 | yarn tests | 1m 57s | Tests passed in hadoop-yarn-common.
| +1 | yarn tests | 0m 24s | Tests passed in
| | | | hadoop-yarn-server-common.
| -1 | yarn tests | 52m 8s | Tests failed in
| | | | hadoop-yarn-server-resourcemanager.
| | | 97m 53s |
Reason | Tests
Failed unit tests | hadoop.yarn.server.resourcemanager.applicationsmanager.TestAMRestart
| hadoop.yarn.server.resourcemanager.TestRMRestart
|| Subsystem || Report/Notes ||
============================================================================
| Patch URL | http://issues.apache.org/jira/secure/attachment/12727884/YARN-2123-003.patch |
| Optional Tests | javadoc javac unit findbugs checkstyle |
| git revision | trunk / c8d7290 |
| hadoop-yarn-common test log | /home/jenkins/jenkins-slave/workspace/PreCommit-YARN-Build/../patchprocess/testrun_hadoop-yarn-common.txt |
| hadoop-yarn-server-common test log | /home/jenkins/jenkins-slave/workspace/PreCommit-YARN-Build/../patchprocess/testrun_hadoop-yarn-server-common.txt |
| hadoop-yarn-server-resourcemanager test log | /home/jenkins/jenkins-slave/workspace/PreCommit-YARN-Build/../patchprocess/testrun_hadoop-yarn-server-resourcemanager.txt |
| Test Results | https://builds.apache.org/job/PreCommit-YARN-Build/7492/testReport/ |
============================================================================
============================================================================
Adding comment to JIRA
============================================================================
============================================================================
Comment added.
70c78574096e76fba52f0678ace364ef830b0ce2 logged out
============================================================================
============================================================================
Finished build.
============================================================================
============================================================================
Build step 'Execute shell' marked build as failure
Archiving artifacts
Sending artifact delta relative to PreCommit-YARN-Build #7481
Archived 31 artifacts
Archive block size is 32768
Received 2917 blocks and 79458952 bytes
Compression is 54.6%
Took 45 sec
[description-setter] Could not determine description.
Recording test results
Email was triggered for: Failure
Sending email for trigger: Failure
###################################################################################
############################## FAILED TESTS (if any) ##############################
2 tests failed.
FAILED: org.apache.hadoop.yarn.server.resourcemanager.TestRMRestart.testRMRestartGetApplicationList[1]
Error Message:
rMAppManager.logApplicationSummary(
isA(org.apache.hadoop.yarn.api.records.ApplicationId)
);
Wanted 3 times:
-> at org.apache.hadoop.yarn.server.resourcemanager.TestRMRestart.testRMRestartGetApplicationList(TestRMRestart.java:969)
But was 2 times:
-> at org.apache.hadoop.yarn.server.resourcemanager.RMAppManager.handle(RMAppManager.java:66)
Stack Trace:
org.mockito.exceptions.verification.TooLittleActualInvocations:
rMAppManager.logApplicationSummary(
isA(org.apache.hadoop.yarn.api.records.ApplicationId)
);
Wanted 3 times:
-> at org.apache.hadoop.yarn.server.resourcemanager.TestRMRestart.testRMRestartGetApplicationList(TestRMRestart.java:969)
But was 2 times:
-> at org.apache.hadoop.yarn.server.resourcemanager.RMAppManager.handle(RMAppManager.java:66)
at org.apache.hadoop.yarn.server.resourcemanager.TestRMRestart.testRMRestartGetApplicationList(TestRMRestart.java:969)
FAILED: org.apache.hadoop.yarn.server.resourcemanager.applicationsmanager.TestAMRestart.testShouldNotCountFailureToMaxAttemptRetry
Error Message:
AppAttempt state is not correct (timedout) expected:<ALLOCATED> but was:<SCHEDULED>
Stack Trace:
java.lang.AssertionError: AppAttempt state is not correct (timedout) expected:<ALLOCATED> but was:<SCHEDULED>
at org.junit.Assert.fail(Assert.java:88)
at org.junit.Assert.failNotEquals(Assert.java:743)
at org.junit.Assert.assertEquals(Assert.java:118)
at org.apache.hadoop.yarn.server.resourcemanager.MockAM.waitForState(MockAM.java:86)
at org.apache.hadoop.yarn.server.resourcemanager.MockRM.sendAMLaunched(MockRM.java:507)
at org.apache.hadoop.yarn.server.resourcemanager.MockRM.launchAM(MockRM.java:689)
at org.apache.hadoop.yarn.server.resourcemanager.MockRM.launchAndRegisterAM(MockRM.java:696)
at org.apache.hadoop.yarn.server.resourcemanager.MockRM.waitForNewAMToLaunchAndRegister(MockRM.java:194)
at org.apache.hadoop.yarn.server.resourcemanager.applicationsmanager.TestAMRestart.testShouldNotCountFailureToMaxAttemptRetry(TestAMRestart.java:392)
Failed: YARN-3538 PreCommit Build #7491
Posted by Apache Jenkins Server <je...@builds.apache.org>.
Jira: https://issues.apache.org/jira/browse/YARN-3538
Build: https://builds.apache.org/job/PreCommit-YARN-Build/7491/
###################################################################################
########################## LAST 60 LINES OF THE CONSOLE ###########################
[...truncated 269 lines...]
| +1 | javadoc | 9m 35s | There were no new javadoc warning
| | | | messages.
| +1 | release audit | 0m 22s | The applied patch does not increase
| | | | the total number of release audit
| | | | warnings.
| -1 | checkstyle | 7m 52s | The applied patch generated 1
| | | | additional checkstyle issues.
| +1 | install | 1m 32s | mvn install still works.
| +1 | eclipse:eclipse | 0m 33s | The patch built with
| | | | eclipse:eclipse.
| +1 | findbugs | 0m 45s | The patch does not introduce any
| | | | new Findbugs (version 2.0.3)
| | | | warnings.
| +1 | yarn tests | 2m 49s | Tests passed in
| | | | hadoop-yarn-server-applicationhistory
| | | | service.
| | | 45m 39s |
|| Subsystem || Report/Notes ||
============================================================================
| Patch URL | http://issues.apache.org/jira/secure/attachment/12727879/YARN-3538-001.patch |
| Optional Tests | javadoc javac unit findbugs checkstyle |
| git revision | trunk / c8d7290 |
| checkstyle | /home/jenkins/jenkins-slave/workspace/PreCommit-YARN-Build/../patchprocess/checkstyle-result-diff.txt |
| hadoop-yarn-server-applicationhistoryservice test log | /home/jenkins/jenkins-slave/workspace/PreCommit-YARN-Build/../patchprocess/testrun_hadoop-yarn-server-applicationhistoryservice.txt |
| Test Results | https://builds.apache.org/job/PreCommit-YARN-Build/7491/testReport/ |
============================================================================
============================================================================
Adding comment to JIRA
============================================================================
============================================================================
Comment added.
d8b1f3b9bc0b3c2b486dfd641cef13bdb20bc2de logged out
============================================================================
============================================================================
Finished build.
============================================================================
============================================================================
Build step 'Execute shell' marked build as failure
Archiving artifacts
Sending artifact delta relative to PreCommit-YARN-Build #7481
Archived 21 artifacts
Archive block size is 32768
Received 658 blocks and 155204316 bytes
Compression is 12.2%
Took 58 sec
[description-setter] Could not determine description.
Recording test results
Email was triggered for: Failure
Sending email for trigger: Failure
###################################################################################
############################## FAILED TESTS (if any) ##############################
All tests passed
Failed: YARN-3511 PreCommit Build #7490
Posted by Apache Jenkins Server <je...@builds.apache.org>.
Jira: https://issues.apache.org/jira/browse/YARN-3511
Build: https://builds.apache.org/job/PreCommit-YARN-Build/7490/
###################################################################################
########################## LAST 60 LINES OF THE CONSOLE ###########################
[...truncated 296 lines...]
| +1 | findbugs | 2m 54s | The patch does not introduce any
| | | | new Findbugs (version 2.0.3)
| | | | warnings.
| +1 | yarn tests | 2m 41s | Tests passed in
| | | | hadoop-yarn-server-applicationhistory
| | | | service.
| +1 | yarn tests | 0m 25s | Tests passed in
| | | | hadoop-yarn-server-common.
| -1 | yarn tests | 51m 57s | Tests failed in
| | | | hadoop-yarn-server-resourcemanager.
| | | 97m 39s |
Reason | Tests
Failed unit tests | hadoop.yarn.server.resourcemanager.applicationsmanager.TestAMRestart
|| Subsystem || Report/Notes ||
============================================================================
| Patch URL | http://issues.apache.org/jira/secure/attachment/12727844/YARN-3511.003.patch |
| Optional Tests | javadoc javac unit findbugs checkstyle |
| git revision | trunk / c8d7290 |
| checkstyle | /home/jenkins/jenkins-slave/workspace/PreCommit-YARN-Build/../patchprocess/checkstyle-result-diff.txt |
| hadoop-yarn-server-applicationhistoryservice test log | /home/jenkins/jenkins-slave/workspace/PreCommit-YARN-Build/../patchprocess/testrun_hadoop-yarn-server-applicationhistoryservice.txt |
| hadoop-yarn-server-common test log | /home/jenkins/jenkins-slave/workspace/PreCommit-YARN-Build/../patchprocess/testrun_hadoop-yarn-server-common.txt |
| hadoop-yarn-server-resourcemanager test log | /home/jenkins/jenkins-slave/workspace/PreCommit-YARN-Build/../patchprocess/testrun_hadoop-yarn-server-resourcemanager.txt |
| Test Results | https://builds.apache.org/job/PreCommit-YARN-Build/7490/testReport/ |
============================================================================
============================================================================
Adding comment to JIRA
============================================================================
============================================================================
Comment added.
2bf8e0a3bb97a9f68492eec3893ceb5155a9310f logged out
============================================================================
============================================================================
Finished build.
============================================================================
============================================================================
Build step 'Execute shell' marked build as failure
Archiving artifacts
Sending artifact delta relative to PreCommit-YARN-Build #7481
Archived 31 artifacts
Archive block size is 32768
Received 2912 blocks and 79410584 bytes
Compression is 54.6%
Took 47 sec
[description-setter] Could not determine description.
Recording test results
Email was triggered for: Failure
Sending email for trigger: Failure
###################################################################################
############################## FAILED TESTS (if any) ##############################
1 tests failed.
FAILED: org.apache.hadoop.yarn.server.resourcemanager.applicationsmanager.TestAMRestart.testShouldNotCountFailureToMaxAttemptRetry
Error Message:
AppAttempt state is not correct (timedout) expected:<ALLOCATED> but was:<SCHEDULED>
Stack Trace:
java.lang.AssertionError: AppAttempt state is not correct (timedout) expected:<ALLOCATED> but was:<SCHEDULED>
at org.junit.Assert.fail(Assert.java:88)
at org.junit.Assert.failNotEquals(Assert.java:743)
at org.junit.Assert.assertEquals(Assert.java:118)
at org.apache.hadoop.yarn.server.resourcemanager.MockAM.waitForState(MockAM.java:86)
at org.apache.hadoop.yarn.server.resourcemanager.MockRM.sendAMLaunched(MockRM.java:507)
at org.apache.hadoop.yarn.server.resourcemanager.MockRM.launchAM(MockRM.java:689)
at org.apache.hadoop.yarn.server.resourcemanager.MockRM.launchAndRegisterAM(MockRM.java:696)
at org.apache.hadoop.yarn.server.resourcemanager.MockRM.waitForNewAMToLaunchAndRegister(MockRM.java:194)
at org.apache.hadoop.yarn.server.resourcemanager.applicationsmanager.TestAMRestart.testShouldNotCountFailureToMaxAttemptRetry(TestAMRestart.java:405)
Failed: YARN-3534 PreCommit Build #7489
Posted by Apache Jenkins Server <je...@builds.apache.org>.
Jira: https://issues.apache.org/jira/browse/YARN-3534
Build: https://builds.apache.org/job/PreCommit-YARN-Build/7489/
###################################################################################
########################## LAST 60 LINES OF THE CONSOLE ###########################
[...truncated 340 lines...]
| | | | additional checkstyle issues.
| +1 | install | 1m 32s | mvn install still works.
| +1 | eclipse:eclipse | 0m 33s | The patch built with
| | | | eclipse:eclipse.
| +1 | findbugs | 4m 37s | The patch does not introduce any
| | | | new Findbugs (version 2.0.3)
| | | | warnings.
| +1 | yarn tests | 0m 29s | Tests passed in hadoop-yarn-api.
| +1 | yarn tests | 2m 1s | Tests passed in hadoop-yarn-common.
| +1 | yarn tests | 0m 24s | Tests passed in
| | | | hadoop-yarn-server-common.
| +1 | yarn tests | 6m 5s | Tests passed in
| | | | hadoop-yarn-server-nodemanager.
| | | 55m 33s |
|| Subsystem || Report/Notes ||
============================================================================
| Patch URL | http://issues.apache.org/jira/secure/attachment/12727786/YARN-3534-3.patch |
| Optional Tests | javadoc javac unit findbugs checkstyle |
| git revision | trunk / bcf89dd |
| checkstyle | /home/jenkins/jenkins-slave/workspace/PreCommit-YARN-Build/../patchprocess/checkstyle-result-diff.txt |
| hadoop-yarn-api test log | /home/jenkins/jenkins-slave/workspace/PreCommit-YARN-Build/../patchprocess/testrun_hadoop-yarn-api.txt |
| hadoop-yarn-common test log | /home/jenkins/jenkins-slave/workspace/PreCommit-YARN-Build/../patchprocess/testrun_hadoop-yarn-common.txt |
| hadoop-yarn-server-common test log | /home/jenkins/jenkins-slave/workspace/PreCommit-YARN-Build/../patchprocess/testrun_hadoop-yarn-server-common.txt |
| hadoop-yarn-server-nodemanager test log | /home/jenkins/jenkins-slave/workspace/PreCommit-YARN-Build/../patchprocess/testrun_hadoop-yarn-server-nodemanager.txt |
| Test Results | https://builds.apache.org/job/PreCommit-YARN-Build/7489/testReport/ |
============================================================================
============================================================================
Adding comment to JIRA
============================================================================
============================================================================
Comment added.
199633bbfc6e6d1652f3a23bfa286b537055bee4 logged out
============================================================================
============================================================================
Finished build.
============================================================================
============================================================================
Build step 'Execute shell' marked build as failure
Archiving artifacts
Sending artifact delta relative to PreCommit-YARN-Build #7481
Archived 36 artifacts
Archive block size is 32768
Received 641 blocks and 156825686 bytes
Compression is 11.8%
Took 32 sec
[description-setter] Could not determine description.
Recording test results
Email was triggered for: Failure
Sending email for trigger: Failure
###################################################################################
############################## FAILED TESTS (if any) ##############################
All tests passed