You are viewing a plain text version of this content. The canonical link for it is here.
Posted to commits@phoenix.apache.org by Apache Jenkins Server <je...@builds.apache.org> on 2014/03/03 21:40:16 UTC

Build failed in Jenkins: Apache Phoenix - Branch:master #97

See <https://builds.apache.org/job/Phoenix/97/changes>

Changes:

[jamestaylor] PHOENIX-99 Automatic white list based upgrade from 2.2 to 3.0 (JamesTaylor)

[jamestaylor] PHOENIX-102 IndexMaintainer constructor doesn't set isMultiTenant correctly (JamesTaylor)

------------------------------------------
[...truncated 208 lines...]
Tests run: 3, Failures: 0, Errors: 0, Skipped: 1, Time elapsed: 28.884 sec - in org.apache.phoenix.end2end.OrderByTest
Running org.apache.phoenix.end2end.ArithmeticQueryTest
Tests run: 8, Failures: 0, Errors: 0, Skipped: 0, Time elapsed: 28.094 sec - in org.apache.phoenix.end2end.ArithmeticQueryTest
Running org.apache.phoenix.end2end.ReadIsolationLevelTest
Tests run: 2, Failures: 0, Errors: 0, Skipped: 0, Time elapsed: 25.483 sec - in org.apache.phoenix.end2end.ReadIsolationLevelTest
Running org.apache.phoenix.end2end.ColumnProjectionOptimizationTest
Tests run: 2, Failures: 0, Errors: 0, Skipped: 0, Time elapsed: 28.346 sec - in org.apache.phoenix.end2end.ColumnProjectionOptimizationTest
Running org.apache.phoenix.end2end.AutoCommitTest
Tests run: 1, Failures: 0, Errors: 0, Skipped: 0, Time elapsed: 19.174 sec - in org.apache.phoenix.end2end.AutoCommitTest
Running org.apache.phoenix.end2end.ReverseFunctionTest
Tests run: 5, Failures: 0, Errors: 0, Skipped: 0, Time elapsed: 27.202 sec - in org.apache.phoenix.end2end.ReverseFunctionTest
Running org.apache.phoenix.end2end.QueryTest
Tests run: 432, Failures: 0, Errors: 0, Skipped: 0, Time elapsed: 357.172 sec - in org.apache.phoenix.end2end.QueryTest
Running org.apache.phoenix.end2end.ViewTest
Tests run: 6, Failures: 0, Errors: 0, Skipped: 0, Time elapsed: 26.689 sec - in org.apache.phoenix.end2end.ViewTest
Running org.apache.phoenix.end2end.AlterTableTest
Tests run: 13, Failures: 0, Errors: 0, Skipped: 0, Time elapsed: 56.016 sec - in org.apache.phoenix.end2end.AlterTableTest
Running org.apache.phoenix.end2end.UpsertValuesTest
Tests run: 10, Failures: 0, Errors: 0, Skipped: 0, Time elapsed: 37.018 sec - in org.apache.phoenix.end2end.UpsertValuesTest
Running org.apache.phoenix.end2end.ServerExceptionTest
Tests run: 1, Failures: 0, Errors: 0, Skipped: 0, Time elapsed: 17.118 sec - in org.apache.phoenix.end2end.ServerExceptionTest
Running org.apache.phoenix.end2end.QueryPlanTest
Tests run: 1, Failures: 0, Errors: 0, Skipped: 0, Time elapsed: 26.425 sec - in org.apache.phoenix.end2end.QueryPlanTest
Running org.apache.phoenix.end2end.PercentileTest
Tests run: 17, Failures: 0, Errors: 0, Skipped: 0, Time elapsed: 27.51 sec - in org.apache.phoenix.end2end.PercentileTest
Running org.apache.phoenix.end2end.SequenceTest
Tests run: 21, Failures: 0, Errors: 0, Skipped: 0, Time elapsed: 29.062 sec - in org.apache.phoenix.end2end.SequenceTest
Running org.apache.phoenix.end2end.QueryExecWithoutSCNTest
Tests run: 1, Failures: 0, Errors: 0, Skipped: 0, Time elapsed: 19.044 sec - in org.apache.phoenix.end2end.QueryExecWithoutSCNTest
Running org.apache.phoenix.end2end.HashJoinTest
Tests run: 48, Failures: 0, Errors: 0, Skipped: 0, Time elapsed: 67.154 sec - in org.apache.phoenix.end2end.HashJoinTest
Running org.apache.phoenix.end2end.MD5FunctionTest
Tests run: 2, Failures: 0, Errors: 0, Skipped: 0, Time elapsed: 17.977 sec - in org.apache.phoenix.end2end.MD5FunctionTest
Running org.apache.phoenix.end2end.StatementHintsTest
Tests run: 2, Failures: 0, Errors: 0, Skipped: 0, Time elapsed: 26.497 sec - in org.apache.phoenix.end2end.StatementHintsTest
Running org.apache.phoenix.end2end.StddevTest
Tests run: 4, Failures: 0, Errors: 0, Skipped: 0, Time elapsed: 20.15 sec - in org.apache.phoenix.end2end.StddevTest
Running org.apache.phoenix.end2end.DistinctCountTest
Tests run: 9, Failures: 0, Errors: 0, Skipped: 0, Time elapsed: 26.899 sec - in org.apache.phoenix.end2end.DistinctCountTest
Running org.apache.phoenix.end2end.UpsertSelectAutoCommitTest
Tests run: 1, Failures: 0, Errors: 0, Skipped: 0, Time elapsed: 26.396 sec - in org.apache.phoenix.end2end.UpsertSelectAutoCommitTest
Running org.apache.phoenix.end2end.FunkyNamesTest
Tests run: 3, Failures: 0, Errors: 0, Skipped: 0, Time elapsed: 26.645 sec - in org.apache.phoenix.end2end.FunkyNamesTest
Running org.apache.phoenix.end2end.KeyOnlyTest
Tests run: 2, Failures: 0, Errors: 0, Skipped: 0, Time elapsed: 25.462 sec - in org.apache.phoenix.end2end.KeyOnlyTest
Running org.apache.phoenix.end2end.CustomEntityDataTest
Tests run: 3, Failures: 0, Errors: 0, Skipped: 0, Time elapsed: 27.119 sec - in org.apache.phoenix.end2end.CustomEntityDataTest
Running org.apache.phoenix.end2end.QueryDatabaseMetaDataTest
Tests run: 15, Failures: 0, Errors: 0, Skipped: 0, Time elapsed: 58.31 sec - in org.apache.phoenix.end2end.QueryDatabaseMetaDataTest
Running org.apache.phoenix.end2end.ArrayTest
Tests run: 29, Failures: 0, Errors: 0, Skipped: 0, Time elapsed: 37.132 sec - in org.apache.phoenix.end2end.ArrayTest
Running org.apache.phoenix.end2end.TenantSpecificTablesDMLTest
Tests run: 12, Failures: 0, Errors: 0, Skipped: 0, Time elapsed: 28.592 sec - in org.apache.phoenix.end2end.TenantSpecificTablesDMLTest
Running org.apache.phoenix.end2end.SkipRangeParallelIteratorRegionSplitterTest
Tests run: 8, Failures: 0, Errors: 0, Skipped: 0, Time elapsed: 26.993 sec - in org.apache.phoenix.end2end.SkipRangeParallelIteratorRegionSplitterTest
Running org.apache.phoenix.end2end.CompareDecimalToLongTest
Tests run: 8, Failures: 0, Errors: 0, Skipped: 0, Time elapsed: 27.171 sec - in org.apache.phoenix.end2end.CompareDecimalToLongTest
Running org.apache.phoenix.end2end.SpooledOrderByTest
Tests run: 3, Failures: 0, Errors: 0, Skipped: 1, Time elapsed: 26.522 sec - in org.apache.phoenix.end2end.SpooledOrderByTest
Running org.apache.phoenix.end2end.TenantSpecificViewIndexSaltedTest
Tests run: 1, Failures: 0, Errors: 0, Skipped: 0, Time elapsed: 26.44 sec - in org.apache.phoenix.end2end.TenantSpecificViewIndexSaltedTest
Running org.apache.phoenix.end2end.ExecuteStatementsTest
Tests run: 2, Failures: 0, Errors: 0, Skipped: 0, Time elapsed: 28.174 sec - in org.apache.phoenix.end2end.ExecuteStatementsTest
Running org.apache.phoenix.end2end.DynamicUpsertTest
Tests run: 7, Failures: 0, Errors: 0, Skipped: 0, Time elapsed: 18.146 sec - in org.apache.phoenix.end2end.DynamicUpsertTest
Running org.apache.phoenix.end2end.SortOrderFTest
Tests run: 29, Failures: 0, Errors: 0, Skipped: 0, Time elapsed: 27.118 sec - in org.apache.phoenix.end2end.SortOrderFTest
Running org.apache.phoenix.end2end.salted.SaltedTableVarLengthRowKeyTest
Tests run: 1, Failures: 0, Errors: 0, Skipped: 0, Time elapsed: 26.166 sec - in org.apache.phoenix.end2end.salted.SaltedTableVarLengthRowKeyTest
Running org.apache.phoenix.end2end.salted.SaltedTableTest
Tests run: 8, Failures: 0, Errors: 0, Skipped: 0, Time elapsed: 26.16 sec - in org.apache.phoenix.end2end.salted.SaltedTableTest
Running org.apache.phoenix.end2end.salted.SaltedTableUpsertSelectTest
Tests run: 5, Failures: 0, Errors: 0, Skipped: 0, Time elapsed: 26.924 sec - in org.apache.phoenix.end2end.salted.SaltedTableUpsertSelectTest
Running org.apache.phoenix.end2end.DynamicColumnTest
Tests run: 5, Failures: 0, Errors: 0, Skipped: 0, Time elapsed: 28.885 sec - in org.apache.phoenix.end2end.DynamicColumnTest
Running org.apache.phoenix.end2end.TenantSpecificViewIndexTest
Tests run: 1, Failures: 0, Errors: 0, Skipped: 0, Time elapsed: 28.286 sec - in org.apache.phoenix.end2end.TenantSpecificViewIndexTest
Running org.apache.phoenix.end2end.BinaryRowKeyTest
Tests run: 3, Failures: 0, Errors: 0, Skipped: 0, Time elapsed: 26.913 sec - in org.apache.phoenix.end2end.BinaryRowKeyTest
Running org.apache.phoenix.end2end.DynamicFamilyTest
Tests run: 4, Failures: 0, Errors: 0, Skipped: 0, Time elapsed: 28.321 sec - in org.apache.phoenix.end2end.DynamicFamilyTest
Running org.apache.phoenix.end2end.DefaultParallelIteratorsRegionSplitterTest
Tests run: 3, Failures: 1, Errors: 0, Skipped: 0, Time elapsed: 27.486 sec <<< FAILURE! - in org.apache.phoenix.end2end.DefaultParallelIteratorsRegionSplitterTest
testStatsManagerImpl(org.apache.phoenix.end2end.DefaultParallelIteratorsRegionSplitterTest)  Time elapsed: 0.761 sec  <<< FAILURE!
java.lang.AssertionError: null
	at org.junit.Assert.fail(Assert.java:86)
	at org.junit.Assert.assertTrue(Assert.java:41)
	at org.junit.Assert.assertTrue(Assert.java:52)
	at org.apache.phoenix.end2end.DefaultParallelIteratorsRegionSplitterTest.testStatsManagerImpl(DefaultParallelIteratorsRegionSplitterTest.java:292)

Running org.apache.phoenix.end2end.CSVLoaderTest
Tests run: 10, Failures: 0, Errors: 0, Skipped: 0, Time elapsed: 25.867 sec - in org.apache.phoenix.end2end.CSVLoaderTest
Running org.apache.phoenix.end2end.TenantSpecificTablesDDLTest
Tests run: 16, Failures: 0, Errors: 0, Skipped: 0, Time elapsed: 47.853 sec - in org.apache.phoenix.end2end.TenantSpecificTablesDDLTest
Running org.apache.phoenix.end2end.CoalesceFunctionTest
Tests run: 1, Failures: 0, Errors: 0, Skipped: 0, Time elapsed: 28.711 sec - in org.apache.phoenix.end2end.CoalesceFunctionTest
Running org.apache.phoenix.end2end.MultiCfQueryExecTest
Tests run: 7, Failures: 0, Errors: 0, Skipped: 0, Time elapsed: 31.467 sec - in org.apache.phoenix.end2end.MultiCfQueryExecTest
Running org.apache.phoenix.end2end.UpsertBigValuesTest
Tests run: 4, Failures: 0, Errors: 0, Skipped: 0, Time elapsed: 27.379 sec - in org.apache.phoenix.end2end.UpsertBigValuesTest
Running org.apache.phoenix.end2end.GroupByCaseTest
Tests run: 3, Failures: 0, Errors: 0, Skipped: 0, Time elapsed: 18.021 sec - in org.apache.phoenix.end2end.GroupByCaseTest
Running org.apache.phoenix.end2end.ProductMetricsTest
Tests run: 61, Failures: 0, Errors: 0, Skipped: 0, Time elapsed: 57.282 sec - in org.apache.phoenix.end2end.ProductMetricsTest
Running org.apache.phoenix.end2end.UpsertSelectTest
Tests run: 11, Failures: 0, Errors: 0, Skipped: 0, Time elapsed: 41.456 sec - in org.apache.phoenix.end2end.UpsertSelectTest
Running org.apache.phoenix.end2end.TopNTest
Tests run: 4, Failures: 0, Errors: 0, Skipped: 0, Time elapsed: 26.166 sec - in org.apache.phoenix.end2end.TopNTest
Running org.apache.phoenix.end2end.InMemoryOrderByTest
Tests run: 3, Failures: 0, Errors: 0, Skipped: 1, Time elapsed: 26.162 sec - in org.apache.phoenix.end2end.InMemoryOrderByTest
Running org.apache.phoenix.end2end.IsNullTest
Tests run: 1, Failures: 0, Errors: 0, Skipped: 0, Time elapsed: 18.017 sec - in org.apache.phoenix.end2end.IsNullTest
Running org.apache.phoenix.end2end.ToCharFunctionTest
Tests run: 10, Failures: 0, Errors: 0, Skipped: 0, Time elapsed: 26.014 sec - in org.apache.phoenix.end2end.ToCharFunctionTest
Running org.apache.phoenix.end2end.NativeHBaseTypesTest
Tests run: 7, Failures: 0, Errors: 0, Skipped: 0, Time elapsed: 26.499 sec - in org.apache.phoenix.end2end.NativeHBaseTypesTest
Running org.apache.phoenix.end2end.RoundFloorCeilFunctionsEnd2EndTest
Tests run: 21, Failures: 0, Errors: 0, Skipped: 0, Time elapsed: 25.68 sec - in org.apache.phoenix.end2end.RoundFloorCeilFunctionsEnd2EndTest
Running org.apache.phoenix.end2end.index.SaltedIndexTest
Tests run: 3, Failures: 0, Errors: 0, Skipped: 0, Time elapsed: 46.873 sec - in org.apache.phoenix.end2end.index.SaltedIndexTest
Running org.apache.phoenix.end2end.index.MutableIndexFailureTest
Tests run: 1, Failures: 0, Errors: 0, Skipped: 0, Time elapsed: 56.505 sec - in org.apache.phoenix.end2end.index.MutableIndexFailureTest
Running org.apache.phoenix.end2end.index.ImmutableIndexTest
Tests run: 7, Failures: 0, Errors: 0, Skipped: 0, Time elapsed: 37.122 sec - in org.apache.phoenix.end2end.index.ImmutableIndexTest
Running org.apache.phoenix.end2end.index.MutableIndexTest
Tests run: 11, Failures: 0, Errors: 0, Skipped: 0, Time elapsed: 59.797 sec - in org.apache.phoenix.end2end.index.MutableIndexTest
Running org.apache.phoenix.end2end.index.DropViewTest
Tests run: 1, Failures: 0, Errors: 0, Skipped: 0, Time elapsed: 26.193 sec - in org.apache.phoenix.end2end.index.DropViewTest
Running org.apache.phoenix.end2end.index.IndexMetadataTest
Tests run: 4, Failures: 0, Errors: 0, Skipped: 0, Time elapsed: 35.612 sec - in org.apache.phoenix.end2end.index.IndexMetadataTest
Running org.apache.phoenix.end2end.ToNumberFunctionTest
Tests run: 18, Failures: 0, Errors: 0, Skipped: 0, Time elapsed: 26.65 sec - in org.apache.phoenix.end2end.ToNumberFunctionTest
Running org.apache.phoenix.end2end.SpillableGroupByTest
Tests run: 1, Failures: 0, Errors: 0, Skipped: 0, Time elapsed: 25.857 sec - in org.apache.phoenix.end2end.SpillableGroupByTest
Running org.apache.phoenix.end2end.SkipScanQueryTest
Tests run: 7, Failures: 0, Errors: 0, Skipped: 0, Time elapsed: 28.431 sec - in org.apache.phoenix.end2end.SkipScanQueryTest
Running org.apache.phoenix.end2end.ExtendedQueryExecTest
Tests run: 4, Failures: 0, Errors: 0, Skipped: 0, Time elapsed: 28.686 sec - in org.apache.phoenix.end2end.ExtendedQueryExecTest
Running org.apache.phoenix.end2end.SaltedViewTest
Tests run: 1, Failures: 0, Errors: 0, Skipped: 0, Time elapsed: 27.529 sec - in org.apache.phoenix.end2end.SaltedViewTest
Running org.apache.phoenix.end2end.VariableLengthPKTest
Tests run: 49, Failures: 0, Errors: 0, Skipped: 0, Time elapsed: 50.743 sec - in org.apache.phoenix.end2end.VariableLengthPKTest
Running org.apache.phoenix.end2end.DeleteTest
Tests run: 13, Failures: 0, Errors: 0, Skipped: 0, Time elapsed: 39.751 sec - in org.apache.phoenix.end2end.DeleteTest
Running org.apache.phoenix.end2end.RowValueConstructorTest
Tests run: 24, Failures: 0, Errors: 0, Skipped: 0, Time elapsed: 38.762 sec - in org.apache.phoenix.end2end.RowValueConstructorTest
Running org.apache.phoenix.end2end.CreateTableTest
Tests run: 2, Failures: 0, Errors: 0, Skipped: 0, Time elapsed: 28.382 sec - in org.apache.phoenix.end2end.CreateTableTest
Running org.apache.phoenix.compile.ViewCompilerTest
Tests run: 3, Failures: 0, Errors: 0, Skipped: 0, Time elapsed: 0.08 sec - in org.apache.phoenix.compile.ViewCompilerTest
Running org.apache.phoenix.compile.QueryMetaDataTest
Tests run: 32, Failures: 0, Errors: 0, Skipped: 0, Time elapsed: 0.077 sec - in org.apache.phoenix.compile.QueryMetaDataTest
Running org.apache.phoenix.compile.HavingCompilerTest
Tests run: 10, Failures: 0, Errors: 0, Skipped: 0, Time elapsed: 0.045 sec - in org.apache.phoenix.compile.HavingCompilerTest
Running org.apache.phoenix.compile.WhereCompilerTest
Tests run: 41, Failures: 0, Errors: 0, Skipped: 1, Time elapsed: 0.119 sec - in org.apache.phoenix.compile.WhereCompilerTest
Running org.apache.phoenix.compile.SelectStatementRewriterTest
Tests run: 5, Failures: 0, Errors: 0, Skipped: 0, Time elapsed: 0.028 sec - in org.apache.phoenix.compile.SelectStatementRewriterTest
Running org.apache.phoenix.compile.LimitCompilerTest
Tests run: 6, Failures: 0, Errors: 0, Skipped: 0, Time elapsed: 0.034 sec - in org.apache.phoenix.compile.LimitCompilerTest
Running org.apache.phoenix.compile.WhereOptimizerTest
Tests run: 89, Failures: 0, Errors: 0, Skipped: 0, Time elapsed: 0.203 sec - in org.apache.phoenix.compile.WhereOptimizerTest
Running org.apache.phoenix.compile.JoinQueryCompilerTest
Tests run: 2, Failures: 0, Errors: 0, Skipped: 0, Time elapsed: 0.158 sec - in org.apache.phoenix.compile.JoinQueryCompilerTest
Running org.apache.phoenix.compile.QueryOptimizerTest
Tests run: 25, Failures: 0, Errors: 0, Skipped: 0, Time elapsed: 0.191 sec - in org.apache.phoenix.compile.QueryOptimizerTest
Running org.apache.phoenix.compile.QueryCompilerTest
Tests run: 77, Failures: 0, Errors: 0, Skipped: 0, Time elapsed: 0.287 sec - in org.apache.phoenix.compile.QueryCompilerTest
Running org.apache.phoenix.compile.ScanRangesTest
Tests run: 34, Failures: 0, Errors: 0, Skipped: 0, Time elapsed: 0.04 sec - in org.apache.phoenix.compile.ScanRangesTest
Running org.apache.phoenix.compile.StatementHintsCompilationTest
Tests run: 3, Failures: 0, Errors: 0, Skipped: 0, Time elapsed: 0.037 sec - in org.apache.phoenix.compile.StatementHintsCompilationTest
Running org.apache.phoenix.parse.QueryParserTest
Tests run: 46, Failures: 0, Errors: 0, Skipped: 0, Time elapsed: 0.015 sec - in org.apache.phoenix.parse.QueryParserTest
Running org.apache.phoenix.schema.PDataTypeTest
Tests run: 22, Failures: 0, Errors: 0, Skipped: 0, Time elapsed: 0.01 sec - in org.apache.phoenix.schema.PDataTypeTest
Running org.apache.phoenix.schema.SchemaUtilTest
Tests run: 3, Failures: 0, Errors: 0, Skipped: 0, Time elapsed: 0 sec - in org.apache.phoenix.schema.SchemaUtilTest
Running org.apache.phoenix.schema.PMetaDataImplTest
Tests run: 1, Failures: 0, Errors: 0, Skipped: 0, Time elapsed: 0.018 sec - in org.apache.phoenix.schema.PMetaDataImplTest
Running org.apache.phoenix.schema.SortOrderTest
Tests run: 7, Failures: 0, Errors: 0, Skipped: 0, Time elapsed: 0.007 sec - in org.apache.phoenix.schema.SortOrderTest
Running org.apache.phoenix.schema.PDataTypeForArraysTest
Tests run: 60, Failures: 0, Errors: 0, Skipped: 0, Time elapsed: 0.023 sec - in org.apache.phoenix.schema.PDataTypeForArraysTest
Running org.apache.phoenix.schema.RowKeyValueAccessorTest
Tests run: 1, Failures: 0, Errors: 0, Skipped: 0, Time elapsed: 0.058 sec - in org.apache.phoenix.schema.RowKeyValueAccessorTest
Running org.apache.phoenix.schema.RowKeySchemaTest
Tests run: 6, Failures: 0, Errors: 0, Skipped: 0, Time elapsed: 0.058 sec - in org.apache.phoenix.schema.RowKeySchemaTest
Running org.apache.phoenix.schema.ValueBitSetTest
Tests run: 2, Failures: 0, Errors: 0, Skipped: 0, Time elapsed: 0.016 sec - in org.apache.phoenix.schema.ValueBitSetTest
Running org.apache.phoenix.index.IndexMaintainerTest
Tests run: 17, Failures: 0, Errors: 0, Skipped: 0, Time elapsed: 0.221 sec - in org.apache.phoenix.index.IndexMaintainerTest
Running org.apache.phoenix.expression.SortOrderExpressionTest
Tests run: 23, Failures: 0, Errors: 0, Skipped: 0, Time elapsed: 0.011 sec - in org.apache.phoenix.expression.SortOrderExpressionTest
Running org.apache.phoenix.expression.ColumnExpressionTest
Tests run: 4, Failures: 0, Errors: 0, Skipped: 0, Time elapsed: 0.001 sec - in org.apache.phoenix.expression.ColumnExpressionTest
Running org.apache.phoenix.expression.LikeExpressionTest
Tests run: 1, Failures: 0, Errors: 0, Skipped: 0, Time elapsed: 0.001 sec - in org.apache.phoenix.expression.LikeExpressionTest
Running org.apache.phoenix.expression.CoerceExpressionTest
Tests run: 5, Failures: 0, Errors: 0, Skipped: 0, Time elapsed: 0.002 sec - in org.apache.phoenix.expression.CoerceExpressionTest
Running org.apache.hadoop.hbase.regionserver.wal.TestReadWriteKeyValuesWithCodec
Tests run: 2, Failures: 0, Errors: 0, Skipped: 0, Time elapsed: 0.129 sec - in org.apache.hadoop.hbase.regionserver.wal.TestReadWriteKeyValuesWithCodec
Running org.apache.hadoop.hbase.regionserver.wal.TestWALReplayWithIndexWritesAndCompressedWAL
Tests run: 1, Failures: 0, Errors: 0, Skipped: 0, Time elapsed: 22.429 sec - in org.apache.hadoop.hbase.regionserver.wal.TestWALReplayWithIndexWritesAndCompressedWAL
Running org.apache.hadoop.hbase.regionserver.wal.TestWALReplayWithIndexWritesAndUncompressedWALInHBase_094_9
Tests run: 1, Failures: 0, Errors: 0, Skipped: 0, Time elapsed: 21.711 sec - in org.apache.hadoop.hbase.regionserver.wal.TestWALReplayWithIndexWritesAndUncompressedWALInHBase_094_9

Results :

Failed tests: 
  DefaultParallelIteratorsRegionSplitterTest.testStatsManagerImpl:292 null

Tests run: 1739, Failures: 1, Errors: 0, Skipped: 8

[INFO] ------------------------------------------------------------------------
[INFO] Reactor Summary:
[INFO] 
[INFO] Apache Phoenix .................................... SUCCESS [2.097s]
[INFO] Phoenix Hadoop Compatibility ...................... SUCCESS [1.988s]
[INFO] Phoenix Core ...................................... FAILURE [48:37.053s]
[INFO] Phoenix - Flume ................................... SKIPPED
[INFO] Phoenix - Pig ..................................... SKIPPED
[INFO] Phoenix Hadoop1 Compatibility ..................... SKIPPED
[INFO] Phoenix Assebmly .................................. SKIPPED
[INFO] ------------------------------------------------------------------------
[INFO] BUILD FAILURE
[INFO] ------------------------------------------------------------------------
[INFO] Total time: 48:41.908s
[INFO] Finished at: Mon Mar 03 20:38:48 UTC 2014
[INFO] Final Memory: 28M/346M
[INFO] ------------------------------------------------------------------------
[ERROR] Failed to execute goal org.apache.maven.plugins:maven-surefire-plugin:2.16:test (default-test) on project phoenix-core: There are test failures.
[ERROR] 
[ERROR] Please refer to <https://builds.apache.org/job/Phoenix/ws/phoenix-core/target/surefire-reports> for the individual test results.
[ERROR] -> [Help 1]
[ERROR] 
[ERROR] To see the full stack trace of the errors, re-run Maven with the -e switch.
[ERROR] Re-run Maven using the -X switch to enable full debug logging.
[ERROR] 
[ERROR] For more information about the errors and possible solutions, please read the following articles:
[ERROR] [Help 1] http://cwiki.apache.org/confluence/display/MAVEN/MojoFailureException
[ERROR] 
[ERROR] After correcting the problems, you can resume the build with the command
[ERROR]   mvn <goals> -rf :phoenix-core
Build step 'Invoke top-level Maven targets' marked build as failure
Archiving artifacts
Updating PHOENIX-99
Updating PHOENIX-102
Recording test results

Jenkins build is back to normal : Apache Phoenix - Branch:master #98

Posted by Apache Jenkins Server <je...@builds.apache.org>.
See <https://builds.apache.org/job/Phoenix/98/changes>