You are viewing a plain text version of this content. The canonical link for it is here.
Posted to builds@beam.apache.org by Apache Jenkins Server <je...@builds.apache.org> on 2023/08/06 17:19:55 UTC

Build failed in Jenkins: beam_PostCommit_XVR_Flink #7192

See <https://ci-beam.apache.org/job/beam_PostCommit_XVR_Flink/7192/display/redirect>

Changes:


------------------------------------------
[...truncated 1.13 MB...]

apache_beam/utils/subprocess_server.py:88: RuntimeError
------------------------------ Captured log call -------------------------------
INFO     apache_beam.utils.subprocess_server:subprocess_server.py:239 Using pre-built snapshot at <https://ci-beam.apache.org/job/beam_PostCommit_XVR_Flink/ws/src/sdks/java/extensions/sql/expansion-service/build/libs/beam-sdks-java-extensions-sql-expansion-service-2.50.0-SNAPSHOT.jar>
INFO     root:external.py:929 Starting a JAR-based expansion service from JAR <https://ci-beam.apache.org/job/beam_PostCommit_XVR_Flink/ws/src/sdks/java/extensions/sql/expansion-service/build/libs/beam-sdks-java-extensions-sql-expansion-service-2.50.0-SNAPSHOT.jar> 
INFO     apache_beam.utils.subprocess_server:subprocess_server.py:116 Starting service with ['java' '-jar' '<https://ci-beam.apache.org/job/beam_PostCommit_XVR_Flink/ws/src/sdks/java/extensions/sql/expansion-service/build/libs/beam-sdks-java-extensions-sql-expansion-service-2.50.0-SNAPSHOT.jar'> '55427' '--filesToStage=<https://ci-beam.apache.org/job/beam_PostCommit_XVR_Flink/ws/src/sdks/java/extensions/sql/expansion-service/build/libs/beam-sdks-java-extensions-sql-expansion-service-2.50.0-SNAPSHOT.jar']>
INFO     apache_beam.utils.subprocess_server:subprocess_server.py:126 Error: Invalid or corrupt jarfile <https://ci-beam.apache.org/job/beam_PostCommit_XVR_Flink/ws/src/sdks/java/extensions/sql/expansion-service/build/libs/beam-sdks-java-extensions-sql-expansion-service-2.50.0-SNAPSHOT.jar>
ERROR    apache_beam.utils.subprocess_server:subprocess_server.py:87 Starting job service with ['java', '-jar', '<https://ci-beam.apache.org/job/beam_PostCommit_XVR_Flink/ws/src/sdks/java/extensions/sql/expansion-service/build/libs/beam-sdks-java-extensions-sql-expansion-service-2.50.0-SNAPSHOT.jar',> '55427', '--filesToStage=<https://ci-beam.apache.org/job/beam_PostCommit_XVR_Flink/ws/src/sdks/java/extensions/sql/expansion-service/build/libs/beam-sdks-java-extensions-sql-expansion-service-2.50.0-SNAPSHOT.jar']>
ERROR    apache_beam.utils.subprocess_server:subprocess_server.py:101 Error bringing up service
Traceback (most recent call last):
  File "<https://ci-beam.apache.org/job/beam_PostCommit_XVR_Flink/ws/src/sdks/python/apache_beam/utils/subprocess_server.py",> line 88, in start
    raise RuntimeError(
RuntimeError: Service failed to start up with error 1
_________________ SqlTransformTest.test_zetasql_generate_data __________________

self = <apache_beam.transforms.sql_test.SqlTransformTest testMethod=test_zetasql_generate_data>

    def test_zetasql_generate_data(self):
      with TestPipeline() as p:
>       out = p | SqlTransform(
            """SELECT
              CAST(1 AS INT64) AS `int`,
              CAST('foo' AS STRING) AS `str`,
              CAST(3.14  AS FLOAT64) AS `flt`""",
            dialect="zetasql")

apache_beam/transforms/sql_test.py:154: 
_ _ _ _ _ _ _ _ _ _ _ _ _ _ _ _ _ _ _ _ _ _ _ _ _ _ _ _ _ _ _ _ _ _ _ _ _ _ _ _ 
apache_beam/transforms/ptransform.py:614: in __ror__
    result = p.apply(self, pvalueish, label)
apache_beam/pipeline.py:712: in apply
    pvalueish_result = self.runner.apply(transform, pvalueish, self._options)
apache_beam/runners/runner.py:185: in apply
    return m(transform, input, options)
apache_beam/runners/runner.py:215: in apply_PTransform
    return transform.expand(input)
apache_beam/transforms/external.py:678: in expand
    with ExternalTransform.service(expansion_service) as service:
/usr/lib/python3.8/contextlib.py:113: in __enter__
    return next(self.gen)
apache_beam/transforms/external.py:733: in service
    with expansion_service as stub:
apache_beam/transforms/external.py:944: in __enter__
    self._service = self._service_provider.__enter__()
apache_beam/utils/subprocess_server.py:72: in __enter__
    return self.start()
_ _ _ _ _ _ _ _ _ _ _ _ _ _ _ _ _ _ _ _ _ _ _ _ _ _ _ _ _ _ _ _ _ _ _ _ _ _ _ _ 

self = <apache_beam.utils.subprocess_server.JavaJarServer object at 0x7fb89a88f7f0>

    def start(self):
      try:
        endpoint = self.start_process()
        wait_secs = .1
        channel_options = [("grpc.max_receive_message_length", -1),
                           ("grpc.max_send_message_length", -1)]
        channel = grpc.insecure_channel(endpoint, options=channel_options)
        channel_ready = grpc.channel_ready_future(channel)
        while True:
          if self._process is not None and self._process.poll() is not None:
            _LOGGER.error("Starting job service with %s", self._process.args)
>           raise RuntimeError(
                'Service failed to start up with error %s' % self._process.poll())
E               RuntimeError: Service failed to start up with error 1

apache_beam/utils/subprocess_server.py:88: RuntimeError
------------------------------ Captured log call -------------------------------
INFO     apache_beam.utils.subprocess_server:subprocess_server.py:239 Using pre-built snapshot at <https://ci-beam.apache.org/job/beam_PostCommit_XVR_Flink/ws/src/sdks/java/extensions/sql/expansion-service/build/libs/beam-sdks-java-extensions-sql-expansion-service-2.50.0-SNAPSHOT.jar>
INFO     root:external.py:929 Starting a JAR-based expansion service from JAR <https://ci-beam.apache.org/job/beam_PostCommit_XVR_Flink/ws/src/sdks/java/extensions/sql/expansion-service/build/libs/beam-sdks-java-extensions-sql-expansion-service-2.50.0-SNAPSHOT.jar> 
INFO     apache_beam.utils.subprocess_server:subprocess_server.py:116 Starting service with ['java' '-jar' '<https://ci-beam.apache.org/job/beam_PostCommit_XVR_Flink/ws/src/sdks/java/extensions/sql/expansion-service/build/libs/beam-sdks-java-extensions-sql-expansion-service-2.50.0-SNAPSHOT.jar'> '39201' '--filesToStage=<https://ci-beam.apache.org/job/beam_PostCommit_XVR_Flink/ws/src/sdks/java/extensions/sql/expansion-service/build/libs/beam-sdks-java-extensions-sql-expansion-service-2.50.0-SNAPSHOT.jar']>
INFO     apache_beam.utils.subprocess_server:subprocess_server.py:126 Error: Invalid or corrupt jarfile <https://ci-beam.apache.org/job/beam_PostCommit_XVR_Flink/ws/src/sdks/java/extensions/sql/expansion-service/build/libs/beam-sdks-java-extensions-sql-expansion-service-2.50.0-SNAPSHOT.jar>
ERROR    apache_beam.utils.subprocess_server:subprocess_server.py:87 Starting job service with ['java', '-jar', '<https://ci-beam.apache.org/job/beam_PostCommit_XVR_Flink/ws/src/sdks/java/extensions/sql/expansion-service/build/libs/beam-sdks-java-extensions-sql-expansion-service-2.50.0-SNAPSHOT.jar',> '39201', '--filesToStage=<https://ci-beam.apache.org/job/beam_PostCommit_XVR_Flink/ws/src/sdks/java/extensions/sql/expansion-service/build/libs/beam-sdks-java-extensions-sql-expansion-service-2.50.0-SNAPSHOT.jar']>
ERROR    apache_beam.utils.subprocess_server:subprocess_server.py:101 Error bringing up service
Traceback (most recent call last):
  File "<https://ci-beam.apache.org/job/beam_PostCommit_XVR_Flink/ws/src/sdks/python/apache_beam/utils/subprocess_server.py",> line 88, in start
    raise RuntimeError(
RuntimeError: Service failed to start up with error 1
=============================== warnings summary ===============================
../../build/gradleenv/1922375555/lib/python3.8/site-packages/hdfs/config.py:15
  <https://ci-beam.apache.org/job/beam_PostCommit_XVR_Flink/ws/src/build/gradleenv/1922375555/lib/python3.8/site-packages/hdfs/config.py>:15: DeprecationWarning: the imp module is deprecated in favour of importlib; see the module's documentation for alternative uses
    from imp import load_source

../../build/gradleenv/1922375555/lib/python3.8/site-packages/google/rpc/__init__.py:18
  <https://ci-beam.apache.org/job/beam_PostCommit_XVR_Flink/ws/src/build/gradleenv/1922375555/lib/python3.8/site-packages/google/rpc/__init__.py>:18: DeprecationWarning: pkg_resources is deprecated as an API. See https://setuptools.pypa.io/en/latest/pkg_resources.html
    import pkg_resources

../../build/gradleenv/1922375555/lib/python3.8/site-packages/pkg_resources/__init__.py:2871: 20 warnings
  <https://ci-beam.apache.org/job/beam_PostCommit_XVR_Flink/ws/src/build/gradleenv/1922375555/lib/python3.8/site-packages/pkg_resources/__init__.py>:2871: DeprecationWarning: Deprecated call to `pkg_resources.declare_namespace('google')`.
  Implementing implicit namespace packages (as specified in PEP 420) is preferred to `pkg_resources.declare_namespace`. See https://setuptools.pypa.io/en/latest/references/keywords.html#keyword-namespace-packages
    declare_namespace(pkg)

../../build/gradleenv/1922375555/lib/python3.8/site-packages/pkg_resources/__init__.py:2871: 16 warnings
  <https://ci-beam.apache.org/job/beam_PostCommit_XVR_Flink/ws/src/build/gradleenv/1922375555/lib/python3.8/site-packages/pkg_resources/__init__.py>:2871: DeprecationWarning: Deprecated call to `pkg_resources.declare_namespace('google.cloud')`.
  Implementing implicit namespace packages (as specified in PEP 420) is preferred to `pkg_resources.declare_namespace`. See https://setuptools.pypa.io/en/latest/references/keywords.html#keyword-namespace-packages
    declare_namespace(pkg)

../../build/gradleenv/1922375555/lib/python3.8/site-packages/pkg_resources/__init__.py:2350
../../build/gradleenv/1922375555/lib/python3.8/site-packages/pkg_resources/__init__.py:2350
../../build/gradleenv/1922375555/lib/python3.8/site-packages/pkg_resources/__init__.py:2350
../../build/gradleenv/1922375555/lib/python3.8/site-packages/pkg_resources/__init__.py:2350
  <https://ci-beam.apache.org/job/beam_PostCommit_XVR_Flink/ws/src/build/gradleenv/1922375555/lib/python3.8/site-packages/pkg_resources/__init__.py>:2350: DeprecationWarning: Deprecated call to `pkg_resources.declare_namespace('google')`.
  Implementing implicit namespace packages (as specified in PEP 420) is preferred to `pkg_resources.declare_namespace`. See https://setuptools.pypa.io/en/latest/references/keywords.html#keyword-namespace-packages
    declare_namespace(parent)

../../build/gradleenv/1922375555/lib/python3.8/site-packages/pkg_resources/__init__.py:2871
  <https://ci-beam.apache.org/job/beam_PostCommit_XVR_Flink/ws/src/build/gradleenv/1922375555/lib/python3.8/site-packages/pkg_resources/__init__.py>:2871: DeprecationWarning: Deprecated call to `pkg_resources.declare_namespace('google.logging')`.
  Implementing implicit namespace packages (as specified in PEP 420) is preferred to `pkg_resources.declare_namespace`. See https://setuptools.pypa.io/en/latest/references/keywords.html#keyword-namespace-packages
    declare_namespace(pkg)

../../build/gradleenv/1922375555/lib/python3.8/site-packages/pkg_resources/__init__.py:2871
  <https://ci-beam.apache.org/job/beam_PostCommit_XVR_Flink/ws/src/build/gradleenv/1922375555/lib/python3.8/site-packages/pkg_resources/__init__.py>:2871: DeprecationWarning: Deprecated call to `pkg_resources.declare_namespace('google.iam')`.
  Implementing implicit namespace packages (as specified in PEP 420) is preferred to `pkg_resources.declare_namespace`. See https://setuptools.pypa.io/en/latest/references/keywords.html#keyword-namespace-packages
    declare_namespace(pkg)

../../build/gradleenv/1922375555/lib/python3.8/site-packages/google/rpc/__init__.py:20
  <https://ci-beam.apache.org/job/beam_PostCommit_XVR_Flink/ws/src/build/gradleenv/1922375555/lib/python3.8/site-packages/google/rpc/__init__.py>:20: DeprecationWarning: Deprecated call to `pkg_resources.declare_namespace('google.rpc')`.
  Implementing implicit namespace packages (as specified in PEP 420) is preferred to `pkg_resources.declare_namespace`. See https://setuptools.pypa.io/en/latest/references/keywords.html#keyword-namespace-packages
    pkg_resources.declare_namespace(__name__)

apache_beam/typehints/pandas_type_compatibility_test.py:67
  <https://ci-beam.apache.org/job/beam_PostCommit_XVR_Flink/ws/src/sdks/python/apache_beam/typehints/pandas_type_compatibility_test.py>:67: FutureWarning: pandas.Int64Index is deprecated and will be removed from pandas in a future version. Use pandas.Index with the appropriate dtype instead.
    }).set_index(pd.Int64Index(range(123, 223), name='an_index')),

apache_beam/typehints/pandas_type_compatibility_test.py:90
  <https://ci-beam.apache.org/job/beam_PostCommit_XVR_Flink/ws/src/sdks/python/apache_beam/typehints/pandas_type_compatibility_test.py>:90: FutureWarning: pandas.Int64Index is deprecated and will be removed from pandas in a future version. Use pandas.Index with the appropriate dtype instead.
    pd.Int64Index(range(123, 223), name='an_index'),

apache_beam/typehints/pandas_type_compatibility_test.py:91
  <https://ci-beam.apache.org/job/beam_PostCommit_XVR_Flink/ws/src/sdks/python/apache_beam/typehints/pandas_type_compatibility_test.py>:91: FutureWarning: pandas.Int64Index is deprecated and will be removed from pandas in a future version. Use pandas.Index with the appropriate dtype instead.
    pd.Int64Index(range(475, 575), name='another_index'),

apache_beam/transforms/sql_test.py::SqlTransformTest::test_agg
apache_beam/transforms/sql_test.py::SqlTransformTest::test_filter
apache_beam/transforms/sql_test.py::SqlTransformTest::test_generate_data
apache_beam/transforms/sql_test.py::SqlTransformTest::test_map
apache_beam/transforms/sql_test.py::SqlTransformTest::test_project
apache_beam/transforms/sql_test.py::SqlTransformTest::test_row
apache_beam/transforms/sql_test.py::SqlTransformTest::test_tagged_join
apache_beam/transforms/sql_test.py::SqlTransformTest::test_windowing_before_sql
apache_beam/transforms/sql_test.py::SqlTransformTest::test_zetasql_generate_data
  <https://ci-beam.apache.org/job/beam_PostCommit_XVR_Flink/ws/src/sdks/python/apache_beam/transforms/external.py>:676: BeamDeprecationWarning: options is deprecated since First stable release. References to <pipeline>.options will not be supported
    self._expansion_service, pipeline.options)

-- Docs: https://docs.pytest.org/en/stable/how-to/capture-warnings.html
- generated xml file: <https://ci-beam.apache.org/job/beam_PostCommit_XVR_Flink/ws/src/sdks/python/pytest_xlangSqlValidateRunner.xml> -
=========================== short test summary info ============================
FAILED apache_beam/transforms/sql_test.py::SqlTransformTest::test_agg - RuntimeError: Service failed to start up with error 1
FAILED apache_beam/transforms/sql_test.py::SqlTransformTest::test_filter - RuntimeError: Service failed to start up with error 1
FAILED apache_beam/transforms/sql_test.py::SqlTransformTest::test_generate_data - RuntimeError: Service failed to start up with error 1
FAILED apache_beam/transforms/sql_test.py::SqlTransformTest::test_map - RuntimeError: Service failed to start up with error 1
FAILED apache_beam/transforms/sql_test.py::SqlTransformTest::test_project - RuntimeError: Service failed to start up with error 1
FAILED apache_beam/transforms/sql_test.py::SqlTransformTest::test_row - RuntimeError: Service failed to start up with error 1
FAILED apache_beam/transforms/sql_test.py::SqlTransformTest::test_tagged_join - RuntimeError: Service failed to start up with error 1
FAILED apache_beam/transforms/sql_test.py::SqlTransformTest::test_windowing_before_sql - RuntimeError: Service failed to start up with error 1
FAILED apache_beam/transforms/sql_test.py::SqlTransformTest::test_zetasql_generate_data - RuntimeError: Service failed to start up with error 1
========= 9 failed, 14 skipped, 6945 deselected, 57 warnings in 10.18s =========

> Task :runners:flink:1.15:job-server:validatesCrossLanguageRunnerPythonUsingSql FAILED

> Task :runners:flink:1.15:job-server:flinkJobServerCleanup
Skipping invalid pid: 4093230.

> Task :runners:flink:1.15:job-server:validatesCrossLanguageRunnerCleanup
Stopping expansion service pid: 4103933.
Stopping expansion service pid: 4103934.

FAILURE: Build completed with 4 failures.

1: Task failed with an exception.
-----------
* Where:
Build file '<https://ci-beam.apache.org/job/beam_PostCommit_XVR_Flink/ws/src/sdks/go/test/build.gradle'> line: 217

* What went wrong:
Execution failed for task ':runners:flink:1.15:job-server:validatesCrossLanguageRunnerGoUsingJava'.
> Process 'command 'sh'' finished with non-zero exit value 1

* Try:
> Run with --stacktrace option to get the stack trace.
> Run with --info or --debug option to get more log output.
==============================================================================

2: Task failed with an exception.
-----------
* What went wrong:
Execution failed for task ':runners:flink:1.15:job-server:validatesCrossLanguageRunnerJavaUsingPython'.
> There were failing tests. See the report at: file://<https://ci-beam.apache.org/job/beam_PostCommit_XVR_Flink/ws/src/runners/flink/1.15/job-server/build/reports/tests/validatesCrossLanguageRunnerJavaUsingPython/index.html>

* Try:
> Run with --stacktrace option to get the stack trace.
> Run with --info or --debug option to get more log output.
==============================================================================

3: Task failed with an exception.
-----------
* What went wrong:
Execution failed for task ':runners:flink:1.15:job-server:validatesCrossLanguageRunnerPythonUsingJava'.
> Process 'command 'sh'' finished with non-zero exit value 1

* Try:
> Run with --stacktrace option to get the stack trace.
> Run with --info or --debug option to get more log output.
==============================================================================

4: Task failed with an exception.
-----------
* What went wrong:
Execution failed for task ':runners:flink:1.15:job-server:validatesCrossLanguageRunnerPythonUsingSql'.
> Process 'command 'sh'' finished with non-zero exit value 1

* Try:
> Run with --stacktrace option to get the stack trace.
> Run with --info or --debug option to get more log output.
==============================================================================

* Get more help at https://help.gradle.org

Deprecated Gradle features were used in this build, making it incompatible with Gradle 8.0.

You can use '--warning-mode all' to show the individual deprecation warnings and determine if they come from your own scripts or plugins.

See https://docs.gradle.org/7.6.2/userguide/command_line_interface.html#sec:command_line_warnings

Execution optimizations have been disabled for 1 invalid unit(s) of work during this build to ensure correctness.
Please consult deprecation warnings for more details.

BUILD FAILED in 1h 1m 39s
281 actionable tasks: 184 executed, 85 from cache, 12 up-to-date

Publishing build scan...

Publishing failed.

The response from https://ge.apache.org/scans/publish/gradle/3.13.2/token was not from Gradle Enterprise.
The specified server address may be incorrect, or your network environment may be interfering.

Please report this problem to your Gradle Enterprise administrator via https://ge.apache.org/help and include the following via copy/paste:

----------
Gradle version: 7.6.2
Plugin version: 3.13.2
Request URL: https://ge.apache.org/scans/publish/gradle/3.13.2/token
Request ID: a7055e64-b666-489d-9b63-aee97d30a61e
Response status code: 502
Response content type: text/html
----------

Build step 'Invoke Gradle script' changed build result to FAILURE
Build step 'Invoke Gradle script' marked build as failure

---------------------------------------------------------------------
To unsubscribe, e-mail: builds-unsubscribe@beam.apache.org
For additional commands, e-mail: builds-help@beam.apache.org


Jenkins build is back to normal : beam_PostCommit_XVR_Flink #7198

Posted by Apache Jenkins Server <je...@builds.apache.org>.
See <https://ci-beam.apache.org/job/beam_PostCommit_XVR_Flink/7198/display/redirect>


---------------------------------------------------------------------
To unsubscribe, e-mail: builds-unsubscribe@beam.apache.org
For additional commands, e-mail: builds-help@beam.apache.org


Build failed in Jenkins: beam_PostCommit_XVR_Flink #7197

Posted by Apache Jenkins Server <je...@builds.apache.org>.
See <https://ci-beam.apache.org/job/beam_PostCommit_XVR_Flink/7197/display/redirect>

Changes:


------------------------------------------
[...truncated 131.21 KB...]
> Task :runners:flink:1.15:copyTestSourceOverrides
> Task :runners:flink:1.15:compileTestJava FROM-CACHE
> Task :runners:flink:1.15:copyTestResourcesOverrides NO-SOURCE
> Task :runners:flink:1.15:processTestResources
> Task :runners:flink:1.15:testClasses
> Task :runners:flink:1.15:testJar
> Task :runners:portability:java:createCheckerFrameworkManifest
> Task :runners:portability:java:compileJava FROM-CACHE
> Task :runners:portability:java:processResources NO-SOURCE
> Task :runners:portability:java:classes UP-TO-DATE
> Task :runners:portability:java:jar
> Task :runners:portability:java:compileTestJava FROM-CACHE
> Task :runners:portability:java:processTestResources NO-SOURCE
> Task :runners:portability:java:testClasses UP-TO-DATE
> Task :runners:portability:java:testJar
> Task :sdks:java:extensions:python:createCheckerFrameworkManifest
> Task :sdks:java:transform-service:launcher:createCheckerFrameworkManifest
> Task :sdks:java:transform-service:launcher:compileJava FROM-CACHE
> Task :sdks:java:transform-service:launcher:processResources
> Task :sdks:java:transform-service:launcher:classes
> Task :sdks:java:transform-service:launcher:shadowJar FROM-CACHE
> Task :release:go-licenses:go:createLicenses

> Task :sdks:python:installGcpTest
Collecting scipy>=1.5.0 (from scikit-learn>=0.20.0->apache-beam==2.50.0.dev0)

> Task :sdks:go:container:copyGolangLicenses
> Task :sdks:java:extensions:python:compileJava FROM-CACHE
> Task :sdks:java:extensions:python:processResources
> Task :sdks:java:extensions:python:classes
> Task :sdks:java:io:debezium:expansion-service:shadowJar FROM-CACHE
> Task :sdks:go:container:dockerPrepare
> Task :sdks:java:extensions:python:compileTestJava FROM-CACHE
> Task :sdks:java:extensions:python:processTestResources NO-SOURCE
> Task :sdks:java:extensions:python:testClasses UP-TO-DATE

> Task :sdks:python:installGcpTest
  Using cached scipy-1.10.1-cp38-cp38-manylinux_2_17_x86_64.manylinux2014_x86_64.whl (34.5 MB)

> Task :sdks:java:io:debezium:expansion-service:startShadowScripts

> Task :sdks:go:container:docker
#1 [internal] load build definition from Dockerfile
#1 transferring dockerfile: 1.70kB 0.0s done
#1 DONE 0.1s

#2 [internal] load .dockerignore
#2 transferring context: 2B done
#2 DONE 0.1s

#3 [internal] load metadata for docker.io/library/debian:bullseye
#3 DONE 0.5s

#4 [1/7] FROM docker.io/library/debian:bullseye@sha256:630454da4c59041a2bca987a0d54c68962f1d6ea37a3641bd61db42b753234f2
#4 resolve docker.io/library/debian:bullseye@sha256:630454da4c59041a2bca987a0d54c68962f1d6ea37a3641bd61db42b753234f2 0.0s done
#4 sha256:630454da4c59041a2bca987a0d54c68962f1d6ea37a3641bd61db42b753234f2 1.85kB / 1.85kB done
#4 sha256:2c407480ad7c98bdc551dbb38b92acb674dc130c8298f2e0fa2ad34da9078637 529B / 529B done
#4 sha256:35073ea3b0b7ab55ea55e1a111a8ded11a58ef2b6b3ae0e706160520e612df6f 1.46kB / 1.46kB done
#4 DONE 0.2s

#5 [2/7] RUN apt-get update &&     DEBIAN_FRONTEND=noninteractive apt-get install -y         ca-certificates         &&     rm -rf /var/lib/apt/lists/*
#5 ...

#6 [internal] load build context
#6 transferring context: 24.10MB 0.4s done
#6 DONE 0.5s

#5 [2/7] RUN apt-get update &&     DEBIAN_FRONTEND=noninteractive apt-get install -y         ca-certificates         &&     rm -rf /var/lib/apt/lists/*
#5 1.191 Get:1 http://deb.debian.org/debian bullseye InRelease [116 kB]
#5 1.307 Get:2 http://deb.debian.org/debian-security bullseye-security InRelease [48.4 kB]
#5 1.353 Get:3 http://deb.debian.org/debian bullseye-updates InRelease [44.1 kB]
#5 1.740 Get:4 http://deb.debian.org/debian bullseye/main amd64 Packages [8183 kB]

> Task :sdks:java:io:debezium:expansion-service:shadowDistTar

> Task :sdks:go:container:docker
#5 2.060 Get:5 http://deb.debian.org/debian-security bullseye-security/main amd64 Packages [253 kB]
#5 2.314 Get:6 http://deb.debian.org/debian bullseye-updates/main amd64 Packages [17.3 kB]
#5 3.822 Fetched 8661 kB in 3s (3192 kB/s)
#5 3.822 Reading package lists...
#5 4.886 Reading package lists...
#5 5.915 Building dependency tree...
#5 6.175 Reading state information...
#5 6.566 The following additional packages will be installed:
#5 6.567   openssl
#5 6.605 The following NEW packages will be installed:
#5 6.608   ca-certificates openssl
#5 6.694 0 upgraded, 2 newly installed, 0 to remove and 2 not upgraded.
#5 6.694 Need to get 1012 kB of archives.
#5 6.694 After this operation, 1892 kB of additional disk space will be used.
#5 6.694 Get:1 http://deb.debian.org/debian-security bullseye-security/main amd64 openssl amd64 1.1.1n-0+deb11u5 [854 kB]
#5 6.834 Get:2 http://deb.debian.org/debian bullseye/main amd64 ca-certificates all 20210119 [158 kB]
#5 7.148 debconf: delaying package configuration, since apt-utils is not installed
#5 7.222 Fetched 1012 kB in 0s (4807 kB/s)
#5 7.274 Selecting previously unselected package openssl.
#5 7.274 (Reading database ... (Reading database ... 5%(Reading database ... 10%(Reading database ... 15%(Reading database ... 20%(Reading database ... 25%(Reading database ... 30%(Reading database ... 35%(Reading database ... 40%(Reading database ... 45%(Reading database ... 50%(Reading database ... 55%(Reading database ... 60%(Reading database ... 65%(Reading database ... 70%(Reading database ... 75%(Reading database ... 80%(Reading database ... 85%(Reading database ... 90%(Reading database ... 95%(Reading database ... 100%(Reading database ... 6664 files and directories currently installed.)
#5 7.277 Preparing to unpack .../openssl_1.1.1n-0+deb11u5_amd64.deb ...
#5 7.282 Unpacking openssl (1.1.1n-0+deb11u5) ...
#5 7.489 Selecting previously unselected package ca-certificates.
#5 7.491 Preparing to unpack .../ca-certificates_20210119_all.deb ...
#5 7.498 Unpacking ca-certificates (20210119) ...
#5 7.645 Setting up openssl (1.1.1n-0+deb11u5) ...
#5 7.668 Setting up ca-certificates (20210119) ...

> Task :sdks:java:io:expansion-service:startShadowScripts
> Task :sdks:java:io:expansion-service:shadowDistTar
> Task :sdks:java:io:debezium:expansion-service:shadowDistZip
> Task :sdks:java:io:debezium:expansion-service:assemble

> Task :sdks:go:container:docker
#5 10.09 Updating certificates in /etc/ssl/certs...

> Task :sdks:java:io:debezium:expansion-service:analyzeClassesDependencies
> Task :sdks:java:io:debezium:expansion-service:analyzeTestClassesDependencies SKIPPED
> Task :sdks:java:io:debezium:expansion-service:analyzeDependencies
> Task :sdks:java:io:debezium:expansion-service:checkstyleMain NO-SOURCE
> Task :sdks:java:io:debezium:expansion-service:checkstyleTest NO-SOURCE
> Task :sdks:java:io:debezium:expansion-service:javadoc NO-SOURCE
> Task :sdks:java:io:debezium:expansion-service:spotbugsMain NO-SOURCE
> Task :sdks:java:io:debezium:expansion-service:spotbugsTest SKIPPED
> Task :sdks:java:io:debezium:expansion-service:spotlessJava FROM-CACHE
> Task :sdks:java:io:debezium:expansion-service:spotlessJavaCheck UP-TO-DATE
> Task :sdks:java:io:debezium:expansion-service:spotlessCheck UP-TO-DATE
> Task :sdks:java:io:debezium:expansion-service:test NO-SOURCE
> Task :sdks:java:io:debezium:expansion-service:check
> Task :sdks:java:io:debezium:expansion-service:build

> Task :sdks:python:installGcpTest
  Building wheel for apache-beam (setup.py): finished with status 'done'
  Created wheel for apache-beam: filename=apache_beam-2.50.0.dev0-py3-none-any.whl size=3257342 sha256=a7216a38e859a6a81353e7134b39853faac18eb3be74d7de2e9606c9407927b5
  Stored in directory: /home/jenkins/.cache/pip/wheels/3f/e8/d8/20b9fe5ab7d6dd3807759d1d8f044a2a1c55703d573f8fdcdc
Successfully built apache-beam

> Task :sdks:java:io:google-cloud-platform:expansion-service:distZip
> Task :sdks:java:io:google-cloud-platform:expansion-service:compileTestJava NO-SOURCE
> Task :sdks:java:io:google-cloud-platform:expansion-service:processTestResources NO-SOURCE
> Task :sdks:java:io:google-cloud-platform:expansion-service:testClasses UP-TO-DATE
> Task :sdks:java:io:google-cloud-platform:expansion-service:packageTests

> Task :sdks:go:container:docker
#5 12.35 129 added, 0 removed; done.
#5 12.44 Processing triggers for ca-certificates (20210119) ...
#5 12.47 Updating certificates in /etc/ssl/certs...

> Task :sdks:java:io:expansion-service:shadowDistZip
> Task :sdks:java:io:expansion-service:assemble

> Task :sdks:python:installGcpTest
Installing collected packages: sortedcontainers, pytz, docopt, crcmod, zstandard, wrapt, websocket-client, urllib3, typing-extensions, threadpoolctl, tenacity, sqlparse, six, shapely, scipy, regex, pyyaml, pyparsing, pymysql, PyJWT, pyhamcrest, pycparser, pyasn1, pyarrow, psycopg2-binary, protobuf, portalocker, parameterized, overrides, orjson, objsize, mock, joblib, jmespath, iniconfig, idna, greenlet, google-crc32c, fasteners, fastavro, execnet, exceptiongroup, dnspython, dill, deprecation, cloudpickle, charset-normalizer, certifi, attrs, sqlalchemy, scikit-learn, rsa, requests, python-dateutil, pytest, pymongo, pydot, pyasn1-modules, proto-plus, isodate, hypothesis, httplib2, googleapis-common-protos, google-resumable-media, cffi, requests_mock, pytest-xdist, pytest-timeout, pandas, oauth2client, hdfs, grpcio-status, google-auth, freezegun, docker, cryptography, botocore, azure-core, testcontainers, s3transfer, grpc-google-iam-v1, google-auth-httplib2, google-apitools, google-api-core, azure-storage-blob, apache-beam, msal, google-cloud-core, boto3, msal-extensions, google-cloud-vision, google-cloud-videointelligence, google-cloud-storage, google-cloud-spanner, google-cloud-resource-manager, google-cloud-recommendations-ai, google-cloud-pubsub, google-cloud-language, google-cloud-dlp, google-cloud-datastore, google-cloud-bigtable, google-cloud-bigquery-storage, google-cloud-bigquery, google-cloud-pubsublite, google-cloud-aiplatform, azure-identity

> Task :sdks:java:io:expansion-service:analyzeClassesDependencies
> Task :sdks:java:io:expansion-service:analyzeTestClassesDependencies SKIPPED
> Task :sdks:java:io:expansion-service:analyzeDependencies
> Task :sdks:java:io:expansion-service:checkstyleMain NO-SOURCE
> Task :sdks:java:io:expansion-service:checkstyleTest NO-SOURCE
> Task :sdks:java:io:expansion-service:javadoc NO-SOURCE
> Task :sdks:java:io:expansion-service:spotbugsMain NO-SOURCE
> Task :sdks:java:io:expansion-service:spotbugsTest SKIPPED
> Task :sdks:java:io:expansion-service:spotlessJava FROM-CACHE
> Task :sdks:java:io:expansion-service:spotlessJavaCheck UP-TO-DATE
> Task :sdks:java:io:expansion-service:spotlessCheck UP-TO-DATE
> Task :sdks:java:io:expansion-service:test NO-SOURCE
> Task :sdks:java:io:expansion-service:check
> Task :sdks:java:io:expansion-service:build

> Task :sdks:go:container:docker
#5 14.12 0 added, 0 removed; done.
#5 14.12 Running hooks in /etc/ca-certificates/update.d...
#5 14.15 done.
#5 DONE 18.6s

#7 [3/7] ADD target/linux_amd64/boot /opt/apache/beam/
#7 DONE 0.6s

#8 [4/7] COPY target/LICENSE /opt/apache/beam/
#8 DONE 0.4s

#9 [5/7] COPY target/NOTICE /opt/apache/beam/
#9 DONE 0.4s

#10 [6/7] COPY target/go-licenses/* /opt/apache/beam/third_party_licenses/golang/
#10 DONE 0.5s

#11 [7/7] RUN if [ "true" = "false" ] ; then     rm -rf /opt/apache/beam/third_party_licenses ;    fi
#11 DONE 1.2s

#12 exporting to image
#12 exporting layers
#12 exporting layers 0.3s done
#12 writing image sha256:cd3666ebebd5c345a1246f234e247f3e5f914d7f477cfc130299a1f70d73f179 done
#12 naming to docker.io/apache/beam_go_sdk:latest done
#12 DONE 0.3s

> Task :sdks:java:io:google-cloud-platform:expansion-service:shadowJar

> Task :sdks:python:installGcpTest
Successfully installed PyJWT-2.8.0 apache-beam-2.50.0.dev0 attrs-23.1.0 azure-core-1.28.0 azure-identity-1.14.0b2 azure-storage-blob-12.17.0 boto3-1.28.21 botocore-1.31.21 certifi-2023.7.22 cffi-1.15.1 charset-normalizer-3.2.0 cloudpickle-2.2.1 crcmod-1.7 cryptography-41.0.3 deprecation-2.1.0 dill-0.3.1.1 dnspython-2.4.1 docker-6.1.3 docopt-0.6.2 exceptiongroup-1.1.2 execnet-2.0.2 fastavro-1.8.2 fasteners-0.18 freezegun-1.2.2 google-api-core-2.12.0.dev0 google-apitools-0.5.31 google-auth-2.22.0 google-auth-httplib2-0.1.0 google-cloud-aiplatform-1.29.0 google-cloud-bigquery-3.11.4 google-cloud-bigquery-storage-2.22.0 google-cloud-bigtable-2.20.0 google-cloud-core-2.3.3 google-cloud-datastore-2.16.1 google-cloud-dlp-3.12.2 google-cloud-language-2.10.1 google-cloud-pubsub-2.18.2 google-cloud-pubsublite-1.8.3 google-cloud-recommendations-ai-0.10.4 google-cloud-resource-manager-1.10.3 google-cloud-spanner-3.40.0 google-cloud-storage-2.10.0 google-cloud-videointelligence-2.11.3 google-cloud-vision-3.4.4 google-crc32c-1.5.0 google-resumable-media-2.5.0 googleapis-common-protos-1.60.0 greenlet-3.0.0a1 grpc-google-iam-v1-0.12.6 grpcio-status-1.57.0rc1 hdfs-2.7.0 httplib2-0.22.0 hypothesis-6.82.2 idna-3.4 iniconfig-2.0.0 isodate-0.6.1 jmespath-1.0.1 joblib-1.3.1 mock-5.1.0 msal-1.24.0b1 msal-extensions-1.0.0 oauth2client-4.1.3 objsize-0.6.1 orjson-3.9.3 overrides-6.5.0 pandas-1.5.3 parameterized-0.9.0 portalocker-2.7.0 proto-plus-1.22.3 protobuf-4.23.4 psycopg2-binary-2.9.7 pyarrow-11.0.0 pyasn1-0.5.0 pyasn1-modules-0.3.0 pycparser-2.21 pydot-1.4.2 pyhamcrest-2.0.4 pymongo-4.4.1 pymysql-1.1.0 pyparsing-3.1.1 pytest-7.4.0 pytest-timeout-2.1.0 pytest-xdist-3.3.1 python-dateutil-2.8.2 pytz-2023.3 pyyaml-6.0.1 regex-2023.6.3 requests-2.31.0 requests_mock-1.11.0 rsa-4.9 s3transfer-0.6.1 scikit-learn-1.3.0 scipy-1.10.1 shapely-1.8.5.post1 six-1.16.0 sortedcontainers-2.4.0 sqlalchemy-1.4.49 sqlparse-0.4.4 tenacity-8.2.2 testcontainers-3.7.1 threadpoolctl-3.2.0 typing-extensions-4.7.1 urllib3-1.26.16 websocket-client-1.6.1 wrapt-1.15.0 zstandard-0.21.0

> Task :sdks:java:io:google-cloud-platform:expansion-service:startShadowScripts
> Task :sdks:java:io:google-cloud-platform:expansion-service:shadowDistTar
> Task :sdks:java:io:google-cloud-platform:expansion-service:shadowDistZip
> Task :sdks:java:io:google-cloud-platform:expansion-service:assemble
> Task :sdks:java:io:google-cloud-platform:expansion-service:analyzeClassesDependencies
> Task :sdks:java:io:google-cloud-platform:expansion-service:analyzeTestClassesDependencies SKIPPED
> Task :sdks:java:io:google-cloud-platform:expansion-service:analyzeDependencies
> Task :sdks:java:io:google-cloud-platform:expansion-service:checkstyleMain NO-SOURCE
> Task :sdks:java:io:google-cloud-platform:expansion-service:checkstyleTest NO-SOURCE
> Task :sdks:java:io:google-cloud-platform:expansion-service:javadoc NO-SOURCE
> Task :sdks:java:io:google-cloud-platform:expansion-service:spotbugsMain NO-SOURCE
> Task :sdks:java:io:google-cloud-platform:expansion-service:spotbugsTest SKIPPED
> Task :sdks:java:io:google-cloud-platform:expansion-service:spotlessJava FROM-CACHE
> Task :sdks:java:io:google-cloud-platform:expansion-service:spotlessJavaCheck UP-TO-DATE
> Task :sdks:java:io:google-cloud-platform:expansion-service:spotlessCheck UP-TO-DATE
> Task :sdks:java:io:google-cloud-platform:expansion-service:test NO-SOURCE
> Task :sdks:java:io:google-cloud-platform:expansion-service:check
> Task :sdks:java:io:google-cloud-platform:expansion-service:build
> Task :runners:flink:1.15:job-server:shadowJar
> Task :runners:flink:1.15:job-server:flinkJobServerSetup
> Task :runners:flink:1.15:job-server:flinkJobServerCleanup

FAILURE: Build failed with an exception.

* What went wrong:
Execution failed for task ':sdks:python:container:py38:docker'.
> Process 'command 'docker'' finished with non-zero exit value 1

* Try:
> Run with --stacktrace option to get the stack trace.
> Run with --info or --debug option to get more log output.

* Get more help at https://help.gradle.org

Deprecated Gradle features were used in this build, making it incompatible with Gradle 8.0.

You can use '--warning-mode all' to show the individual deprecation warnings and determine if they come from your own scripts or plugins.

See https://docs.gradle.org/7.6.2/userguide/command_line_interface.html#sec:command_line_warnings

Execution optimizations have been disabled for 1 invalid unit(s) of work during this build to ensure correctness.
Please consult deprecation warnings for more details.

BUILD FAILED in 5m 58s
274 actionable tasks: 188 executed, 74 from cache, 12 up-to-date

Publishing build scan...
https://ge.apache.org/s/sdkqbf3mppujg

Build step 'Invoke Gradle script' changed build result to FAILURE
Build step 'Invoke Gradle script' marked build as failure

---------------------------------------------------------------------
To unsubscribe, e-mail: builds-unsubscribe@beam.apache.org
For additional commands, e-mail: builds-help@beam.apache.org


beam_PostCommit_XVR_Flink - Build # 7196 - Aborted!

Posted by Apache Jenkins Server <je...@builds.apache.org>.
beam_PostCommit_XVR_Flink - Build # 7196 - Aborted:

Check console output at https://ci-beam.apache.org/job/beam_PostCommit_XVR_Flink/7196/ to view the results.

Build failed in Jenkins: beam_PostCommit_XVR_Flink #7195

Posted by Apache Jenkins Server <je...@builds.apache.org>.
See <https://ci-beam.apache.org/job/beam_PostCommit_XVR_Flink/7195/display/redirect>

Changes:


------------------------------------------
[...truncated 1.08 MB...]

    def start(self):
      try:
        endpoint = self.start_process()
        wait_secs = .1
        channel_options = [("grpc.max_receive_message_length", -1),
                           ("grpc.max_send_message_length", -1)]
        channel = grpc.insecure_channel(endpoint, options=channel_options)
        channel_ready = grpc.channel_ready_future(channel)
        while True:
          if self._process is not None and self._process.poll() is not None:
            _LOGGER.error("Starting job service with %s", self._process.args)
>           raise RuntimeError(
                'Service failed to start up with error %s' % self._process.poll())
E               RuntimeError: Service failed to start up with error 1

apache_beam/utils/subprocess_server.py:88: RuntimeError
------------------------------ Captured log call -------------------------------
INFO     apache_beam.utils.subprocess_server:subprocess_server.py:239 Using pre-built snapshot at <https://ci-beam.apache.org/job/beam_PostCommit_XVR_Flink/ws/src/sdks/java/extensions/sql/expansion-service/build/libs/beam-sdks-java-extensions-sql-expansion-service-2.50.0-SNAPSHOT.jar>
INFO     root:external.py:929 Starting a JAR-based expansion service from JAR <https://ci-beam.apache.org/job/beam_PostCommit_XVR_Flink/ws/src/sdks/java/extensions/sql/expansion-service/build/libs/beam-sdks-java-extensions-sql-expansion-service-2.50.0-SNAPSHOT.jar> 
INFO     apache_beam.utils.subprocess_server:subprocess_server.py:116 Starting service with ['java' '-jar' '<https://ci-beam.apache.org/job/beam_PostCommit_XVR_Flink/ws/src/sdks/java/extensions/sql/expansion-service/build/libs/beam-sdks-java-extensions-sql-expansion-service-2.50.0-SNAPSHOT.jar'> '34351' '--filesToStage=<https://ci-beam.apache.org/job/beam_PostCommit_XVR_Flink/ws/src/sdks/java/extensions/sql/expansion-service/build/libs/beam-sdks-java-extensions-sql-expansion-service-2.50.0-SNAPSHOT.jar']>
INFO     apache_beam.utils.subprocess_server:subprocess_server.py:126 Error: Invalid or corrupt jarfile <https://ci-beam.apache.org/job/beam_PostCommit_XVR_Flink/ws/src/sdks/java/extensions/sql/expansion-service/build/libs/beam-sdks-java-extensions-sql-expansion-service-2.50.0-SNAPSHOT.jar>
ERROR    apache_beam.utils.subprocess_server:subprocess_server.py:87 Starting job service with ['java', '-jar', '<https://ci-beam.apache.org/job/beam_PostCommit_XVR_Flink/ws/src/sdks/java/extensions/sql/expansion-service/build/libs/beam-sdks-java-extensions-sql-expansion-service-2.50.0-SNAPSHOT.jar',> '34351', '--filesToStage=<https://ci-beam.apache.org/job/beam_PostCommit_XVR_Flink/ws/src/sdks/java/extensions/sql/expansion-service/build/libs/beam-sdks-java-extensions-sql-expansion-service-2.50.0-SNAPSHOT.jar']>
ERROR    apache_beam.utils.subprocess_server:subprocess_server.py:101 Error bringing up service
Traceback (most recent call last):
  File "<https://ci-beam.apache.org/job/beam_PostCommit_XVR_Flink/ws/src/sdks/python/apache_beam/utils/subprocess_server.py",> line 88, in start
    raise RuntimeError(
RuntimeError: Service failed to start up with error 1
_________________ SqlTransformTest.test_zetasql_generate_data __________________

self = <apache_beam.transforms.sql_test.SqlTransformTest testMethod=test_zetasql_generate_data>

    def test_zetasql_generate_data(self):
      with TestPipeline() as p:
>       out = p | SqlTransform(
            """SELECT
              CAST(1 AS INT64) AS `int`,
              CAST('foo' AS STRING) AS `str`,
              CAST(3.14  AS FLOAT64) AS `flt`""",
            dialect="zetasql")

apache_beam/transforms/sql_test.py:154: 
_ _ _ _ _ _ _ _ _ _ _ _ _ _ _ _ _ _ _ _ _ _ _ _ _ _ _ _ _ _ _ _ _ _ _ _ _ _ _ _ 
apache_beam/transforms/ptransform.py:614: in __ror__
    result = p.apply(self, pvalueish, label)
apache_beam/pipeline.py:712: in apply
    pvalueish_result = self.runner.apply(transform, pvalueish, self._options)
apache_beam/runners/runner.py:185: in apply
    return m(transform, input, options)
apache_beam/runners/runner.py:215: in apply_PTransform
    return transform.expand(input)
apache_beam/transforms/external.py:678: in expand
    with ExternalTransform.service(expansion_service) as service:
/usr/lib/python3.8/contextlib.py:113: in __enter__
    return next(self.gen)
apache_beam/transforms/external.py:733: in service
    with expansion_service as stub:
apache_beam/transforms/external.py:944: in __enter__
    self._service = self._service_provider.__enter__()
apache_beam/utils/subprocess_server.py:72: in __enter__
    return self.start()
_ _ _ _ _ _ _ _ _ _ _ _ _ _ _ _ _ _ _ _ _ _ _ _ _ _ _ _ _ _ _ _ _ _ _ _ _ _ _ _ 

self = <apache_beam.utils.subprocess_server.JavaJarServer object at 0x7f5315f14af0>

    def start(self):
      try:
        endpoint = self.start_process()
        wait_secs = .1
        channel_options = [("grpc.max_receive_message_length", -1),
                           ("grpc.max_send_message_length", -1)]
        channel = grpc.insecure_channel(endpoint, options=channel_options)
        channel_ready = grpc.channel_ready_future(channel)
        while True:
          if self._process is not None and self._process.poll() is not None:
            _LOGGER.error("Starting job service with %s", self._process.args)
>           raise RuntimeError(
                'Service failed to start up with error %s' % self._process.poll())
E               RuntimeError: Service failed to start up with error 1

apache_beam/utils/subprocess_server.py:88: RuntimeError
------------------------------ Captured log call -------------------------------
INFO     apache_beam.utils.subprocess_server:subprocess_server.py:239 Using pre-built snapshot at <https://ci-beam.apache.org/job/beam_PostCommit_XVR_Flink/ws/src/sdks/java/extensions/sql/expansion-service/build/libs/beam-sdks-java-extensions-sql-expansion-service-2.50.0-SNAPSHOT.jar>
INFO     root:external.py:929 Starting a JAR-based expansion service from JAR <https://ci-beam.apache.org/job/beam_PostCommit_XVR_Flink/ws/src/sdks/java/extensions/sql/expansion-service/build/libs/beam-sdks-java-extensions-sql-expansion-service-2.50.0-SNAPSHOT.jar> 
INFO     apache_beam.utils.subprocess_server:subprocess_server.py:116 Starting service with ['java' '-jar' '<https://ci-beam.apache.org/job/beam_PostCommit_XVR_Flink/ws/src/sdks/java/extensions/sql/expansion-service/build/libs/beam-sdks-java-extensions-sql-expansion-service-2.50.0-SNAPSHOT.jar'> '54087' '--filesToStage=<https://ci-beam.apache.org/job/beam_PostCommit_XVR_Flink/ws/src/sdks/java/extensions/sql/expansion-service/build/libs/beam-sdks-java-extensions-sql-expansion-service-2.50.0-SNAPSHOT.jar']>
INFO     apache_beam.utils.subprocess_server:subprocess_server.py:126 Error: Invalid or corrupt jarfile <https://ci-beam.apache.org/job/beam_PostCommit_XVR_Flink/ws/src/sdks/java/extensions/sql/expansion-service/build/libs/beam-sdks-java-extensions-sql-expansion-service-2.50.0-SNAPSHOT.jar>
ERROR    apache_beam.utils.subprocess_server:subprocess_server.py:87 Starting job service with ['java', '-jar', '<https://ci-beam.apache.org/job/beam_PostCommit_XVR_Flink/ws/src/sdks/java/extensions/sql/expansion-service/build/libs/beam-sdks-java-extensions-sql-expansion-service-2.50.0-SNAPSHOT.jar',> '54087', '--filesToStage=<https://ci-beam.apache.org/job/beam_PostCommit_XVR_Flink/ws/src/sdks/java/extensions/sql/expansion-service/build/libs/beam-sdks-java-extensions-sql-expansion-service-2.50.0-SNAPSHOT.jar']>
ERROR    apache_beam.utils.subprocess_server:subprocess_server.py:101 Error bringing up service
Traceback (most recent call last):
  File "<https://ci-beam.apache.org/job/beam_PostCommit_XVR_Flink/ws/src/sdks/python/apache_beam/utils/subprocess_server.py",> line 88, in start
    raise RuntimeError(
RuntimeError: Service failed to start up with error 1
=============================== warnings summary ===============================
../../build/gradleenv/1922375555/lib/python3.8/site-packages/hdfs/config.py:15
  <https://ci-beam.apache.org/job/beam_PostCommit_XVR_Flink/ws/src/build/gradleenv/1922375555/lib/python3.8/site-packages/hdfs/config.py>:15: DeprecationWarning: the imp module is deprecated in favour of importlib; see the module's documentation for alternative uses
    from imp import load_source

../../build/gradleenv/1922375555/lib/python3.8/site-packages/google/rpc/__init__.py:18
  <https://ci-beam.apache.org/job/beam_PostCommit_XVR_Flink/ws/src/build/gradleenv/1922375555/lib/python3.8/site-packages/google/rpc/__init__.py>:18: DeprecationWarning: pkg_resources is deprecated as an API. See https://setuptools.pypa.io/en/latest/pkg_resources.html
    import pkg_resources

../../build/gradleenv/1922375555/lib/python3.8/site-packages/pkg_resources/__init__.py:2871: 20 warnings
  <https://ci-beam.apache.org/job/beam_PostCommit_XVR_Flink/ws/src/build/gradleenv/1922375555/lib/python3.8/site-packages/pkg_resources/__init__.py>:2871: DeprecationWarning: Deprecated call to `pkg_resources.declare_namespace('google')`.
  Implementing implicit namespace packages (as specified in PEP 420) is preferred to `pkg_resources.declare_namespace`. See https://setuptools.pypa.io/en/latest/references/keywords.html#keyword-namespace-packages
    declare_namespace(pkg)

../../build/gradleenv/1922375555/lib/python3.8/site-packages/pkg_resources/__init__.py:2871: 16 warnings
  <https://ci-beam.apache.org/job/beam_PostCommit_XVR_Flink/ws/src/build/gradleenv/1922375555/lib/python3.8/site-packages/pkg_resources/__init__.py>:2871: DeprecationWarning: Deprecated call to `pkg_resources.declare_namespace('google.cloud')`.
  Implementing implicit namespace packages (as specified in PEP 420) is preferred to `pkg_resources.declare_namespace`. See https://setuptools.pypa.io/en/latest/references/keywords.html#keyword-namespace-packages
    declare_namespace(pkg)

../../build/gradleenv/1922375555/lib/python3.8/site-packages/pkg_resources/__init__.py:2350
../../build/gradleenv/1922375555/lib/python3.8/site-packages/pkg_resources/__init__.py:2350
../../build/gradleenv/1922375555/lib/python3.8/site-packages/pkg_resources/__init__.py:2350
../../build/gradleenv/1922375555/lib/python3.8/site-packages/pkg_resources/__init__.py:2350
  <https://ci-beam.apache.org/job/beam_PostCommit_XVR_Flink/ws/src/build/gradleenv/1922375555/lib/python3.8/site-packages/pkg_resources/__init__.py>:2350: DeprecationWarning: Deprecated call to `pkg_resources.declare_namespace('google')`.
  Implementing implicit namespace packages (as specified in PEP 420) is preferred to `pkg_resources.declare_namespace`. See https://setuptools.pypa.io/en/latest/references/keywords.html#keyword-namespace-packages
    declare_namespace(parent)

../../build/gradleenv/1922375555/lib/python3.8/site-packages/pkg_resources/__init__.py:2871
  <https://ci-beam.apache.org/job/beam_PostCommit_XVR_Flink/ws/src/build/gradleenv/1922375555/lib/python3.8/site-packages/pkg_resources/__init__.py>:2871: DeprecationWarning: Deprecated call to `pkg_resources.declare_namespace('google.logging')`.
  Implementing implicit namespace packages (as specified in PEP 420) is preferred to `pkg_resources.declare_namespace`. See https://setuptools.pypa.io/en/latest/references/keywords.html#keyword-namespace-packages
    declare_namespace(pkg)

../../build/gradleenv/1922375555/lib/python3.8/site-packages/pkg_resources/__init__.py:2871
  <https://ci-beam.apache.org/job/beam_PostCommit_XVR_Flink/ws/src/build/gradleenv/1922375555/lib/python3.8/site-packages/pkg_resources/__init__.py>:2871: DeprecationWarning: Deprecated call to `pkg_resources.declare_namespace('google.iam')`.
  Implementing implicit namespace packages (as specified in PEP 420) is preferred to `pkg_resources.declare_namespace`. See https://setuptools.pypa.io/en/latest/references/keywords.html#keyword-namespace-packages
    declare_namespace(pkg)

../../build/gradleenv/1922375555/lib/python3.8/site-packages/google/rpc/__init__.py:20
  <https://ci-beam.apache.org/job/beam_PostCommit_XVR_Flink/ws/src/build/gradleenv/1922375555/lib/python3.8/site-packages/google/rpc/__init__.py>:20: DeprecationWarning: Deprecated call to `pkg_resources.declare_namespace('google.rpc')`.
  Implementing implicit namespace packages (as specified in PEP 420) is preferred to `pkg_resources.declare_namespace`. See https://setuptools.pypa.io/en/latest/references/keywords.html#keyword-namespace-packages
    pkg_resources.declare_namespace(__name__)

apache_beam/typehints/pandas_type_compatibility_test.py:67
  <https://ci-beam.apache.org/job/beam_PostCommit_XVR_Flink/ws/src/sdks/python/apache_beam/typehints/pandas_type_compatibility_test.py>:67: FutureWarning: pandas.Int64Index is deprecated and will be removed from pandas in a future version. Use pandas.Index with the appropriate dtype instead.
    }).set_index(pd.Int64Index(range(123, 223), name='an_index')),

apache_beam/typehints/pandas_type_compatibility_test.py:90
  <https://ci-beam.apache.org/job/beam_PostCommit_XVR_Flink/ws/src/sdks/python/apache_beam/typehints/pandas_type_compatibility_test.py>:90: FutureWarning: pandas.Int64Index is deprecated and will be removed from pandas in a future version. Use pandas.Index with the appropriate dtype instead.
    pd.Int64Index(range(123, 223), name='an_index'),

apache_beam/typehints/pandas_type_compatibility_test.py:91
  <https://ci-beam.apache.org/job/beam_PostCommit_XVR_Flink/ws/src/sdks/python/apache_beam/typehints/pandas_type_compatibility_test.py>:91: FutureWarning: pandas.Int64Index is deprecated and will be removed from pandas in a future version. Use pandas.Index with the appropriate dtype instead.
    pd.Int64Index(range(475, 575), name='another_index'),

apache_beam/transforms/sql_test.py::SqlTransformTest::test_agg
apache_beam/transforms/sql_test.py::SqlTransformTest::test_filter
apache_beam/transforms/sql_test.py::SqlTransformTest::test_generate_data
apache_beam/transforms/sql_test.py::SqlTransformTest::test_map
apache_beam/transforms/sql_test.py::SqlTransformTest::test_project
apache_beam/transforms/sql_test.py::SqlTransformTest::test_row
apache_beam/transforms/sql_test.py::SqlTransformTest::test_tagged_join
apache_beam/transforms/sql_test.py::SqlTransformTest::test_windowing_before_sql
apache_beam/transforms/sql_test.py::SqlTransformTest::test_zetasql_generate_data
  <https://ci-beam.apache.org/job/beam_PostCommit_XVR_Flink/ws/src/sdks/python/apache_beam/transforms/external.py>:676: BeamDeprecationWarning: options is deprecated since First stable release. References to <pipeline>.options will not be supported
    self._expansion_service, pipeline.options)

-- Docs: https://docs.pytest.org/en/stable/how-to/capture-warnings.html
- generated xml file: <https://ci-beam.apache.org/job/beam_PostCommit_XVR_Flink/ws/src/sdks/python/pytest_xlangSqlValidateRunner.xml> -
=========================== short test summary info ============================
FAILED apache_beam/transforms/sql_test.py::SqlTransformTest::test_agg - RuntimeError: Service failed to start up with error 1
FAILED apache_beam/transforms/sql_test.py::SqlTransformTest::test_filter - RuntimeError: Service failed to start up with error 1
FAILED apache_beam/transforms/sql_test.py::SqlTransformTest::test_generate_data - RuntimeError: Service failed to start up with error 1
FAILED apache_beam/transforms/sql_test.py::SqlTransformTest::test_map - RuntimeError: Service failed to start up with error 1
FAILED apache_beam/transforms/sql_test.py::SqlTransformTest::test_project - RuntimeError: Service failed to start up with error 1
FAILED apache_beam/transforms/sql_test.py::SqlTransformTest::test_row - RuntimeError: Service failed to start up with error 1
FAILED apache_beam/transforms/sql_test.py::SqlTransformTest::test_tagged_join - RuntimeError: Service failed to start up with error 1
FAILED apache_beam/transforms/sql_test.py::SqlTransformTest::test_windowing_before_sql - RuntimeError: Service failed to start up with error 1
FAILED apache_beam/transforms/sql_test.py::SqlTransformTest::test_zetasql_generate_data - RuntimeError: Service failed to start up with error 1
========= 9 failed, 14 skipped, 6945 deselected, 57 warnings in 9.81s ==========

> Task :runners:flink:1.15:job-server:validatesCrossLanguageRunnerPythonUsingSql FAILED

> Task :runners:flink:1.15:job-server:flinkJobServerCleanup
Skipping invalid pid: 2198487.

> Task :runners:flink:1.15:job-server:validatesCrossLanguageRunnerCleanup
Stopping expansion service pid: 2204574.
Stopping expansion service pid: 2204575.

FAILURE: Build completed with 4 failures.

1: Task failed with an exception.
-----------
* Where:
Build file '<https://ci-beam.apache.org/job/beam_PostCommit_XVR_Flink/ws/src/sdks/go/test/build.gradle'> line: 217

* What went wrong:
Execution failed for task ':runners:flink:1.15:job-server:validatesCrossLanguageRunnerGoUsingJava'.
> Process 'command 'sh'' finished with non-zero exit value 1

* Try:
> Run with --stacktrace option to get the stack trace.
> Run with --info or --debug option to get more log output.
==============================================================================

2: Task failed with an exception.
-----------
* What went wrong:
Execution failed for task ':runners:flink:1.15:job-server:validatesCrossLanguageRunnerJavaUsingPython'.
> There were failing tests. See the report at: file://<https://ci-beam.apache.org/job/beam_PostCommit_XVR_Flink/ws/src/runners/flink/1.15/job-server/build/reports/tests/validatesCrossLanguageRunnerJavaUsingPython/index.html>

* Try:
> Run with --stacktrace option to get the stack trace.
> Run with --info or --debug option to get more log output.
==============================================================================

3: Task failed with an exception.
-----------
* What went wrong:
Execution failed for task ':runners:flink:1.15:job-server:validatesCrossLanguageRunnerPythonUsingJava'.
> Process 'command 'sh'' finished with non-zero exit value 1

* Try:
> Run with --stacktrace option to get the stack trace.
> Run with --info or --debug option to get more log output.
==============================================================================

4: Task failed with an exception.
-----------
* What went wrong:
Execution failed for task ':runners:flink:1.15:job-server:validatesCrossLanguageRunnerPythonUsingSql'.
> Process 'command 'sh'' finished with non-zero exit value 1

* Try:
> Run with --stacktrace option to get the stack trace.
> Run with --info or --debug option to get more log output.
==============================================================================

* Get more help at https://help.gradle.org

Deprecated Gradle features were used in this build, making it incompatible with Gradle 8.0.

You can use '--warning-mode all' to show the individual deprecation warnings and determine if they come from your own scripts or plugins.

See https://docs.gradle.org/7.6.2/userguide/command_line_interface.html#sec:command_line_warnings

Execution optimizations have been disabled for 1 invalid unit(s) of work during this build to ensure correctness.
Please consult deprecation warnings for more details.

BUILD FAILED in 57m 3s
281 actionable tasks: 185 executed, 84 from cache, 12 up-to-date

Publishing build scan...
https://ge.apache.org/s/nbiqo4xmr75vk

Build step 'Invoke Gradle script' changed build result to FAILURE
Build step 'Invoke Gradle script' marked build as failure

---------------------------------------------------------------------
To unsubscribe, e-mail: builds-unsubscribe@beam.apache.org
For additional commands, e-mail: builds-help@beam.apache.org


Build failed in Jenkins: beam_PostCommit_XVR_Flink #7194

Posted by Apache Jenkins Server <je...@builds.apache.org>.
See <https://ci-beam.apache.org/job/beam_PostCommit_XVR_Flink/7194/display/redirect?page=changes>

Changes:

[noreply] Fix broken url for 'Tour of Beam' (#27412)


------------------------------------------
[...truncated 1018.03 KB...]
      payload: "\n apache/beam_java8_sdk:2.50.0.dev"
      capabilities: "beam:coder:bytes:v1"
      capabilities: "beam:coder:bool:v1"
      capabilities: "beam:coder:varint:v1"
      capabilities: "beam:coder:string_utf8:v1"
      capabilities: "beam:coder:iterable:v1"
      capabilities: "beam:coder:timer:v1"
      capabilities: "beam:coder:kv:v1"
      capabilities: "beam:coder:length_prefix:v1"
      capabilities: "beam:coder:global_window:v1"
      capabilities: "beam:coder:interval_window:v1"
      capabilities: "beam:coder:custom_window:v1"
      capabilities: "beam:coder:windowed_value:v1"
      capabilities: "beam:coder:double:v1"
      capabilities: "beam:coder:row:v1"
      capabilities: "beam:coder:param_windowed_value:v1"
      capabilities: "beam:coder:state_backed_iterable:v1"
      capabilities: "beam:coder:sharded_key:v1"
      capabilities: "beam:coder:nullable:v1"
      capabilities: "beam:protocol:multi_core_bundle_processing:v1"
      capabilities: "beam:protocol:progress_reporting:v1"
      capabilities: "beam:protocol:harness_monitoring_infos:v1"
      capabilities: "beam:protocol:control_request_elements_embedding:v1"
      capabilities: "beam:protocol:state_caching:v1"
      capabilities: "beam:version:sdk_base:apache/beam_java8_sdk:2.50.0.dev"
      capabilities: "beam:transform:sdf_truncate_sized_restrictions:v1"
      capabilities: "beam:transform:to_string:v1"
      capabilities: "beam:protocol:data_sampling:v1"
      dependencies: <
        type_urn: "beam:artifact:type:file:v1"
        type_payload: "\nL/tmp/artifacts/icedtea-sound-uoIQCGhMffp0D_gc1dkBtXBGXr18Bkb5Qx-e-CvP00s.jar\022@ba821008684c7dfa740ff81cd5d901b570465ebd7c0646f9431f9ef82bcfd34b"
        role_urn: "beam:artifact:role:staging_to:v1"
        role_payload: "\n=icedtea-sound-uoIQCGhMffp0D_gc1dkBtXBGXr18Bkb5Qx-e-CvP00s.jar"
      >
      dependencies: <
        type_urn: "beam:artifact:type:file:v1"
        type_payload: "\nF/tmp/artifacts/jaccess-T1qVdaqZDj2uNq1tdHEk1lwFMYQiwMhYa0jqGU9fUMg.jar\022@4f5a9575aa990e3dae36ad6d747124d65c05318422c0c8586b48ea194f5f50c8"
        role_urn: "beam:artifact:role:staging_to:v1"
        role_payload: "\n7jaccess-T1qVdaqZDj2uNq1tdHEk1lwFMYQiwMhYa0jqGU9fUMg.jar"
      >
      dependencies: <
        type_urn: "beam:artifact:type:file:v1"
        type_payload: "\nI/tmp/artifacts/localedata-dQT9YOGvbd1zEqcZsyJ1W4l8jNhxoX3b1nmMhdIbCb8.jar\022@7504fd60e1af6ddd7312a719b322755b897c8cd871a17ddbd6798c85d21b09bf"
        role_urn: "beam:artifact:role:staging_to:v1"
        role_payload: "\n:localedata-dQT9YOGvbd1zEqcZsyJ1W4l8jNhxoX3b1nmMhdIbCb8.jar"
      >
      dependencies: <
        type_urn: "beam:artifact:type:file:v1"
        type_payload: "\nF/tmp/artifacts/nashorn-gZxbPAWCb1KP7OCbxUu1prmT4YMEDX-mGdJFjkB3pfs.jar\022@819c5b3c05826f528fece09bc54bb5a6b993e183040d7fa619d2458e4077a5fb"
        role_urn: "beam:artifact:role:staging_to:v1"
        role_payload: "\n7nashorn-gZxbPAWCb1KP7OCbxUu1prmT4YMEDX-mGdJFjkB3pfs.jar"
      >
      dependencies: <
        type_urn: "beam:artifact:type:file:v1"
        type_payload: "\nG/tmp/artifacts/cldrdata-_GVjPlS0invvNh7wlTfv_CNVOxTj3Y-xvSW1Xw2r_-4.jar\022@fc65633e54b48a7bef361ef09537effc23553b14e3dd8fb1bd25b55f0dabffee"
        role_urn: "beam:artifact:role:staging_to:v1"
        role_payload: "\n8cldrdata-_GVjPlS0invvNh7wlTfv_CNVOxTj3Y-xvSW1Xw2r_-4.jar"
      >
      dependencies: <
        type_urn: "beam:artifact:type:file:v1"
        type_payload: "\nD/tmp/artifacts/dnsns-lI-xDSEZtu3C8A4-qt_7RcyP_ql7OU0LNZreNR5piTU.jar\022@948fb10d2119b6edc2f00e3eaadffb45cc8ffea97b394d0b359ade351e698935"
        role_urn: "beam:artifact:role:staging_to:v1"
        role_payload: "\n5dnsns-lI-xDSEZtu3C8A4-qt_7RcyP_ql7OU0LNZreNR5piTU.jar"
      >
      dependencies: <
        type_urn: "beam:artifact:type:file:v1"
        type_payload: "\nr/tmp/artifacts/beam-sdks-java-io-expansion-service-2.50.0-SNAPSHOT-laIirfe5DlRWhs4zZLc6h83GKIwlrr_6yWHJyx9K9JQ.jar\022@95a222adf7b90e545686ce3364b73a87cdc6288c25aebffac961c9cb1f4af494"
        role_urn: "beam:artifact:role:staging_to:v1"
        role_payload: "\ncbeam-sdks-java-io-expansion-service-2.50.0-SNAPSHOT-laIirfe5DlRWhs4zZLc6h83GKIwlrr_6yWHJyx9K9JQ.jar"
      >
    >
  >
  environments: <
    key: "go"
    value: <
      urn: "beam:env:docker:v1"
      payload: "\n\026apache/beam_go_sdk:dev"
      capabilities: "beam:protocol:progress_reporting:v1"
      capabilities: "beam:protocol:multi_core_bundle_processing:v1"
      capabilities: "beam:transform:sdf_truncate_sized_restrictions:v1"
      capabilities: "beam:protocol:worker_status:v1"
      capabilities: "beam:protocol:monitoring_info_short_ids:v1"
      capabilities: "beam:version:sdk_base:go:apache/beam_go_sdk:2.50.0.dev"
      capabilities: "beam:coder:bytes:v1"
      capabilities: "beam:coder:bool:v1"
      capabilities: "beam:coder:varint:v1"
      capabilities: "beam:coder:double:v1"
      capabilities: "beam:coder:string_utf8:v1"
      capabilities: "beam:coder:length_prefix:v1"
      capabilities: "beam:coder:kv:v1"
      capabilities: "beam:coder:iterable:v1"
      capabilities: "beam:coder:state_backed_iterable:v1"
      capabilities: "beam:coder:windowed_value:v1"
      capabilities: "beam:coder:global_window:v1"
      capabilities: "beam:coder:interval_window:v1"
      capabilities: "beam:coder:row:v1"
      capabilities: "beam:coder:nullable:v1"
      capabilities: "beam:coder:timer:v1"
      dependencies: <
        type_urn: "beam:artifact:type:file:v1"
        role_urn: "beam:artifact:role:go_worker_binary:v1"
      >
    >
  >
>
root_transform_ids: "s1"
2023/08/07 04:45:31 Cross-compiling <https://ci-beam.apache.org/job/beam_PostCommit_XVR_Flink/ws/src/sdks/go/test/integration/io/xlang/kafka/kafka_test.go> with GOOS=linux GOARCH=amd64 CGO_ENABLED=0 as /tmp/worker-1-1691383531680886077
    kafka_test.go:62: Failed to execute job: 	connecting to job service
        failed to dial server at localhost:42049
        	caused by:
        context deadline exceeded
--- FAIL: TestKafkaIO_BasicReadWrite (125.10s)
FAIL
FAIL	github.com/apache/beam/sdks/v2/go/test/integration/io/xlang/kafka	131.133s
FAIL

> Task :runners:flink:1.15:job-server:validatesCrossLanguageRunnerGoUsingJava FAILED
> Task :runners:flink:1.15:job-server:validatesCrossLanguageRunnerJavaUsingPython

org.apache.beam.runners.core.construction.ValidateRunnerXlangTest$CoGroupByKeyTest > test FAILED
    org.apache.beam.vendor.grpc.v1p54p0.io.grpc.StatusRuntimeException at ClientCalls.java:271

org.apache.beam.runners.core.construction.ValidateRunnerXlangTest$CombineGloballyTest > test FAILED
    org.apache.beam.vendor.grpc.v1p54p0.io.grpc.StatusRuntimeException at ClientCalls.java:271

org.apache.beam.runners.core.construction.ValidateRunnerXlangTest$CombinePerKeyTest > test FAILED
    org.apache.beam.vendor.grpc.v1p54p0.io.grpc.StatusRuntimeException at ClientCalls.java:271

org.apache.beam.runners.core.construction.ValidateRunnerXlangTest$FlattenTest > test FAILED
    org.apache.beam.vendor.grpc.v1p54p0.io.grpc.StatusRuntimeException at ClientCalls.java:271

org.apache.beam.runners.core.construction.ValidateRunnerXlangTest$GroupByKeyTest > test FAILED
    org.apache.beam.vendor.grpc.v1p54p0.io.grpc.StatusRuntimeException at ClientCalls.java:271

org.apache.beam.runners.core.construction.ValidateRunnerXlangTest$MultiInputOutputWithSideInputTest > test FAILED
    org.apache.beam.vendor.grpc.v1p54p0.io.grpc.StatusRuntimeException at ClientCalls.java:271

org.apache.beam.runners.core.construction.ValidateRunnerXlangTest$PartitionTest > test FAILED
    org.apache.beam.vendor.grpc.v1p54p0.io.grpc.StatusRuntimeException at ClientCalls.java:271

org.apache.beam.runners.core.construction.ValidateRunnerXlangTest$PythonDependenciesTest > test FAILED
    org.apache.beam.vendor.grpc.v1p54p0.io.grpc.StatusRuntimeException at ClientCalls.java:271

org.apache.beam.runners.core.construction.ValidateRunnerXlangTest$SingleInputOutputTest > test FAILED
    org.apache.beam.vendor.grpc.v1p54p0.io.grpc.StatusRuntimeException at ClientCalls.java:271
INFO:root:No image given, using default Python SDK image
INFO:root:Python SDK container image set to "apache/beam_python3.8_sdk:2.49.0" for Docker environment
INFO:__main__:Listening for expansion requests at 40641
INFO:root:Missing pipeline option (runner). Executing pipeline using the default runner: DirectRunner.
INFO:__main__:Shutting down expansion service.
INFO:apache_beam.runners.portability.stager:Executing command: ['/home/jenkins/.apache_beam/cache/venvs/py-3.8-beam-2.49.0-743bdccef67087512a7a190820e727aab7bdcb14/bin/python', '-m', 'pip', 'download', '--dest', '/tmp/dataflow-requirements-cache', '-r', '/tmp/tmp6vtavjh0/tmp_requirements.txt', '--exists-action', 'i', '--no-deps', '--implementation', 'cp', '--abi', 'cp38', '--platform', 'manylinux2014_x86_64']
INFO:root:No image given, using default Python SDK image
INFO:root:Python SDK container image set to "apache/beam_python3.8_sdk:2.49.0" for Docker environment
INFO:__main__:Listening for expansion requests at 38551
INFO:root:Missing pipeline option (runner). Executing pipeline using the default runner: DirectRunner.
INFO:__main__:Shutting down expansion service.

org.apache.beam.sdk.extensions.python.transforms.DataframeTransformTest > testDataframeSum FAILED
    org.apache.beam.vendor.grpc.v1p54p0.io.grpc.StatusRuntimeException at ClientCalls.java:271

org.apache.beam.sdk.extensions.python.transforms.PythonMapTest > testPythonMap FAILED
    org.apache.beam.vendor.grpc.v1p54p0.io.grpc.StatusRuntimeException at ClientCalls.java:271

org.apache.beam.sdk.extensions.python.transforms.PythonMapTest > testPythonFlatMap FAILED
    org.apache.beam.vendor.grpc.v1p54p0.io.grpc.StatusRuntimeException at ClientCalls.java:271

org.apache.beam.sdk.extensions.python.transforms.RunInferenceTransformTest > testRunInferenceWithKVs FAILED
    org.apache.beam.vendor.grpc.v1p54p0.io.grpc.StatusRuntimeException at ClientCalls.java:271

org.apache.beam.sdk.extensions.python.transforms.RunInferenceTransformTest > testRunInference FAILED
    org.apache.beam.vendor.grpc.v1p54p0.io.grpc.StatusRuntimeException at ClientCalls.java:271

16 tests completed, 14 failed

> Task :runners:flink:1.15:job-server:validatesCrossLanguageRunnerJavaUsingPython FAILED
> Task :runners:flink:1.15:job-server:validatesCrossLanguageRunnerPythonUsingJava
> Task :runners:flink:1.15:job-server:validatesCrossLanguageRunnerPythonUsingJava FAILED
> Task :runners:flink:1.15:job-server:validatesCrossLanguageRunnerPythonUsingSql FAILED
> Task :runners:flink:1.15:job-server:flinkJobServerCleanup
> Task :runners:flink:1.15:job-server:validatesCrossLanguageRunnerCleanup

FAILURE: Build completed with 4 failures.

1: Task failed with an exception.
-----------
* Where:
Build file '<https://ci-beam.apache.org/job/beam_PostCommit_XVR_Flink/ws/src/sdks/go/test/build.gradle'> line: 217

* What went wrong:
Execution failed for task ':runners:flink:1.15:job-server:validatesCrossLanguageRunnerGoUsingJava'.
> Process 'command 'sh'' finished with non-zero exit value 1

* Try:
> Run with --stacktrace option to get the stack trace.
> Run with --info or --debug option to get more log output.
==============================================================================

2: Task failed with an exception.
-----------
* What went wrong:
Execution failed for task ':runners:flink:1.15:job-server:validatesCrossLanguageRunnerJavaUsingPython'.
> There were failing tests. See the report at: file://<https://ci-beam.apache.org/job/beam_PostCommit_XVR_Flink/ws/src/runners/flink/1.15/job-server/build/reports/tests/validatesCrossLanguageRunnerJavaUsingPython/index.html>

* Try:
> Run with --stacktrace option to get the stack trace.
> Run with --info or --debug option to get more log output.
==============================================================================

3: Task failed with an exception.
-----------
* What went wrong:
Execution failed for task ':runners:flink:1.15:job-server:validatesCrossLanguageRunnerPythonUsingJava'.
> Process 'command 'sh'' finished with non-zero exit value 1

* Try:
> Run with --stacktrace option to get the stack trace.
> Run with --info or --debug option to get more log output.
==============================================================================

4: Task failed with an exception.
-----------
* What went wrong:
Execution failed for task ':runners:flink:1.15:job-server:validatesCrossLanguageRunnerPythonUsingSql'.
> Process 'command 'sh'' finished with non-zero exit value 1

* Try:
> Run with --stacktrace option to get the stack trace.
> Run with --info or --debug option to get more log output.
==============================================================================

* Get more help at https://help.gradle.org

Deprecated Gradle features were used in this build, making it incompatible with Gradle 8.0.

You can use '--warning-mode all' to show the individual deprecation warnings and determine if they come from your own scripts or plugins.

See https://docs.gradle.org/7.6.2/userguide/command_line_interface.html#sec:command_line_warnings

Execution optimizations have been disabled for 1 invalid unit(s) of work during this build to ensure correctness.
Please consult deprecation warnings for more details.

BUILD FAILED in 1h 1m 15s
281 actionable tasks: 184 executed, 85 from cache, 12 up-to-date

Publishing build scan...
https://ge.apache.org/s/iy4vdshcwlvzc

Build step 'Invoke Gradle script' changed build result to FAILURE
Build step 'Invoke Gradle script' marked build as failure

---------------------------------------------------------------------
To unsubscribe, e-mail: builds-unsubscribe@beam.apache.org
For additional commands, e-mail: builds-help@beam.apache.org


Build failed in Jenkins: beam_PostCommit_XVR_Flink #7193

Posted by Apache Jenkins Server <je...@builds.apache.org>.
See <https://ci-beam.apache.org/job/beam_PostCommit_XVR_Flink/7193/display/redirect>

Changes:


------------------------------------------
[...truncated 1.11 MB...]

    def start(self):
      try:
        endpoint = self.start_process()
        wait_secs = .1
        channel_options = [("grpc.max_receive_message_length", -1),
                           ("grpc.max_send_message_length", -1)]
        channel = grpc.insecure_channel(endpoint, options=channel_options)
        channel_ready = grpc.channel_ready_future(channel)
        while True:
          if self._process is not None and self._process.poll() is not None:
            _LOGGER.error("Starting job service with %s", self._process.args)
>           raise RuntimeError(
                'Service failed to start up with error %s' % self._process.poll())
E               RuntimeError: Service failed to start up with error 1

apache_beam/utils/subprocess_server.py:88: RuntimeError
------------------------------ Captured log call -------------------------------
INFO     apache_beam.utils.subprocess_server:subprocess_server.py:239 Using pre-built snapshot at <https://ci-beam.apache.org/job/beam_PostCommit_XVR_Flink/ws/src/sdks/java/extensions/sql/expansion-service/build/libs/beam-sdks-java-extensions-sql-expansion-service-2.50.0-SNAPSHOT.jar>
INFO     root:external.py:929 Starting a JAR-based expansion service from JAR <https://ci-beam.apache.org/job/beam_PostCommit_XVR_Flink/ws/src/sdks/java/extensions/sql/expansion-service/build/libs/beam-sdks-java-extensions-sql-expansion-service-2.50.0-SNAPSHOT.jar> 
INFO     apache_beam.utils.subprocess_server:subprocess_server.py:116 Starting service with ['java' '-jar' '<https://ci-beam.apache.org/job/beam_PostCommit_XVR_Flink/ws/src/sdks/java/extensions/sql/expansion-service/build/libs/beam-sdks-java-extensions-sql-expansion-service-2.50.0-SNAPSHOT.jar'> '47471' '--filesToStage=<https://ci-beam.apache.org/job/beam_PostCommit_XVR_Flink/ws/src/sdks/java/extensions/sql/expansion-service/build/libs/beam-sdks-java-extensions-sql-expansion-service-2.50.0-SNAPSHOT.jar']>
INFO     apache_beam.utils.subprocess_server:subprocess_server.py:126 Error: Invalid or corrupt jarfile <https://ci-beam.apache.org/job/beam_PostCommit_XVR_Flink/ws/src/sdks/java/extensions/sql/expansion-service/build/libs/beam-sdks-java-extensions-sql-expansion-service-2.50.0-SNAPSHOT.jar>
ERROR    apache_beam.utils.subprocess_server:subprocess_server.py:87 Starting job service with ['java', '-jar', '<https://ci-beam.apache.org/job/beam_PostCommit_XVR_Flink/ws/src/sdks/java/extensions/sql/expansion-service/build/libs/beam-sdks-java-extensions-sql-expansion-service-2.50.0-SNAPSHOT.jar',> '47471', '--filesToStage=<https://ci-beam.apache.org/job/beam_PostCommit_XVR_Flink/ws/src/sdks/java/extensions/sql/expansion-service/build/libs/beam-sdks-java-extensions-sql-expansion-service-2.50.0-SNAPSHOT.jar']>
ERROR    apache_beam.utils.subprocess_server:subprocess_server.py:101 Error bringing up service
Traceback (most recent call last):
  File "<https://ci-beam.apache.org/job/beam_PostCommit_XVR_Flink/ws/src/sdks/python/apache_beam/utils/subprocess_server.py",> line 88, in start
    raise RuntimeError(
RuntimeError: Service failed to start up with error 1
_________________ SqlTransformTest.test_zetasql_generate_data __________________

self = <apache_beam.transforms.sql_test.SqlTransformTest testMethod=test_zetasql_generate_data>

    def test_zetasql_generate_data(self):
      with TestPipeline() as p:
>       out = p | SqlTransform(
            """SELECT
              CAST(1 AS INT64) AS `int`,
              CAST('foo' AS STRING) AS `str`,
              CAST(3.14  AS FLOAT64) AS `flt`""",
            dialect="zetasql")

apache_beam/transforms/sql_test.py:154: 
_ _ _ _ _ _ _ _ _ _ _ _ _ _ _ _ _ _ _ _ _ _ _ _ _ _ _ _ _ _ _ _ _ _ _ _ _ _ _ _ 
apache_beam/transforms/ptransform.py:614: in __ror__
    result = p.apply(self, pvalueish, label)
apache_beam/pipeline.py:712: in apply
    pvalueish_result = self.runner.apply(transform, pvalueish, self._options)
apache_beam/runners/runner.py:185: in apply
    return m(transform, input, options)
apache_beam/runners/runner.py:215: in apply_PTransform
    return transform.expand(input)
apache_beam/transforms/external.py:678: in expand
    with ExternalTransform.service(expansion_service) as service:
/usr/lib/python3.8/contextlib.py:113: in __enter__
    return next(self.gen)
apache_beam/transforms/external.py:733: in service
    with expansion_service as stub:
apache_beam/transforms/external.py:944: in __enter__
    self._service = self._service_provider.__enter__()
apache_beam/utils/subprocess_server.py:72: in __enter__
    return self.start()
_ _ _ _ _ _ _ _ _ _ _ _ _ _ _ _ _ _ _ _ _ _ _ _ _ _ _ _ _ _ _ _ _ _ _ _ _ _ _ _ 

self = <apache_beam.utils.subprocess_server.JavaJarServer object at 0x7f02224851c0>

    def start(self):
      try:
        endpoint = self.start_process()
        wait_secs = .1
        channel_options = [("grpc.max_receive_message_length", -1),
                           ("grpc.max_send_message_length", -1)]
        channel = grpc.insecure_channel(endpoint, options=channel_options)
        channel_ready = grpc.channel_ready_future(channel)
        while True:
          if self._process is not None and self._process.poll() is not None:
            _LOGGER.error("Starting job service with %s", self._process.args)
>           raise RuntimeError(
                'Service failed to start up with error %s' % self._process.poll())
E               RuntimeError: Service failed to start up with error 1

apache_beam/utils/subprocess_server.py:88: RuntimeError
------------------------------ Captured log call -------------------------------
INFO     apache_beam.utils.subprocess_server:subprocess_server.py:239 Using pre-built snapshot at <https://ci-beam.apache.org/job/beam_PostCommit_XVR_Flink/ws/src/sdks/java/extensions/sql/expansion-service/build/libs/beam-sdks-java-extensions-sql-expansion-service-2.50.0-SNAPSHOT.jar>
INFO     root:external.py:929 Starting a JAR-based expansion service from JAR <https://ci-beam.apache.org/job/beam_PostCommit_XVR_Flink/ws/src/sdks/java/extensions/sql/expansion-service/build/libs/beam-sdks-java-extensions-sql-expansion-service-2.50.0-SNAPSHOT.jar> 
INFO     apache_beam.utils.subprocess_server:subprocess_server.py:116 Starting service with ['java' '-jar' '<https://ci-beam.apache.org/job/beam_PostCommit_XVR_Flink/ws/src/sdks/java/extensions/sql/expansion-service/build/libs/beam-sdks-java-extensions-sql-expansion-service-2.50.0-SNAPSHOT.jar'> '39273' '--filesToStage=<https://ci-beam.apache.org/job/beam_PostCommit_XVR_Flink/ws/src/sdks/java/extensions/sql/expansion-service/build/libs/beam-sdks-java-extensions-sql-expansion-service-2.50.0-SNAPSHOT.jar']>
INFO     apache_beam.utils.subprocess_server:subprocess_server.py:126 Error: Invalid or corrupt jarfile <https://ci-beam.apache.org/job/beam_PostCommit_XVR_Flink/ws/src/sdks/java/extensions/sql/expansion-service/build/libs/beam-sdks-java-extensions-sql-expansion-service-2.50.0-SNAPSHOT.jar>
ERROR    apache_beam.utils.subprocess_server:subprocess_server.py:87 Starting job service with ['java', '-jar', '<https://ci-beam.apache.org/job/beam_PostCommit_XVR_Flink/ws/src/sdks/java/extensions/sql/expansion-service/build/libs/beam-sdks-java-extensions-sql-expansion-service-2.50.0-SNAPSHOT.jar',> '39273', '--filesToStage=<https://ci-beam.apache.org/job/beam_PostCommit_XVR_Flink/ws/src/sdks/java/extensions/sql/expansion-service/build/libs/beam-sdks-java-extensions-sql-expansion-service-2.50.0-SNAPSHOT.jar']>
ERROR    apache_beam.utils.subprocess_server:subprocess_server.py:101 Error bringing up service
Traceback (most recent call last):
  File "<https://ci-beam.apache.org/job/beam_PostCommit_XVR_Flink/ws/src/sdks/python/apache_beam/utils/subprocess_server.py",> line 88, in start
    raise RuntimeError(
RuntimeError: Service failed to start up with error 1
=============================== warnings summary ===============================
../../build/gradleenv/1922375555/lib/python3.8/site-packages/hdfs/config.py:15
  <https://ci-beam.apache.org/job/beam_PostCommit_XVR_Flink/ws/src/build/gradleenv/1922375555/lib/python3.8/site-packages/hdfs/config.py>:15: DeprecationWarning: the imp module is deprecated in favour of importlib; see the module's documentation for alternative uses
    from imp import load_source

../../build/gradleenv/1922375555/lib/python3.8/site-packages/google/rpc/__init__.py:18
  <https://ci-beam.apache.org/job/beam_PostCommit_XVR_Flink/ws/src/build/gradleenv/1922375555/lib/python3.8/site-packages/google/rpc/__init__.py>:18: DeprecationWarning: pkg_resources is deprecated as an API. See https://setuptools.pypa.io/en/latest/pkg_resources.html
    import pkg_resources

../../build/gradleenv/1922375555/lib/python3.8/site-packages/pkg_resources/__init__.py:2871: 20 warnings
  <https://ci-beam.apache.org/job/beam_PostCommit_XVR_Flink/ws/src/build/gradleenv/1922375555/lib/python3.8/site-packages/pkg_resources/__init__.py>:2871: DeprecationWarning: Deprecated call to `pkg_resources.declare_namespace('google')`.
  Implementing implicit namespace packages (as specified in PEP 420) is preferred to `pkg_resources.declare_namespace`. See https://setuptools.pypa.io/en/latest/references/keywords.html#keyword-namespace-packages
    declare_namespace(pkg)

../../build/gradleenv/1922375555/lib/python3.8/site-packages/pkg_resources/__init__.py:2871: 16 warnings
  <https://ci-beam.apache.org/job/beam_PostCommit_XVR_Flink/ws/src/build/gradleenv/1922375555/lib/python3.8/site-packages/pkg_resources/__init__.py>:2871: DeprecationWarning: Deprecated call to `pkg_resources.declare_namespace('google.cloud')`.
  Implementing implicit namespace packages (as specified in PEP 420) is preferred to `pkg_resources.declare_namespace`. See https://setuptools.pypa.io/en/latest/references/keywords.html#keyword-namespace-packages
    declare_namespace(pkg)

../../build/gradleenv/1922375555/lib/python3.8/site-packages/pkg_resources/__init__.py:2350
../../build/gradleenv/1922375555/lib/python3.8/site-packages/pkg_resources/__init__.py:2350
../../build/gradleenv/1922375555/lib/python3.8/site-packages/pkg_resources/__init__.py:2350
../../build/gradleenv/1922375555/lib/python3.8/site-packages/pkg_resources/__init__.py:2350
  <https://ci-beam.apache.org/job/beam_PostCommit_XVR_Flink/ws/src/build/gradleenv/1922375555/lib/python3.8/site-packages/pkg_resources/__init__.py>:2350: DeprecationWarning: Deprecated call to `pkg_resources.declare_namespace('google')`.
  Implementing implicit namespace packages (as specified in PEP 420) is preferred to `pkg_resources.declare_namespace`. See https://setuptools.pypa.io/en/latest/references/keywords.html#keyword-namespace-packages
    declare_namespace(parent)

../../build/gradleenv/1922375555/lib/python3.8/site-packages/pkg_resources/__init__.py:2871
  <https://ci-beam.apache.org/job/beam_PostCommit_XVR_Flink/ws/src/build/gradleenv/1922375555/lib/python3.8/site-packages/pkg_resources/__init__.py>:2871: DeprecationWarning: Deprecated call to `pkg_resources.declare_namespace('google.logging')`.
  Implementing implicit namespace packages (as specified in PEP 420) is preferred to `pkg_resources.declare_namespace`. See https://setuptools.pypa.io/en/latest/references/keywords.html#keyword-namespace-packages
    declare_namespace(pkg)

../../build/gradleenv/1922375555/lib/python3.8/site-packages/pkg_resources/__init__.py:2871
  <https://ci-beam.apache.org/job/beam_PostCommit_XVR_Flink/ws/src/build/gradleenv/1922375555/lib/python3.8/site-packages/pkg_resources/__init__.py>:2871: DeprecationWarning: Deprecated call to `pkg_resources.declare_namespace('google.iam')`.
  Implementing implicit namespace packages (as specified in PEP 420) is preferred to `pkg_resources.declare_namespace`. See https://setuptools.pypa.io/en/latest/references/keywords.html#keyword-namespace-packages
    declare_namespace(pkg)

../../build/gradleenv/1922375555/lib/python3.8/site-packages/google/rpc/__init__.py:20
  <https://ci-beam.apache.org/job/beam_PostCommit_XVR_Flink/ws/src/build/gradleenv/1922375555/lib/python3.8/site-packages/google/rpc/__init__.py>:20: DeprecationWarning: Deprecated call to `pkg_resources.declare_namespace('google.rpc')`.
  Implementing implicit namespace packages (as specified in PEP 420) is preferred to `pkg_resources.declare_namespace`. See https://setuptools.pypa.io/en/latest/references/keywords.html#keyword-namespace-packages
    pkg_resources.declare_namespace(__name__)

apache_beam/typehints/pandas_type_compatibility_test.py:67
  <https://ci-beam.apache.org/job/beam_PostCommit_XVR_Flink/ws/src/sdks/python/apache_beam/typehints/pandas_type_compatibility_test.py>:67: FutureWarning: pandas.Int64Index is deprecated and will be removed from pandas in a future version. Use pandas.Index with the appropriate dtype instead.
    }).set_index(pd.Int64Index(range(123, 223), name='an_index')),

apache_beam/typehints/pandas_type_compatibility_test.py:90
  <https://ci-beam.apache.org/job/beam_PostCommit_XVR_Flink/ws/src/sdks/python/apache_beam/typehints/pandas_type_compatibility_test.py>:90: FutureWarning: pandas.Int64Index is deprecated and will be removed from pandas in a future version. Use pandas.Index with the appropriate dtype instead.
    pd.Int64Index(range(123, 223), name='an_index'),

apache_beam/typehints/pandas_type_compatibility_test.py:91
  <https://ci-beam.apache.org/job/beam_PostCommit_XVR_Flink/ws/src/sdks/python/apache_beam/typehints/pandas_type_compatibility_test.py>:91: FutureWarning: pandas.Int64Index is deprecated and will be removed from pandas in a future version. Use pandas.Index with the appropriate dtype instead.
    pd.Int64Index(range(475, 575), name='another_index'),

apache_beam/transforms/sql_test.py::SqlTransformTest::test_agg
apache_beam/transforms/sql_test.py::SqlTransformTest::test_filter
apache_beam/transforms/sql_test.py::SqlTransformTest::test_generate_data
apache_beam/transforms/sql_test.py::SqlTransformTest::test_map
apache_beam/transforms/sql_test.py::SqlTransformTest::test_project
apache_beam/transforms/sql_test.py::SqlTransformTest::test_row
apache_beam/transforms/sql_test.py::SqlTransformTest::test_tagged_join
apache_beam/transforms/sql_test.py::SqlTransformTest::test_windowing_before_sql
apache_beam/transforms/sql_test.py::SqlTransformTest::test_zetasql_generate_data
  <https://ci-beam.apache.org/job/beam_PostCommit_XVR_Flink/ws/src/sdks/python/apache_beam/transforms/external.py>:676: BeamDeprecationWarning: options is deprecated since First stable release. References to <pipeline>.options will not be supported
    self._expansion_service, pipeline.options)

-- Docs: https://docs.pytest.org/en/stable/how-to/capture-warnings.html
- generated xml file: <https://ci-beam.apache.org/job/beam_PostCommit_XVR_Flink/ws/src/sdks/python/pytest_xlangSqlValidateRunner.xml> -
=========================== short test summary info ============================
FAILED apache_beam/transforms/sql_test.py::SqlTransformTest::test_agg - RuntimeError: Service failed to start up with error 1
FAILED apache_beam/transforms/sql_test.py::SqlTransformTest::test_filter - RuntimeError: Service failed to start up with error 1
FAILED apache_beam/transforms/sql_test.py::SqlTransformTest::test_generate_data - RuntimeError: Service failed to start up with error 1
FAILED apache_beam/transforms/sql_test.py::SqlTransformTest::test_map - RuntimeError: Service failed to start up with error 1
FAILED apache_beam/transforms/sql_test.py::SqlTransformTest::test_project - RuntimeError: Service failed to start up with error 1
FAILED apache_beam/transforms/sql_test.py::SqlTransformTest::test_row - RuntimeError: Service failed to start up with error 1
FAILED apache_beam/transforms/sql_test.py::SqlTransformTest::test_tagged_join - RuntimeError: Service failed to start up with error 1
FAILED apache_beam/transforms/sql_test.py::SqlTransformTest::test_windowing_before_sql - RuntimeError: Service failed to start up with error 1
FAILED apache_beam/transforms/sql_test.py::SqlTransformTest::test_zetasql_generate_data - RuntimeError: Service failed to start up with error 1
========= 9 failed, 14 skipped, 6945 deselected, 57 warnings in 9.75s ==========

> Task :runners:flink:1.15:job-server:validatesCrossLanguageRunnerPythonUsingSql FAILED

> Task :runners:flink:1.15:job-server:flinkJobServerCleanup
Skipping invalid pid: 79683.

> Task :runners:flink:1.15:job-server:validatesCrossLanguageRunnerCleanup
Stopping expansion service pid: 91894.
Stopping expansion service pid: 91895.

FAILURE: Build completed with 4 failures.

1: Task failed with an exception.
-----------
* Where:
Build file '<https://ci-beam.apache.org/job/beam_PostCommit_XVR_Flink/ws/src/sdks/go/test/build.gradle'> line: 217

* What went wrong:
Execution failed for task ':runners:flink:1.15:job-server:validatesCrossLanguageRunnerGoUsingJava'.
> Process 'command 'sh'' finished with non-zero exit value 1

* Try:
> Run with --stacktrace option to get the stack trace.
> Run with --info or --debug option to get more log output.
==============================================================================

2: Task failed with an exception.
-----------
* What went wrong:
Execution failed for task ':runners:flink:1.15:job-server:validatesCrossLanguageRunnerJavaUsingPython'.
> There were failing tests. See the report at: file://<https://ci-beam.apache.org/job/beam_PostCommit_XVR_Flink/ws/src/runners/flink/1.15/job-server/build/reports/tests/validatesCrossLanguageRunnerJavaUsingPython/index.html>

* Try:
> Run with --stacktrace option to get the stack trace.
> Run with --info or --debug option to get more log output.
==============================================================================

3: Task failed with an exception.
-----------
* What went wrong:
Execution failed for task ':runners:flink:1.15:job-server:validatesCrossLanguageRunnerPythonUsingJava'.
> Process 'command 'sh'' finished with non-zero exit value 1

* Try:
> Run with --stacktrace option to get the stack trace.
> Run with --info or --debug option to get more log output.
==============================================================================

4: Task failed with an exception.
-----------
* What went wrong:
Execution failed for task ':runners:flink:1.15:job-server:validatesCrossLanguageRunnerPythonUsingSql'.
> Process 'command 'sh'' finished with non-zero exit value 1

* Try:
> Run with --stacktrace option to get the stack trace.
> Run with --info or --debug option to get more log output.
==============================================================================

* Get more help at https://help.gradle.org

Deprecated Gradle features were used in this build, making it incompatible with Gradle 8.0.

You can use '--warning-mode all' to show the individual deprecation warnings and determine if they come from your own scripts or plugins.

See https://docs.gradle.org/7.6.2/userguide/command_line_interface.html#sec:command_line_warnings

Execution optimizations have been disabled for 1 invalid unit(s) of work during this build to ensure correctness.
Please consult deprecation warnings for more details.

BUILD FAILED in 1h 3m 50s
281 actionable tasks: 184 executed, 85 from cache, 12 up-to-date

Publishing build scan...
https://ge.apache.org/s/sq55wyehdtplq

Build step 'Invoke Gradle script' changed build result to FAILURE
Build step 'Invoke Gradle script' marked build as failure

---------------------------------------------------------------------
To unsubscribe, e-mail: builds-unsubscribe@beam.apache.org
For additional commands, e-mail: builds-help@beam.apache.org