You are viewing a plain text version of this content. The canonical link for it is here.
Posted to commits@myfaces.apache.org by Apache Jenkins Server <je...@builds.apache.org> on 2014/03/17 11:38:15 UTC
Build failed in Jenkins: myfaces-maven2-plugins #1282
See <https://builds.apache.org/job/myfaces-maven2-plugins/1282/>
------------------------------------------
[...truncated 1600 lines...]
[INFO] Downloaded: http://repo.maven.apache.org/maven2/org/codehaus/modello/modello-plugin-xpp3/1.0.1/modello-plugin-xpp3-1.0.1.jar (23 KB at 294.4 KB/sec)
[INFO] outputDirectory: F:\jenkins\jenkins-slave\workspace\myfaces-maven2-plugins\maven2-plugins\myfaces-javascript-plugin\target\generated-sources\modello
[INFO] Working on model: src/main/mdo/assembler.mdo
[INFO] Generating current version: 1.0.0
[INFO]
[INFO] --- modello-maven-plugin:1.0.1:java (descriptor) @ myfaces-javascript-plugin ---
[INFO] outputDirectory: F:\jenkins\jenkins-slave\workspace\myfaces-maven2-plugins\maven2-plugins\myfaces-javascript-plugin\target\generated-sources\modello
[INFO] Working on model: src/main/mdo/assembler.mdo
[INFO] Generating current version: 1.0.0
[INFO]
[INFO] --- modello-maven-plugin:1.0.1:xsd (descriptor) @ myfaces-javascript-plugin ---
[INFO] outputDirectory: F:\jenkins\jenkins-slave\workspace\myfaces-maven2-plugins\maven2-plugins\myfaces-javascript-plugin\target\generated-site\xsd
[INFO] Working on model: src/main/mdo/assembler.mdo
[INFO] Generating current version: 1.0.0
[INFO]
[INFO] --- maven-plugin-plugin:2.5:descriptor (default-descriptor) @ myfaces-javascript-plugin ---
[INFO] Downloading: http://repo.maven.apache.org/maven2/com/thoughtworks/qdox/qdox/1.6.3/qdox-1.6.3.jar
[INFO] Downloading: http://repo.maven.apache.org/maven2/jmock/jmock/1.0.0/jmock-1.0.0.jar
[INFO] Downloading: http://repo.maven.apache.org/maven2/ant/ant/1.5.1/ant-1.5.1.jar
[INFO] Downloaded: http://repo.maven.apache.org/maven2/jmock/jmock/1.0.0/jmock-1.0.0.jar (68 KB at 430.8 KB/sec)
[INFO] Downloaded: http://repo.maven.apache.org/maven2/com/thoughtworks/qdox/qdox/1.6.3/qdox-1.6.3.jar (102 KB at 594.4 KB/sec)
[INFO] Downloaded: http://repo.maven.apache.org/maven2/ant/ant/1.5.1/ant-1.5.1.jar (701 KB at 2117.4 KB/sec)
[INFO] Using 'UTF-8' encoding to read mojo metadata.
[INFO] Applying mojo extractor for language: java
[INFO] Mojo extractor for language: java found 9 mojo descriptors.
[INFO] Applying mojo extractor for language: bsh
[INFO] Mojo extractor for language: bsh found 0 mojo descriptors.
[INFO]
[INFO] --- maven-remote-resources-plugin:1.1:process (default) @ myfaces-javascript-plugin ---
[INFO]
[INFO] --- maven-resources-plugin:2.4.3:resources (default-resources) @ myfaces-javascript-plugin ---
[INFO] Using 'UTF-8' encoding to copy filtered resources.
[INFO] Copying 1 resource
[INFO] Copying 3 resources
[INFO]
[INFO] --- maven-compiler-plugin:2.3.1:compile (default-compile) @ myfaces-javascript-plugin ---
[INFO] Compiling 226 source files to F:\jenkins\jenkins-slave\workspace\myfaces-maven2-plugins\maven2-plugins\myfaces-javascript-plugin\target\classes
[INFO]
[INFO] --- maven-resources-plugin:2.4.3:testResources (default-testResources) @ myfaces-javascript-plugin ---
[INFO] Using 'UTF-8' encoding to copy filtered resources.
[INFO] Copying 26 resources
[INFO] Copying 3 resources
[INFO]
[INFO] --- maven-compiler-plugin:2.3.1:testCompile (default-testCompile) @ myfaces-javascript-plugin ---
[INFO] Compiling 9 source files to F:\jenkins\jenkins-slave\workspace\myfaces-maven2-plugins\maven2-plugins\myfaces-javascript-plugin\target\test-classes
[INFO]
[INFO] --- maven-surefire-plugin:2.5:test (default-test) @ myfaces-javascript-plugin ---
[INFO] Surefire report directory: F:\jenkins\jenkins-slave\workspace\myfaces-maven2-plugins\maven2-plugins\myfaces-javascript-plugin\target\surefire-reports
-------------------------------------------------------
T E S T S
-------------------------------------------------------
Running org.apache.myfaces.buildtools.maven2.plugin.javascript.jmt.CompressMojoTest
[INFO] ------------------------------------------------------------------------------
[INFO] builder.js (4,268 bytes) ................................... compressed at 36%
[INFO] controls.js (28,803 bytes) ................................. compressed at 33%
[INFO] dragdrop.js (31,513 bytes) ................................. compressed at 27%
[INFO] effects.js (33,802 bytes) .................................. compressed at 24%
[INFO] global.js (10,872 bytes) ................................... compressed at 17%
[INFO] scriptaculous.js (2,404 bytes) ............................. compressed at 64%
[INFO] slider.js (11,283 bytes) ................................... compressed at 32%
[INFO] unittest.js (20,047 bytes) ................................. compressed at 25%
[INFO] ------------------------------------------------------------------------------
[INFO] compression saved 5,062 bytes
[INFO] Building jar: F:\jenkins\jenkins-slave\workspace\myfaces-maven2-plugins\maven2-plugins\myfaces-javascript-plugin\target\test-target\attach-compressed\scriptaculous-1.7-compressed.jar
[INFO] ------------------------------------------------------------------------------
[INFO] builder.js (4,268 bytes) ................................... compressed at 36%
[INFO] controls.js (28,803 bytes) ................................. compressed at 33%
[INFO] dragdrop.js (31,513 bytes) ................................. compressed at 27%
[INFO] effects.js (33,802 bytes) .................................. compressed at 24%
[INFO] global.js (10,872 bytes) ................................... compressed at 17%
[INFO] scriptaculous.js (2,404 bytes) ............................. compressed at 64%
[INFO] slider.js (11,283 bytes) ................................... compressed at 32%
[INFO] unittest.js (20,047 bytes) ................................. compressed at 25%
[INFO] ------------------------------------------------------------------------------
[INFO] compression saved 5,062 bytes
[INFO] ------------------------------------------------------------------------------
[INFO] zero-length.js was zero length; not compressed.
[INFO] ------------------------------------------------------------------------------
[INFO] compression saved 0 bytes
Tests run: 3, Failures: 0, Errors: 0, Skipped: 0, Time elapsed: 1.503 sec
Running org.apache.myfaces.buildtools.maven2.plugin.javascript.jmt.compress.IsolatedClassLoaderTest
Tests run: 1, Failures: 0, Errors: 0, Skipped: 0, Time elapsed: 0.067 sec
Running org.apache.myfaces.buildtools.maven2.plugin.javascript.jmt.StripDebugsMojoTest
[INFO] ------------------------------------------------------------------------------
[INFO] debugs.js (724 bytes) ...................................... compressed at 86%
[INFO] ------------------------------------------------------------------------------
[INFO] compression saved 627 bytes
Tests run: 1, Failures: 0, Errors: 0, Skipped: 0, Time elapsed: 0.042 sec
Running org.apache.myfaces.buildtools.maven2.plugin.javascript.jmt.CompileMojoTest
[INFO] Reading assembler descriptor F:\jenkins\jenkins-slave\workspace\myfaces-maven2-plugins\maven2-plugins\myfaces-javascript-plugin\src\test\resources\assembler.xml
Tests run: 1, Failures: 0, Errors: 0, Skipped: 0, Time elapsed: 0.076 sec
Running org.apache.myfaces.buildtools.maven2.plugin.javascript.jmt.compress.YahooUICompressorTest
Tests run: 1, Failures: 0, Errors: 0, Skipped: 0, Time elapsed: 0.239 sec
Running org.apache.myfaces.buildtools.maven2.plugin.javascript.jmt.assembler.JsBuilderAssemblerReaderTest
Tests run: 1, Failures: 0, Errors: 0, Skipped: 0, Time elapsed: 0.164 sec
Running org.apache.myfaces.buildtools.maven2.plugin.javascript.jmt.WarPackageMojoTest
[INFO] Unpack javascript dependency [org.prototypejs:prototype:javascript:1.5.1.1:runtime]
[INFO] Expanding: src\test\resources\prototype-1.5.1.1.jar into F:\jenkins\jenkins-slave\workspace\myfaces-maven2-plugins\maven2-plugins\myfaces-javascript-plugin\target\test-target\war-package\scripts\lib
Tests run: 1, Failures: 0, Errors: 0, Skipped: 0, Time elapsed: 0.08 sec
Results :
Tests run: 9, Failures: 0, Errors: 0, Skipped: 0
[JENKINS] Recording test results
[INFO]
[INFO] --- maven-jar-plugin:2.2:jar (default-jar) @ myfaces-javascript-plugin ---
[INFO] Building jar: F:\jenkins\jenkins-slave\workspace\myfaces-maven2-plugins\maven2-plugins\myfaces-javascript-plugin\target\myfaces-javascript-plugin-1.0.3-SNAPSHOT.jar
[INFO]
[INFO] --- maven-plugin-plugin:2.5:addPluginArtifactMetadata (default-addPluginArtifactMetadata) @ myfaces-javascript-plugin ---
[INFO]
[INFO] --- maven-install-plugin:2.3:install (default-install) @ myfaces-javascript-plugin ---
[INFO] Installing F:\jenkins\jenkins-slave\workspace\myfaces-maven2-plugins\maven2-plugins\myfaces-javascript-plugin\target\myfaces-javascript-plugin-1.0.3-SNAPSHOT.jar to f:\jenkins\jenkins-slave\maven-repositories\0\org\apache\myfaces\buildtools\myfaces-javascript-plugin\1.0.3-SNAPSHOT\myfaces-javascript-plugin-1.0.3-SNAPSHOT.jar
[INFO] Installing F:\jenkins\jenkins-slave\workspace\myfaces-maven2-plugins\maven2-plugins\myfaces-javascript-plugin\pom.xml to f:\jenkins\jenkins-slave\maven-repositories\0\org\apache\myfaces\buildtools\myfaces-javascript-plugin\1.0.3-SNAPSHOT\myfaces-javascript-plugin-1.0.3-SNAPSHOT.pom
[INFO]
[INFO] ------------------------------------------------------------------------
[INFO] Building Apache MyFaces Buildtools Maven2 Javascript Documentation Plugin 1.0-beta-2-SNAPSHOT
[INFO] ------------------------------------------------------------------------
[INFO] Downloading: http://repo.maven.apache.org/maven2/rhino/js/1.7R1/js-1.7R1.pom
[INFO] Downloaded: http://repo.maven.apache.org/maven2/rhino/js/1.7R1/js-1.7R1.pom (786 B at 2.2 KB/sec)
[INFO] Downloading: http://repo.maven.apache.org/maven2/org/jsdoctoolkit/jsdoc/2.1.0/jsdoc-2.1.0.pom
[INFO] Downloaded: http://repo.maven.apache.org/maven2/org/jsdoctoolkit/jsdoc/2.1.0/jsdoc-2.1.0.pom (2 KB at 20.9 KB/sec)
[INFO] Downloading: http://repo.maven.apache.org/maven2/org/codehaus/plexus/plexus-component-api/1.0-alpha-15/plexus-component-api-1.0-alpha-15.jar
[INFO] Downloading: http://repo.maven.apache.org/maven2/org/codehaus/plexus/plexus-container-default/1.0-alpha-30/plexus-container-default-1.0-alpha-30.jar
[INFO] Downloading: http://repo.maven.apache.org/maven2/org/codehaus/plexus/plexus-classworlds/1.2-alpha-9/plexus-classworlds-1.2-alpha-9.jar
[INFO] Downloading: http://repo.maven.apache.org/maven2/rhino/js/1.7R1/js-1.7R1.jar
[INFO] Downloading: http://repo.maven.apache.org/maven2/org/jsdoctoolkit/jsdoc/2.1.0/jsdoc-2.1.0.jar
[INFO] Downloaded: http://repo.maven.apache.org/maven2/org/codehaus/plexus/plexus-component-api/1.0-alpha-15/plexus-component-api-1.0-alpha-15.jar (32 KB at 294.9 KB/sec)
[INFO] Downloaded: http://repo.maven.apache.org/maven2/org/codehaus/plexus/plexus-classworlds/1.2-alpha-9/plexus-classworlds-1.2-alpha-9.jar (42 KB at 324.5 KB/sec)
[INFO] Downloaded: http://repo.maven.apache.org/maven2/org/codehaus/plexus/plexus-container-default/1.0-alpha-30/plexus-container-default-1.0-alpha-30.jar (232 KB at 1012.6 KB/sec)
[INFO] Downloaded: http://repo.maven.apache.org/maven2/rhino/js/1.7R1/js-1.7R1.jar (740 KB at 1613.9 KB/sec)
[INFO] Downloaded: http://repo.maven.apache.org/maven2/org/jsdoctoolkit/jsdoc/2.1.0/jsdoc-2.1.0.jar (775 KB at 1520.8 KB/sec)
[INFO]
[INFO] --- maven-antrun-plugin:1.3:run (javadoc.resources) @ myfaces-jsdoc-plugin ---
[INFO] Executing tasks
[copy] Copying 2 files to F:\jenkins\jenkins-slave\workspace\myfaces-maven2-plugins\maven2-plugins\myfaces-jsdoc-plugin\target\apidocs\META-INF
[INFO] Executed tasks
[INFO]
[INFO] --- maven-plugin-plugin:2.5.1:descriptor (default-descriptor) @ myfaces-jsdoc-plugin ---
[INFO] Using 'UTF-8' encoding to read mojo metadata.
[INFO] Applying mojo extractor for language: java
[INFO] Mojo extractor for language: java found 3 mojo descriptors.
[INFO] Applying mojo extractor for language: bsh
[INFO] Mojo extractor for language: bsh found 0 mojo descriptors.
[INFO]
[INFO] --- maven-remote-resources-plugin:1.1:process (default) @ myfaces-jsdoc-plugin ---
[INFO]
[INFO] --- maven-resources-plugin:2.4.3:resources (default-resources) @ myfaces-jsdoc-plugin ---
[INFO] Using 'UTF-8' encoding to copy filtered resources.
[INFO] Copying 0 resource
[INFO] Copying 3 resources
[INFO]
[INFO] --- maven-compiler-plugin:2.0.2:compile (default-compile) @ myfaces-jsdoc-plugin ---
[INFO] Compiling 13 source files to F:\jenkins\jenkins-slave\workspace\myfaces-maven2-plugins\maven2-plugins\myfaces-jsdoc-plugin\target\classes
[INFO] ------------------------------------------------------------------------
[INFO] Reactor Summary:
[INFO]
[INFO] Apache MyFaces Buildtools Maven2 Plugin Parent .... SUCCESS [22.853s]
[INFO] Apache MyFaces Buildtools Maven2 Builder Annotations SUCCESS [8.423s]
[INFO] Apache MyFaces Buildtools Maven2 Builder Plugin ... SUCCESS [26.526s]
[INFO] Apache MyFaces Buildtools Maven2 Faces Plugin ..... SUCCESS [14.601s]
[INFO] Apache MyFaces Buildtools Maven2 i18n Plugin ...... SUCCESS [5.010s]
[INFO] Apache MyFaces Buildtools Maven2 Javacc Plugin .... SUCCESS [3.848s]
[INFO] Apache MyFaces Buildtools Maven2 Javascript Plugin SUCCESS [20.804s]
[INFO] Apache MyFaces Buildtools Maven2 Javascript Documentation Plugin FAILURE [4.400s]
[INFO] Apache MyFaces Buildtools Maven2 JDev Plugin ...... SKIPPED
[INFO] Apache MyFaces Buildtools Maven2 Tag Documentation Report SKIPPED
[INFO] Apache MyFaces Buildtools Maven2 Wagon Plugin ..... SKIPPED
[INFO] Apache MyFaces Buildtools Maven2 XRTS Plugin ...... SKIPPED
[INFO] Apache MyFaces Buildtools Maven2 Plugin Module .... SKIPPED
[INFO] ------------------------------------------------------------------------
[INFO] BUILD FAILURE
[INFO] ------------------------------------------------------------------------
[INFO] Total time: 1:54.741s
[INFO] Finished at: Mon Mar 17 03:36:24 PDT 2014
[INFO] Final Memory: 33M/167M
[INFO] ------------------------------------------------------------------------
Waiting for Jenkins to finish collecting data
[ERROR] Failed to execute goal org.apache.maven.plugins:maven-compiler-plugin:2.0.2:compile (default-compile) on project myfaces-jsdoc-plugin: Compilation failure
[ERROR] Failure executing javac, but could not parse the error:
[ERROR]
[ERROR]
[ERROR] The system is out of resources.
[ERROR] Consult the following stack trace for details.
[ERROR] java.lang.OutOfMemoryError: PermGen space
[ERROR] at java.lang.ClassLoader.defineClass1(Native Method)
[ERROR] at java.lang.ClassLoader.defineClassCond(ClassLoader.java:631)
[ERROR] at java.lang.ClassLoader.defineClass(ClassLoader.java:615)
[ERROR] at java.security.SecureClassLoader.defineClass(SecureClassLoader.java:141)
[ERROR] at java.net.URLClassLoader.defineClass(URLClassLoader.java:283)
[ERROR] at java.net.URLClassLoader.access$000(URLClassLoader.java:58)
[ERROR] at java.net.URLClassLoader$1.run(URLClassLoader.java:197)
[ERROR] at java.security.AccessController.doPrivileged(Native Method)
[JENKINS] Archiving F:\jenkins\jenkins-slave\workspace\myfaces-maven2-plugins\maven2-plugins\myfaces-i18n-plugin\pom.xml to org.apache.myfaces.buildtools/myfaces-i18n-plugin/1.0.1-SNAPSHOT/myfaces-i18n-plugin-1.0.1-SNAPSHOT.pom
[JENKINS] Archiving F:\jenkins\jenkins-slave\workspace\myfaces-maven2-plugins\maven2-plugins\myfaces-i18n-plugin\target\myfaces-i18n-plugin-1.0.1-SNAPSHOT.jar to org.apache.myfaces.buildtools/myfaces-i18n-plugin/1.0.1-SNAPSHOT/myfaces-i18n-plugin-1.0.1-SNAPSHOT.jar
[ERROR] at java.net.URLClassLoader.findClass(URLClassLoader.java:190)
[ERROR] at org.codehaus.plexus.compiler.javac.IsolatedClassLoader.loadClass(IsolatedClassLoader.java:56)
[ERROR] at com.sun.tools.javac.comp.Resolve.<init>(Resolve.java:79)
[ERROR] at com.sun.tools.javac.comp.Resolve.instance(Resolve.java:55)
[ERROR] at com.sun.tools.javac.comp.Attr.<init>(Attr.java:84)
[ERROR] at com.sun.tools.javac.comp.Attr.instance(Attr.java:74)
[ERROR] at com.sun.tools.javac.comp.Annotate.<init>(Annotate.java:52)
[ERROR] at com.sun.tools.javac.comp.Annotate.instance(Annotate.java:36)
[ERROR] at com.sun.tools.javac.jvm.ClassReader.<init>(ClassReader.java:215)
[ERROR] at com.sun.tools.javac.jvm.ClassReader.instance(ClassReader.java:168)
[ERROR] at com.sun.tools.javac.main.JavaCompiler.<init>(JavaCompiler.java:293)
[ERROR] at com.sun.tools.javac.main.JavaCompiler.instance(JavaCompiler.java:72)
[ERROR] at com.sun.tools.javac.main.Main.compile(Main.java:340)
[ERROR] at com.sun.tools.javac.main.Main.compile(Main.java:279)
[ERROR] at com.sun.tools.javac.main.Main.compile(Main.java:270)
[ERROR] at com.sun.tools.javac.Main.compile(Main.java:87)
[ERROR] at sun.reflect.NativeMethodAccessorImpl.invoke0(Native Method)
[ERROR] at sun.reflect.NativeMethodAccessorImpl.invoke(NativeMethodAccessorImpl.java:39)
[ERROR] at sun.reflect.DelegatingMethodAccessorImpl.invoke(DelegatingMethodAccessorImpl.java:25)
[ERROR] at java.lang.reflect.Method.invoke(Method.java:597)
[ERROR] at org.codehaus.plexus.compiler.javac.JavacCompiler.compileInProcess(JavacCompiler.java:420)
[ERROR] at org.codehaus.plexus.compiler.javac.JavacCompiler.compile(JavacCompiler.java:141)
[ERROR] at org.apache.maven.plugin.AbstractCompilerMojo.execute(AbstractCompilerMojo.java:493)
[ERROR] at org.apache.maven.plugin.CompilerMojo.execute(CompilerMojo.java:114)
[ERROR] -> [Help 1]
[ERROR]
[ERROR] To see the full stack trace of the errors, re-run Maven with the -e switch.
[ERROR] Re-run Maven using the -X switch to enable full debug logging.
[ERROR]
[ERROR] For more information about the errors and possible solutions, please read the following articles:
[ERROR] [Help 1] http://cwiki.apache.org/confluence/display/MAVEN/MojoFailureException
[ERROR]
[ERROR] After correcting the problems, you can resume the build with the command
[ERROR] mvn <goals> -rf :myfaces-jsdoc-plugin
[JENKINS] Archiving F:\jenkins\jenkins-slave\workspace\myfaces-maven2-plugins\maven2-plugins\myfaces-wagon-plugin\pom.xml to org.apache.myfaces.buildtools/myfaces-wagon-plugin/1.0.1-SNAPSHOT/myfaces-wagon-plugin-1.0.1-SNAPSHOT.pom
[JENKINS] Archiving F:\jenkins\jenkins-slave\workspace\myfaces-maven2-plugins\maven2-plugins\myfaces-faces-plugin\pom.xml to org.apache.myfaces.buildtools/myfaces-faces-plugin/1.0.1-SNAPSHOT/myfaces-faces-plugin-1.0.1-SNAPSHOT.pom
[JENKINS] Archiving F:\jenkins\jenkins-slave\workspace\myfaces-maven2-plugins\maven2-plugins\myfaces-faces-plugin\target\myfaces-faces-plugin-1.0.1-SNAPSHOT.jar to org.apache.myfaces.buildtools/myfaces-faces-plugin/1.0.1-SNAPSHOT/myfaces-faces-plugin-1.0.1-SNAPSHOT.jar
[JENKINS] Archiving F:\jenkins\jenkins-slave\workspace\myfaces-maven2-plugins\maven2-plugins\myfaces-builder-annotations\pom.xml to org.apache.myfaces.buildtools/myfaces-builder-annotations/1.0.10-SNAPSHOT/myfaces-builder-annotations-1.0.10-SNAPSHOT.pom
[JENKINS] Archiving F:\jenkins\jenkins-slave\workspace\myfaces-maven2-plugins\maven2-plugins\myfaces-builder-annotations\target\myfaces-builder-annotations-1.0.10-SNAPSHOT.jar to org.apache.myfaces.buildtools/myfaces-builder-annotations/1.0.10-SNAPSHOT/myfaces-builder-annotations-1.0.10-SNAPSHOT.jar
[JENKINS] Archiving F:\jenkins\jenkins-slave\workspace\myfaces-maven2-plugins\maven2-plugins\myfaces-tagdoc-plugin\pom.xml to org.apache.myfaces.buildtools/myfaces-tagdoc-plugin/1.0.1-SNAPSHOT/myfaces-tagdoc-plugin-1.0.1-SNAPSHOT.pom
[JENKINS] Archiving F:\jenkins\jenkins-slave\workspace\myfaces-maven2-plugins\maven2-plugins\myfaces-jsdoc-plugin\pom.xml to org.apache.myfaces.buildtools/myfaces-jsdoc-plugin/1.0-beta-2-SNAPSHOT/myfaces-jsdoc-plugin-1.0-beta-2-SNAPSHOT.pom
[JENKINS] Archiving F:\jenkins\jenkins-slave\workspace\myfaces-maven2-plugins\maven2-plugins\myfaces-builder-plugin\pom.xml to org.apache.myfaces.buildtools/myfaces-builder-plugin/1.0.11-SNAPSHOT/myfaces-builder-plugin-1.0.11-SNAPSHOT.pom
[JENKINS] Archiving F:\jenkins\jenkins-slave\workspace\myfaces-maven2-plugins\maven2-plugins\myfaces-builder-plugin\target\myfaces-builder-plugin-1.0.11-SNAPSHOT.jar to org.apache.myfaces.buildtools/myfaces-builder-plugin/1.0.11-SNAPSHOT/myfaces-builder-plugin-1.0.11-SNAPSHOT.jar
[JENKINS] Archiving F:\jenkins\jenkins-slave\workspace\myfaces-maven2-plugins\maven2-plugins\myfaces-xrts-plugin\pom.xml to org.apache.myfaces.buildtools/myfaces-xrts-plugin/1.0.1-SNAPSHOT/myfaces-xrts-plugin-1.0.1-SNAPSHOT.pom
[JENKINS] Archiving F:\jenkins\jenkins-slave\workspace\myfaces-maven2-plugins\maven2-plugins\myfaces-jdev-plugin\pom.xml to org.apache.myfaces.buildtools/myfaces-jdev-plugin/1.0.1-SNAPSHOT/myfaces-jdev-plugin-1.0.1-SNAPSHOT.pom
[JENKINS] Archiving F:\jenkins\jenkins-slave\workspace\myfaces-maven2-plugins\maven2-plugins\myfaces-javacc-plugin\pom.xml to org.apache.myfaces.buildtools/myfaces-javacc-plugin/1.0.2-SNAPSHOT/myfaces-javacc-plugin-1.0.2-SNAPSHOT.pom
[JENKINS] Archiving F:\jenkins\jenkins-slave\workspace\myfaces-maven2-plugins\maven2-plugins\myfaces-javacc-plugin\target\myfaces-javacc-plugin-1.0.2-SNAPSHOT.jar to org.apache.myfaces.buildtools/myfaces-javacc-plugin/1.0.2-SNAPSHOT/myfaces-javacc-plugin-1.0.2-SNAPSHOT.jar
[JENKINS] Archiving F:\jenkins\jenkins-slave\workspace\myfaces-maven2-plugins\maven2-plugins\myfaces-plugin-parent\pom.xml to org.apache.myfaces.buildtools/myfaces-plugin-parent/1.0.7-SNAPSHOT/myfaces-plugin-parent-1.0.7-SNAPSHOT.pom
[JENKINS] Archiving F:\jenkins\jenkins-slave\workspace\myfaces-maven2-plugins\maven2-plugins\myfaces-plugin-parent\target\myfaces-plugin-parent-1.0.7-SNAPSHOT-site.xml to org.apache.myfaces.buildtools/myfaces-plugin-parent/1.0.7-SNAPSHOT/myfaces-plugin-parent-1.0.7-SNAPSHOT-site.xml
[JENKINS] Archiving <https://builds.apache.org/job/myfaces-maven2-plugins/ws/maven2-plugins\pom.xml> to org.apache.myfaces.buildtools/myfaces-plugin-module/1-SNAPSHOT/myfaces-plugin-module-1-SNAPSHOT.pom
[JENKINS] Archiving F:\jenkins\jenkins-slave\workspace\myfaces-maven2-plugins\maven2-plugins\myfaces-javascript-plugin\pom.xml to org.apache.myfaces.buildtools/myfaces-javascript-plugin/1.0.3-SNAPSHOT/myfaces-javascript-plugin-1.0.3-SNAPSHOT.pom
[JENKINS] Archiving F:\jenkins\jenkins-slave\workspace\myfaces-maven2-plugins\maven2-plugins\myfaces-javascript-plugin\target\myfaces-javascript-plugin-1.0.3-SNAPSHOT.jar to org.apache.myfaces.buildtools/myfaces-javascript-plugin/1.0.3-SNAPSHOT/myfaces-javascript-plugin-1.0.3-SNAPSHOT.jar
channel stopped
Build failed in Jenkins: myfaces-maven2-plugins #1283
Posted by Apache Jenkins Server <je...@builds.apache.org>.
See <https://builds.apache.org/job/myfaces-maven2-plugins/1283/>
------------------------------------------
[...truncated 715 lines...]
[INFO] Downloading: http://repo.maven.apache.org/maven2/org/apache/maven/maven-profile/2.0.2/maven-profile-2.0.2.jar
[INFO] Downloaded: http://repo.maven.apache.org/maven2/org/apache/maven/maven-profile/2.0.2/maven-profile-2.0.2.jar (30 KB at 378.9 KB/sec)
[INFO] Downloading: http://repo.maven.apache.org/maven2/org/apache/maven/maven-plugin-api/2.0.2/maven-plugin-api-2.0.2.jar
[INFO] Downloaded: http://repo.maven.apache.org/maven2/org/apache/maven/maven-repository-metadata/2.0.2/maven-repository-metadata-2.0.2.jar (20 KB at 246.6 KB/sec)
[INFO] Downloading: http://repo.maven.apache.org/maven2/org/apache/maven/maven-artifact/2.0.2/maven-artifact-2.0.2.jar
[INFO] Downloaded: http://repo.maven.apache.org/maven2/org/apache/maven/maven-artifact-manager/2.0.2/maven-artifact-manager-2.0.2.jar (49 KB at 615.4 KB/sec)
[INFO] Downloaded: http://repo.maven.apache.org/maven2/org/apache/maven/maven-project/2.0.2/maven-project-2.0.2.jar (105 KB at 1123.2 KB/sec)
[INFO] Downloaded: http://repo.maven.apache.org/maven2/org/apache/maven/maven-model/2.0.2/maven-model-2.0.2.jar (79 KB at 845.3 KB/sec)
[INFO] Downloaded: http://repo.maven.apache.org/maven2/org/apache/maven/maven-plugin-api/2.0.2/maven-plugin-api-2.0.2.jar (9 KB at 131.3 KB/sec)
[INFO] Downloaded: http://repo.maven.apache.org/maven2/org/apache/maven/maven-artifact/2.0.2/maven-artifact-2.0.2.jar (77 KB at 824.2 KB/sec)
[INFO]
[INFO] --- maven-antrun-plugin:1.3:run (javadoc.resources) @ myfaces-wagon-plugin ---
[INFO] Executing tasks
[copy] Copying 2 files to F:\jenkins\jenkins-slave\workspace\myfaces-maven2-plugins\maven2-plugins\myfaces-wagon-plugin\target\apidocs\META-INF
[INFO] Executed tasks
[INFO]
[INFO] --- maven-plugin-plugin:2.5.1:descriptor (default-descriptor) @ myfaces-wagon-plugin ---
[INFO] Using 'UTF-8' encoding to read mojo metadata.
[INFO] Applying mojo extractor for language: java
[INFO] Mojo extractor for language: java found 1 mojo descriptors.
[INFO] Applying mojo extractor for language: bsh
[INFO] Mojo extractor for language: bsh found 0 mojo descriptors.
[INFO]
[INFO] --- maven-remote-resources-plugin:1.1:process (default) @ myfaces-wagon-plugin ---
[INFO] Setting property: classpath.resource.loader.class => 'org.codehaus.plexus.velocity.ContextClassLoaderResourceLoader'.
[INFO] Setting property: velocimacro.messages.on => 'false'.
[INFO] Setting property: resource.loader => 'classpath'.
[INFO] Setting property: resource.manager.logwhenfound => 'false'.
[INFO]
[INFO] --- maven-resources-plugin:2.4.3:resources (default-resources) @ myfaces-wagon-plugin ---
[INFO] Using 'UTF-8' encoding to copy filtered resources.
[INFO] Copying 2 resources
[INFO] Copying 3 resources
[INFO]
[INFO] --- maven-compiler-plugin:2.3.1:compile (default-compile) @ myfaces-wagon-plugin ---
[INFO] Compiling 1 source file to F:\jenkins\jenkins-slave\workspace\myfaces-maven2-plugins\maven2-plugins\myfaces-wagon-plugin\target\classes
[INFO]
[INFO] --- maven-resources-plugin:2.4.3:testResources (default-testResources) @ myfaces-wagon-plugin ---
[INFO] Using 'UTF-8' encoding to copy filtered resources.
[INFO] skip non existing resourceDirectory F:\jenkins\jenkins-slave\workspace\myfaces-maven2-plugins\maven2-plugins\myfaces-wagon-plugin\src\test\resources
[INFO] Copying 3 resources
[INFO]
[INFO] --- maven-compiler-plugin:2.3.1:testCompile (default-testCompile) @ myfaces-wagon-plugin ---
[INFO] No sources to compile
[INFO]
[INFO] --- maven-surefire-plugin:2.5:test (default-test) @ myfaces-wagon-plugin ---
[INFO] Surefire report directory: F:\jenkins\jenkins-slave\workspace\myfaces-maven2-plugins\maven2-plugins\myfaces-wagon-plugin\target\surefire-reports
-------------------------------------------------------
T E S T S
-------------------------------------------------------
There are no tests to run.
Results :
Tests run: 0, Failures: 0, Errors: 0, Skipped: 0
[JENKINS] Recording test results
[INFO]
[INFO] --- maven-jar-plugin:2.2:jar (default-jar) @ myfaces-wagon-plugin ---
[INFO] Building jar: F:\jenkins\jenkins-slave\workspace\myfaces-maven2-plugins\maven2-plugins\myfaces-wagon-plugin\target\myfaces-wagon-plugin-1.0.1-SNAPSHOT.jar
[INFO]
[INFO] --- maven-plugin-plugin:2.5.1:addPluginArtifactMetadata (default-addPluginArtifactMetadata) @ myfaces-wagon-plugin ---
[INFO]
[INFO] --- maven-install-plugin:2.3:install (default-install) @ myfaces-wagon-plugin ---
[INFO] Installing F:\jenkins\jenkins-slave\workspace\myfaces-maven2-plugins\maven2-plugins\myfaces-wagon-plugin\target\myfaces-wagon-plugin-1.0.1-SNAPSHOT.jar to f:\jenkins\jenkins-slave\maven-repositories\0\org\apache\myfaces\buildtools\myfaces-wagon-plugin\1.0.1-SNAPSHOT\myfaces-wagon-plugin-1.0.1-SNAPSHOT.jar
[INFO] Installing F:\jenkins\jenkins-slave\workspace\myfaces-maven2-plugins\maven2-plugins\myfaces-wagon-plugin\pom.xml to f:\jenkins\jenkins-slave\maven-repositories\0\org\apache\myfaces\buildtools\myfaces-wagon-plugin\1.0.1-SNAPSHOT\myfaces-wagon-plugin-1.0.1-SNAPSHOT.pom
[INFO]
[INFO] ------------------------------------------------------------------------
[INFO] Building Apache MyFaces Buildtools Maven2 XRTS Plugin 1.0.1-SNAPSHOT
[INFO] ------------------------------------------------------------------------
[INFO]
[INFO] --- maven-antrun-plugin:1.3:run (javadoc.resources) @ myfaces-xrts-plugin ---
[INFO] Executing tasks
[copy] Copying 2 files to F:\jenkins\jenkins-slave\workspace\myfaces-maven2-plugins\maven2-plugins\myfaces-xrts-plugin\target\apidocs\META-INF
[INFO] Executed tasks
[INFO]
[INFO] --- maven-plugin-plugin:2.2:descriptor (default-descriptor) @ myfaces-xrts-plugin ---
[INFO] Using 2 extractors.
[INFO] Applying extractor for language: java
[INFO] Extractor for language: java found 2 mojo descriptors.
[INFO] Applying extractor for language: bsh
[INFO] Extractor for language: bsh found 0 mojo descriptors.
[INFO]
[INFO] --- maven-remote-resources-plugin:1.1:process (default) @ myfaces-xrts-plugin ---
[INFO]
[INFO] --- maven-resources-plugin:2.4.3:resources (default-resources) @ myfaces-xrts-plugin ---
[INFO] Using 'UTF-8' encoding to copy filtered resources.
[INFO] Copying 0 resource
[INFO] Copying 3 resources
[INFO]
[INFO] --- maven-compiler-plugin:2.3.1:compile (default-compile) @ myfaces-xrts-plugin ---
[INFO] Compiling 8 source files to F:\jenkins\jenkins-slave\workspace\myfaces-maven2-plugins\maven2-plugins\myfaces-xrts-plugin\target\classes
[WARNING] \jenkins\jenkins-slave\workspace\myfaces-maven2-plugins\maven2-plugins\myfaces-xrts-plugin\src\main\java\org\apache\myfaces\buildtools\maven2\plugin\xrts\XRTSParser.java:[26,18] [deprecation] org.xml.sax.AttributeList in org.xml.sax has been deprecated
[WARNING] \jenkins\jenkins-slave\workspace\myfaces-maven2-plugins\maven2-plugins\myfaces-xrts-plugin\src\main\java\org\apache\myfaces\buildtools\maven2\plugin\xrts\XRTSParser.java:[27,18] [deprecation] org.xml.sax.HandlerBase in org.xml.sax has been deprecated
[WARNING] \jenkins\jenkins-slave\workspace\myfaces-maven2-plugins\maven2-plugins\myfaces-xrts-plugin\src\main\java\org\apache\myfaces\buildtools\maven2\plugin\xrts\XRTSParser.java:[33,31] [deprecation] org.xml.sax.HandlerBase in org.xml.sax has been deprecated
[WARNING] \jenkins\jenkins-slave\workspace\myfaces-maven2-plugins\maven2-plugins\myfaces-xrts-plugin\src\main\java\org\apache\myfaces\buildtools\maven2\plugin\xrts\XRTSParser.java:[97,40] [deprecation] org.xml.sax.AttributeList in org.xml.sax has been deprecated
[WARNING] \jenkins\jenkins-slave\workspace\myfaces-maven2-plugins\maven2-plugins\myfaces-xrts-plugin\src\main\java\org\apache\myfaces\buildtools\maven2\plugin\xrts\AbstractGenerateSourcesMojo.java:[99,25] [unchecked] unchecked call to LinkedList(java.util.Collection<? extends E>) as a member of the raw type java.util.LinkedList
[WARNING] \jenkins\jenkins-slave\workspace\myfaces-maven2-plugins\maven2-plugins\myfaces-xrts-plugin\src\main\java\org\apache\myfaces\buildtools\maven2\plugin\xrts\AbstractGenerateSourcesMojo.java:[132,22] [unchecked] unchecked call to put(K,V) as a member of the raw type java.util.Map
[WARNING] \jenkins\jenkins-slave\workspace\myfaces-maven2-plugins\maven2-plugins\myfaces-xrts-plugin\src\main\java\org\apache\myfaces\buildtools\maven2\plugin\xrts\AbstractGenerateSourcesMojo.java:[133,22] [unchecked] unchecked call to put(K,V) as a member of the raw type java.util.Map
[WARNING] \jenkins\jenkins-slave\workspace\myfaces-maven2-plugins\maven2-plugins\myfaces-xrts-plugin\src\main\java\org\apache\myfaces\buildtools\maven2\plugin\xrts\AbstractGenerateSourcesMojo.java:[134,22] [unchecked] unchecked call to put(K,V) as a member of the raw type java.util.Map
[WARNING] \jenkins\jenkins-slave\workspace\myfaces-maven2-plugins\maven2-plugins\myfaces-xrts-plugin\src\main\java\org\apache\myfaces\buildtools\maven2\plugin\xrts\AbstractGenerateSourcesMojo.java:[135,22] [unchecked] unchecked call to put(K,V) as a member of the raw type java.util.Map
[WARNING] \jenkins\jenkins-slave\workspace\myfaces-maven2-plugins\maven2-plugins\myfaces-xrts-plugin\src\main\java\org\apache\myfaces\buildtools\maven2\plugin\xrts\AbstractGenerateSourcesMojo.java:[136,22] [unchecked] unchecked call to put(K,V) as a member of the raw type java.util.Map
[WARNING] \jenkins\jenkins-slave\workspace\myfaces-maven2-plugins\maven2-plugins\myfaces-xrts-plugin\src\main\java\org\apache\myfaces\buildtools\maven2\plugin\xrts\AbstractGenerateSourcesMojo.java:[139,57] [deprecation] toURL() in java.io.File has been deprecated
[INFO]
[INFO] --- maven-resources-plugin:2.4.3:testResources (default-testResources) @ myfaces-xrts-plugin ---
[INFO] Using 'UTF-8' encoding to copy filtered resources.
[INFO] skip non existing resourceDirectory F:\jenkins\jenkins-slave\workspace\myfaces-maven2-plugins\maven2-plugins\myfaces-xrts-plugin\src\test\resources
[INFO] Copying 3 resources
[INFO]
[INFO] --- maven-compiler-plugin:2.3.1:testCompile (default-testCompile) @ myfaces-xrts-plugin ---
[INFO] No sources to compile
[INFO]
[INFO] --- maven-surefire-plugin:2.5:test (default-test) @ myfaces-xrts-plugin ---
[INFO] Surefire report directory: F:\jenkins\jenkins-slave\workspace\myfaces-maven2-plugins\maven2-plugins\myfaces-xrts-plugin\target\surefire-reports
-------------------------------------------------------
T E S T S
-------------------------------------------------------
There are no tests to run.
Results :
Tests run: 0, Failures: 0, Errors: 0, Skipped: 0
[JENKINS] Recording test results
[INFO]
[INFO] --- maven-jar-plugin:2.2:jar (default-jar) @ myfaces-xrts-plugin ---
[INFO] Building jar: F:\jenkins\jenkins-slave\workspace\myfaces-maven2-plugins\maven2-plugins\myfaces-xrts-plugin\target\myfaces-xrts-plugin-1.0.1-SNAPSHOT.jar
[INFO]
[INFO] --- maven-plugin-plugin:2.2:addPluginArtifactMetadata (default-addPluginArtifactMetadata) @ myfaces-xrts-plugin ---
[INFO]
[INFO] --- maven-install-plugin:2.3:install (default-install) @ myfaces-xrts-plugin ---
[INFO] Installing F:\jenkins\jenkins-slave\workspace\myfaces-maven2-plugins\maven2-plugins\myfaces-xrts-plugin\target\myfaces-xrts-plugin-1.0.1-SNAPSHOT.jar to f:\jenkins\jenkins-slave\maven-repositories\0\org\apache\myfaces\buildtools\myfaces-xrts-plugin\1.0.1-SNAPSHOT\myfaces-xrts-plugin-1.0.1-SNAPSHOT.jar
[INFO] Installing F:\jenkins\jenkins-slave\workspace\myfaces-maven2-plugins\maven2-plugins\myfaces-xrts-plugin\pom.xml to f:\jenkins\jenkins-slave\maven-repositories\0\org\apache\myfaces\buildtools\myfaces-xrts-plugin\1.0.1-SNAPSHOT\myfaces-xrts-plugin-1.0.1-SNAPSHOT.pom
[INFO]
[INFO] ------------------------------------------------------------------------
[INFO] Building Apache MyFaces Buildtools Maven2 Plugin Module 1-SNAPSHOT
[INFO] ------------------------------------------------------------------------
[INFO]
[INFO] --- maven-remote-resources-plugin:1.1:process (default) @ myfaces-plugin-module ---
[INFO]
[INFO] --- maven-install-plugin:2.3:install (default-install) @ myfaces-plugin-module ---
[INFO] Installing <https://builds.apache.org/job/myfaces-maven2-plugins/ws/maven2-plugins\pom.xml> to f:\jenkins\jenkins-slave\maven-repositories\0\org\apache\myfaces\buildtools\myfaces-plugin-module\1-SNAPSHOT\myfaces-plugin-module-1-SNAPSHOT.pom
[INFO] ------------------------------------------------------------------------
[INFO] Reactor Summary:
[INFO]
[INFO] Apache MyFaces Buildtools Maven2 Plugin Parent .... SUCCESS [10.094s]
[INFO] Apache MyFaces Buildtools Maven2 Builder Annotations SUCCESS [5.594s]
[INFO] Apache MyFaces Buildtools Maven2 Builder Plugin ... SUCCESS [13.515s]
[INFO] Apache MyFaces Buildtools Maven2 Faces Plugin ..... SUCCESS [10.141s]
[INFO] Apache MyFaces Buildtools Maven2 i18n Plugin ...... SUCCESS [2.859s]
[INFO] Apache MyFaces Buildtools Maven2 Javacc Plugin .... SUCCESS [2.094s]
[INFO] Apache MyFaces Buildtools Maven2 Javascript Plugin SUCCESS [23.687s]
[INFO] Apache MyFaces Buildtools Maven2 Javascript Documentation Plugin SUCCESS [3.265s]
[INFO] Apache MyFaces Buildtools Maven2 JDev Plugin ...... SUCCESS [2.796s]
[INFO] Apache MyFaces Buildtools Maven2 Tag Documentation Report SUCCESS [5.641s]
[INFO] Apache MyFaces Buildtools Maven2 Wagon Plugin ..... SUCCESS [5.875s]
[INFO] Apache MyFaces Buildtools Maven2 XRTS Plugin ...... SUCCESS [2.000s]
[INFO] Apache MyFaces Buildtools Maven2 Plugin Module .... SUCCESS [1.140s]
[INFO] ------------------------------------------------------------------------
[INFO] BUILD SUCCESS
[INFO] ------------------------------------------------------------------------
[INFO] Total time: 1:39.984s
[INFO] Finished at: Mon Mar 17 22:01:12 PDT 2014
[INFO] Final Memory: 58M/140M
[INFO] ------------------------------------------------------------------------
Waiting for Jenkins to finish collecting data
[JENKINS] Archiving F:\jenkins\jenkins-slave\workspace\myfaces-maven2-plugins\maven2-plugins\myfaces-i18n-plugin\pom.xml to org.apache.myfaces.buildtools/myfaces-i18n-plugin/1.0.1-SNAPSHOT/myfaces-i18n-plugin-1.0.1-SNAPSHOT.pom
[JENKINS] Archiving F:\jenkins\jenkins-slave\workspace\myfaces-maven2-plugins\maven2-plugins\myfaces-i18n-plugin\target\myfaces-i18n-plugin-1.0.1-SNAPSHOT.jar to org.apache.myfaces.buildtools/myfaces-i18n-plugin/1.0.1-SNAPSHOT/myfaces-i18n-plugin-1.0.1-SNAPSHOT.jar
[JENKINS] Archiving F:\jenkins\jenkins-slave\workspace\myfaces-maven2-plugins\maven2-plugins\myfaces-wagon-plugin\pom.xml to org.apache.myfaces.buildtools/myfaces-wagon-plugin/1.0.1-SNAPSHOT/myfaces-wagon-plugin-1.0.1-SNAPSHOT.pom
[JENKINS] Archiving F:\jenkins\jenkins-slave\workspace\myfaces-maven2-plugins\maven2-plugins\myfaces-wagon-plugin\target\myfaces-wagon-plugin-1.0.1-SNAPSHOT.jar to org.apache.myfaces.buildtools/myfaces-wagon-plugin/1.0.1-SNAPSHOT/myfaces-wagon-plugin-1.0.1-SNAPSHOT.jar
[JENKINS] Archiving F:\jenkins\jenkins-slave\workspace\myfaces-maven2-plugins\maven2-plugins\myfaces-faces-plugin\pom.xml to org.apache.myfaces.buildtools/myfaces-faces-plugin/1.0.1-SNAPSHOT/myfaces-faces-plugin-1.0.1-SNAPSHOT.pom
[JENKINS] Archiving F:\jenkins\jenkins-slave\workspace\myfaces-maven2-plugins\maven2-plugins\myfaces-faces-plugin\target\myfaces-faces-plugin-1.0.1-SNAPSHOT.jar to org.apache.myfaces.buildtools/myfaces-faces-plugin/1.0.1-SNAPSHOT/myfaces-faces-plugin-1.0.1-SNAPSHOT.jar
[JENKINS] Archiving F:\jenkins\jenkins-slave\workspace\myfaces-maven2-plugins\maven2-plugins\myfaces-builder-annotations\pom.xml to org.apache.myfaces.buildtools/myfaces-builder-annotations/1.0.10-SNAPSHOT/myfaces-builder-annotations-1.0.10-SNAPSHOT.pom
[JENKINS] Archiving F:\jenkins\jenkins-slave\workspace\myfaces-maven2-plugins\maven2-plugins\myfaces-builder-annotations\target\myfaces-builder-annotations-1.0.10-SNAPSHOT.jar to org.apache.myfaces.buildtools/myfaces-builder-annotations/1.0.10-SNAPSHOT/myfaces-builder-annotations-1.0.10-SNAPSHOT.jar
[JENKINS] Archiving F:\jenkins\jenkins-slave\workspace\myfaces-maven2-plugins\maven2-plugins\myfaces-tagdoc-plugin\pom.xml to org.apache.myfaces.buildtools/myfaces-tagdoc-plugin/1.0.1-SNAPSHOT/myfaces-tagdoc-plugin-1.0.1-SNAPSHOT.pom
[JENKINS] Archiving F:\jenkins\jenkins-slave\workspace\myfaces-maven2-plugins\maven2-plugins\myfaces-tagdoc-plugin\target\myfaces-tagdoc-plugin-1.0.1-SNAPSHOT.jar to org.apache.myfaces.buildtools/myfaces-tagdoc-plugin/1.0.1-SNAPSHOT/myfaces-tagdoc-plugin-1.0.1-SNAPSHOT.jar
[JENKINS] Archiving F:\jenkins\jenkins-slave\workspace\myfaces-maven2-plugins\maven2-plugins\myfaces-jsdoc-plugin\pom.xml to org.apache.myfaces.buildtools/myfaces-jsdoc-plugin/1.0-beta-2-SNAPSHOT/myfaces-jsdoc-plugin-1.0-beta-2-SNAPSHOT.pom
[JENKINS] Archiving F:\jenkins\jenkins-slave\workspace\myfaces-maven2-plugins\maven2-plugins\myfaces-jsdoc-plugin\target\myfaces-jsdoc-plugin-1.0-beta-2-SNAPSHOT.jar to org.apache.myfaces.buildtools/myfaces-jsdoc-plugin/1.0-beta-2-SNAPSHOT/myfaces-jsdoc-plugin-1.0-beta-2-SNAPSHOT.jar
[JENKINS] Archiving F:\jenkins\jenkins-slave\workspace\myfaces-maven2-plugins\maven2-plugins\myfaces-builder-plugin\pom.xml to org.apache.myfaces.buildtools/myfaces-builder-plugin/1.0.11-SNAPSHOT/myfaces-builder-plugin-1.0.11-SNAPSHOT.pom
[JENKINS] Archiving F:\jenkins\jenkins-slave\workspace\myfaces-maven2-plugins\maven2-plugins\myfaces-builder-plugin\target\myfaces-builder-plugin-1.0.11-SNAPSHOT.jar to org.apache.myfaces.buildtools/myfaces-builder-plugin/1.0.11-SNAPSHOT/myfaces-builder-plugin-1.0.11-SNAPSHOT.jar
[JENKINS] Archiving F:\jenkins\jenkins-slave\workspace\myfaces-maven2-plugins\maven2-plugins\myfaces-xrts-plugin\pom.xml to org.apache.myfaces.buildtools/myfaces-xrts-plugin/1.0.1-SNAPSHOT/myfaces-xrts-plugin-1.0.1-SNAPSHOT.pom
[JENKINS] Archiving F:\jenkins\jenkins-slave\workspace\myfaces-maven2-plugins\maven2-plugins\myfaces-xrts-plugin\target\myfaces-xrts-plugin-1.0.1-SNAPSHOT.jar to org.apache.myfaces.buildtools/myfaces-xrts-plugin/1.0.1-SNAPSHOT/myfaces-xrts-plugin-1.0.1-SNAPSHOT.jar
[JENKINS] Archiving F:\jenkins\jenkins-slave\workspace\myfaces-maven2-plugins\maven2-plugins\myfaces-jdev-plugin\pom.xml to org.apache.myfaces.buildtools/myfaces-jdev-plugin/1.0.1-SNAPSHOT/myfaces-jdev-plugin-1.0.1-SNAPSHOT.pom
[JENKINS] Archiving F:\jenkins\jenkins-slave\workspace\myfaces-maven2-plugins\maven2-plugins\myfaces-jdev-plugin\target\myfaces-jdev-plugin-1.0.1-SNAPSHOT.jar to org.apache.myfaces.buildtools/myfaces-jdev-plugin/1.0.1-SNAPSHOT/myfaces-jdev-plugin-1.0.1-SNAPSHOT.jar
[JENKINS] Archiving F:\jenkins\jenkins-slave\workspace\myfaces-maven2-plugins\maven2-plugins\myfaces-javacc-plugin\pom.xml to org.apache.myfaces.buildtools/myfaces-javacc-plugin/1.0.2-SNAPSHOT/myfaces-javacc-plugin-1.0.2-SNAPSHOT.pom
[JENKINS] Archiving F:\jenkins\jenkins-slave\workspace\myfaces-maven2-plugins\maven2-plugins\myfaces-javacc-plugin\target\myfaces-javacc-plugin-1.0.2-SNAPSHOT.jar to org.apache.myfaces.buildtools/myfaces-javacc-plugin/1.0.2-SNAPSHOT/myfaces-javacc-plugin-1.0.2-SNAPSHOT.jar
[JENKINS] Archiving F:\jenkins\jenkins-slave\workspace\myfaces-maven2-plugins\maven2-plugins\myfaces-plugin-parent\pom.xml to org.apache.myfaces.buildtools/myfaces-plugin-parent/1.0.7-SNAPSHOT/myfaces-plugin-parent-1.0.7-SNAPSHOT.pom
[JENKINS] Archiving F:\jenkins\jenkins-slave\workspace\myfaces-maven2-plugins\maven2-plugins\myfaces-plugin-parent\target\myfaces-plugin-parent-1.0.7-SNAPSHOT-site.xml to org.apache.myfaces.buildtools/myfaces-plugin-parent/1.0.7-SNAPSHOT/myfaces-plugin-parent-1.0.7-SNAPSHOT-site.xml
[JENKINS] Archiving <https://builds.apache.org/job/myfaces-maven2-plugins/ws/maven2-plugins\pom.xml> to org.apache.myfaces.buildtools/myfaces-plugin-module/1-SNAPSHOT/myfaces-plugin-module-1-SNAPSHOT.pom
[JENKINS] Archiving F:\jenkins\jenkins-slave\workspace\myfaces-maven2-plugins\maven2-plugins\myfaces-javascript-plugin\pom.xml to org.apache.myfaces.buildtools/myfaces-javascript-plugin/1.0.3-SNAPSHOT/myfaces-javascript-plugin-1.0.3-SNAPSHOT.pom
[JENKINS] Archiving F:\jenkins\jenkins-slave\workspace\myfaces-maven2-plugins\maven2-plugins\myfaces-javascript-plugin\target\myfaces-javascript-plugin-1.0.3-SNAPSHOT.jar to org.apache.myfaces.buildtools/myfaces-javascript-plugin/1.0.3-SNAPSHOT/myfaces-javascript-plugin-1.0.3-SNAPSHOT.jar
channel stopped
Maven RedeployPublisher use remote windows2 maven settings from : f:\jenkins\tools\maven\latest/conf/settings.xml
[ERROR] uniqueVersion == false is not anymore supported in maven 3
[INFO] Deployment in https://repository.apache.org/content/repositories/snapshots (id=apache.snapshots.https,uniqueVersion=false)
Deploying the main artifact jenkins-7909607374092134816myfaces-builder-annotations-1.0.10-SNAPSHOT.jar
Downloading: https://repository.apache.org/content/repositories/snapshots/org/apache/myfaces/buildtools/myfaces-builder-annotations/1.0.10-SNAPSHOT/maven-metadata.xml
Downloaded: https://repository.apache.org/content/repositories/snapshots/org/apache/myfaces/buildtools/myfaces-builder-annotations/1.0.10-SNAPSHOT/maven-metadata.xml (815 B at 2.3 KB/sec)
Uploading: https://repository.apache.org/content/repositories/snapshots/org/apache/myfaces/buildtools/myfaces-builder-annotations/1.0.10-SNAPSHOT/myfaces-builder-annotations-1.0.10-20140318.050134-651.jar
Uploading: https://repository.apache.org/content/repositories/snapshots/org/apache/myfaces/buildtools/myfaces-builder-annotations/1.0.10-SNAPSHOT/myfaces-builder-annotations-1.0.10-20140318.050134-651.pom
ERROR: Failed to deploy artifacts: Could not transfer artifact org.apache.myfaces.buildtools:myfaces-builder-annotations:jar:1.0.10-20140318.050134-651 from/to apache.snapshots.https (https://repository.apache.org/content/repositories/snapshots): Failed to transfer file: https://repository.apache.org/content/repositories/snapshots/org/apache/myfaces/buildtools/myfaces-builder-annotations/1.0.10-SNAPSHOT/myfaces-builder-annotations-1.0.10-20140318.050134-651.jar. Return code is: 401, ReasonPhrase: Unauthorized.
org.apache.maven.artifact.deployer.ArtifactDeploymentException: Failed to deploy artifacts: Could not transfer artifact org.apache.myfaces.buildtools:myfaces-builder-annotations:jar:1.0.10-20140318.050134-651 from/to apache.snapshots.https (https://repository.apache.org/content/repositories/snapshots): Failed to transfer file: https://repository.apache.org/content/repositories/snapshots/org/apache/myfaces/buildtools/myfaces-builder-annotations/1.0.10-SNAPSHOT/myfaces-builder-annotations-1.0.10-20140318.050134-651.jar. Return code is: 401, ReasonPhrase: Unauthorized.
at org.apache.maven.artifact.deployer.DefaultArtifactDeployer.deploy(DefaultArtifactDeployer.java:143)
at hudson.maven.reporters.MavenArtifactRecord.deploy(MavenArtifactRecord.java:191)
at hudson.maven.RedeployPublisher.perform(RedeployPublisher.java:176)
at hudson.tasks.BuildStepMonitor$1.perform(BuildStepMonitor.java:20)
at hudson.model.AbstractBuild$AbstractBuildExecution.perform(AbstractBuild.java:784)
at hudson.model.AbstractBuild$AbstractBuildExecution.performAllBuildSteps(AbstractBuild.java:756)
at hudson.maven.MavenModuleSetBuild$MavenModuleSetBuildExecution.post2(MavenModuleSetBuild.java:1030)
at hudson.model.AbstractBuild$AbstractBuildExecution.post(AbstractBuild.java:705)
at hudson.model.Run.execute(Run.java:1695)
at hudson.maven.MavenModuleSetBuild.run(MavenModuleSetBuild.java:519)
at hudson.model.ResourceController.execute(ResourceController.java:88)
at hudson.model.Executor.run(Executor.java:231)
Caused by: org.eclipse.aether.deployment.DeploymentException: Failed to deploy artifacts: Could not transfer artifact org.apache.myfaces.buildtools:myfaces-builder-annotations:jar:1.0.10-20140318.050134-651 from/to apache.snapshots.https (https://repository.apache.org/content/repositories/snapshots): Failed to transfer file: https://repository.apache.org/content/repositories/snapshots/org/apache/myfaces/buildtools/myfaces-builder-annotations/1.0.10-SNAPSHOT/myfaces-builder-annotations-1.0.10-20140318.050134-651.jar. Return code is: 401, ReasonPhrase: Unauthorized.
at org.eclipse.aether.internal.impl.DefaultDeployer.deploy(DefaultDeployer.java:341)
at org.eclipse.aether.internal.impl.DefaultDeployer.deploy(DefaultDeployer.java:269)
at org.eclipse.aether.internal.impl.DefaultRepositorySystem.deploy(DefaultRepositorySystem.java:413)
at org.apache.maven.artifact.deployer.DefaultArtifactDeployer.deploy(DefaultArtifactDeployer.java:139)
... 11 more
Caused by: org.eclipse.aether.transfer.ArtifactTransferException: Could not transfer artifact org.apache.myfaces.buildtools:myfaces-builder-annotations:jar:1.0.10-20140318.050134-651 from/to apache.snapshots.https (https://repository.apache.org/content/repositories/snapshots): Failed to transfer file: https://repository.apache.org/content/repositories/snapshots/org/apache/myfaces/buildtools/myfaces-builder-annotations/1.0.10-SNAPSHOT/myfaces-builder-annotations-1.0.10-20140318.050134-651.jar. Return code is: 401, ReasonPhrase: Unauthorized.
at org.eclipse.aether.connector.wagon.WagonRepositoryConnector$6.wrap(WagonRepositoryConnector.java:1016)
at org.eclipse.aether.connector.wagon.WagonRepositoryConnector$6.wrap(WagonRepositoryConnector.java:1004)
at org.eclipse.aether.connector.wagon.WagonRepositoryConnector$PutTask.run(WagonRepositoryConnector.java:895)
at org.eclipse.aether.connector.wagon.WagonRepositoryConnector.put(WagonRepositoryConnector.java:522)
at org.eclipse.aether.internal.impl.DefaultDeployer.deploy(DefaultDeployer.java:335)
... 14 more
Caused by: org.apache.maven.wagon.TransferFailedException: Failed to transfer file: https://repository.apache.org/content/repositories/snapshots/org/apache/myfaces/buildtools/myfaces-builder-annotations/1.0.10-SNAPSHOT/myfaces-builder-annotations-1.0.10-20140318.050134-651.jar. Return code is: 401, ReasonPhrase: Unauthorized.
at org.apache.maven.wagon.shared.http4.AbstractHttpClientWagon.put(AbstractHttpClientWagon.java:626)
at org.apache.maven.wagon.shared.http4.AbstractHttpClientWagon.put(AbstractHttpClientWagon.java:524)
at org.apache.maven.wagon.shared.http4.AbstractHttpClientWagon.put(AbstractHttpClientWagon.java:505)
at org.apache.maven.wagon.shared.http4.AbstractHttpClientWagon.put(AbstractHttpClientWagon.java:485)
at org.eclipse.aether.connector.wagon.WagonRepositoryConnector$PutTask.run(WagonRepositoryConnector.java:871)
... 16 more
[INFO] Deployment failed after 1.1 sec
Build step 'Deploy artifacts to Maven repository' changed build result to FAILURE