You are viewing a plain text version of this content. The canonical link for it is here.
Posted to dev@kafka.apache.org by Apache Jenkins Server <je...@builds.apache.org> on 2018/05/30 22:34:11 UTC
Build failed in Jenkins: kafka-trunk-jdk10 #152
See <https://builds.apache.org/job/kafka-trunk-jdk10/152/display/redirect?page=changes>
Changes:
[me] KAFKA-6886: Externalize secrets from Connect configs (KIP-297)
------------------------------------------
[...truncated 1.08 MB...]
org.apache.kafka.common.config.ConfigDefTest > testNames STARTED
org.apache.kafka.common.config.ConfigDefTest > testNames PASSED
org.apache.kafka.common.config.ConfigDefTest > testGroupInference STARTED
org.apache.kafka.common.config.ConfigDefTest > testGroupInference PASSED
org.apache.kafka.common.config.ConfigDefTest > testConvertValueToStringNestedClass STARTED
org.apache.kafka.common.config.ConfigDefTest > testConvertValueToStringNestedClass PASSED
org.apache.kafka.common.config.ConfigDefTest > testConvertValueToStringInt STARTED
org.apache.kafka.common.config.ConfigDefTest > testConvertValueToStringInt PASSED
org.apache.kafka.common.config.ConfigDefTest > testValidators STARTED
org.apache.kafka.common.config.ConfigDefTest > testValidators PASSED
org.apache.kafka.common.config.ConfigDefTest > testValidateCannotParse STARTED
org.apache.kafka.common.config.ConfigDefTest > testValidateCannotParse PASSED
org.apache.kafka.common.config.ConfigDefTest > testValidate STARTED
org.apache.kafka.common.config.ConfigDefTest > testValidate PASSED
org.apache.kafka.common.config.ConfigDefTest > testInternalConfigDoesntShowUpInDocs STARTED
org.apache.kafka.common.config.ConfigDefTest > testInternalConfigDoesntShowUpInDocs PASSED
org.apache.kafka.common.config.ConfigDefTest > testInvalidDefaultString STARTED
org.apache.kafka.common.config.ConfigDefTest > testInvalidDefaultString PASSED
org.apache.kafka.common.config.ConfigDefTest > testSslPasswords STARTED
org.apache.kafka.common.config.ConfigDefTest > testSslPasswords PASSED
org.apache.kafka.common.config.ConfigDefTest > testDynamicUpdateModeInDocs STARTED
org.apache.kafka.common.config.ConfigDefTest > testDynamicUpdateModeInDocs PASSED
org.apache.kafka.common.config.ConfigDefTest > testBaseConfigDefDependents STARTED
org.apache.kafka.common.config.ConfigDefTest > testBaseConfigDefDependents PASSED
org.apache.kafka.common.config.ConfigDefTest > testConvertValueToStringClass STARTED
org.apache.kafka.common.config.ConfigDefTest > testConvertValueToStringClass PASSED
org.apache.kafka.common.config.ConfigDefTest > testConvertValueToStringShort STARTED
org.apache.kafka.common.config.ConfigDefTest > testConvertValueToStringShort PASSED
org.apache.kafka.common.config.ConfigDefTest > testInvalidDefault STARTED
org.apache.kafka.common.config.ConfigDefTest > testInvalidDefault PASSED
org.apache.kafka.common.config.ConfigDefTest > toRst STARTED
org.apache.kafka.common.config.ConfigDefTest > toRst PASSED
org.apache.kafka.common.config.ConfigDefTest > testCanAddInternalConfig STARTED
org.apache.kafka.common.config.ConfigDefTest > testCanAddInternalConfig PASSED
org.apache.kafka.common.config.ConfigDefTest > testMissingRequired STARTED
org.apache.kafka.common.config.ConfigDefTest > testMissingRequired PASSED
org.apache.kafka.common.config.ConfigDefTest > testParsingEmptyDefaultValueForStringFieldShouldSucceed STARTED
org.apache.kafka.common.config.ConfigDefTest > testParsingEmptyDefaultValueForStringFieldShouldSucceed PASSED
org.apache.kafka.common.config.ConfigDefTest > testConvertValueToStringPassword STARTED
org.apache.kafka.common.config.ConfigDefTest > testConvertValueToStringPassword PASSED
org.apache.kafka.common.config.ConfigDefTest > testConvertValueToStringList STARTED
org.apache.kafka.common.config.ConfigDefTest > testConvertValueToStringList PASSED
org.apache.kafka.common.config.ConfigDefTest > testConvertValueToStringLong STARTED
org.apache.kafka.common.config.ConfigDefTest > testConvertValueToStringLong PASSED
org.apache.kafka.common.config.ConfigDefTest > testConvertValueToStringBoolean STARTED
org.apache.kafka.common.config.ConfigDefTest > testConvertValueToStringBoolean PASSED
org.apache.kafka.common.config.ConfigDefTest > testNullDefaultWithValidator STARTED
org.apache.kafka.common.config.ConfigDefTest > testNullDefaultWithValidator PASSED
org.apache.kafka.common.config.ConfigDefTest > testMissingDependentConfigs STARTED
org.apache.kafka.common.config.ConfigDefTest > testMissingDependentConfigs PASSED
org.apache.kafka.common.config.ConfigDefTest > testConvertValueToStringDouble STARTED
org.apache.kafka.common.config.ConfigDefTest > testConvertValueToStringDouble PASSED
org.apache.kafka.common.config.ConfigDefTest > toEnrichedRst STARTED
org.apache.kafka.common.config.ConfigDefTest > toEnrichedRst PASSED
org.apache.kafka.common.config.ConfigDefTest > testDefinedTwice STARTED
org.apache.kafka.common.config.ConfigDefTest > testDefinedTwice PASSED
org.apache.kafka.common.config.ConfigDefTest > testConvertValueToStringString STARTED
org.apache.kafka.common.config.ConfigDefTest > testConvertValueToStringString PASSED
org.apache.kafka.common.config.ConfigDefTest > testNestedClass STARTED
org.apache.kafka.common.config.ConfigDefTest > testNestedClass PASSED
org.apache.kafka.common.config.ConfigDefTest > testBadInputs STARTED
org.apache.kafka.common.config.ConfigDefTest > testBadInputs PASSED
org.apache.kafka.common.config.ConfigDefTest > testValidateMissingConfigKey STARTED
org.apache.kafka.common.config.ConfigDefTest > testValidateMissingConfigKey PASSED
org.apache.kafka.common.PartitionInfoTest > testToString STARTED
org.apache.kafka.common.PartitionInfoTest > testToString PASSED
org.apache.kafka.common.acl.AclBindingTest > testUnknowns STARTED
org.apache.kafka.common.acl.AclBindingTest > testUnknowns PASSED
org.apache.kafka.common.acl.AclBindingTest > testMatching STARTED
org.apache.kafka.common.acl.AclBindingTest > testMatching PASSED
org.apache.kafka.common.acl.AclBindingTest > testMatchesAtMostOne STARTED
org.apache.kafka.common.acl.AclBindingTest > testMatchesAtMostOne PASSED
org.apache.kafka.common.acl.AclOperationTest > testCode STARTED
org.apache.kafka.common.acl.AclOperationTest > testCode PASSED
org.apache.kafka.common.acl.AclOperationTest > testName STARTED
org.apache.kafka.common.acl.AclOperationTest > testName PASSED
org.apache.kafka.common.acl.AclOperationTest > testExhaustive STARTED
org.apache.kafka.common.acl.AclOperationTest > testExhaustive PASSED
org.apache.kafka.common.acl.AclOperationTest > testIsUnknown STARTED
org.apache.kafka.common.acl.AclOperationTest > testIsUnknown PASSED
org.apache.kafka.common.acl.AclPermissionTypeTest > testCode STARTED
org.apache.kafka.common.acl.AclPermissionTypeTest > testCode PASSED
org.apache.kafka.common.acl.AclPermissionTypeTest > testName STARTED
org.apache.kafka.common.acl.AclPermissionTypeTest > testName PASSED
org.apache.kafka.common.acl.AclPermissionTypeTest > testExhaustive STARTED
org.apache.kafka.common.acl.AclPermissionTypeTest > testExhaustive PASSED
org.apache.kafka.common.acl.AclPermissionTypeTest > testIsUnknown STARTED
org.apache.kafka.common.acl.AclPermissionTypeTest > testIsUnknown PASSED
org.apache.kafka.common.memory.GarbageCollectedMemoryPoolTest > testReleaseForeignBuffer STARTED
org.apache.kafka.common.memory.GarbageCollectedMemoryPoolTest > testReleaseForeignBuffer PASSED
org.apache.kafka.common.memory.GarbageCollectedMemoryPoolTest > testBuffersGarbageCollected STARTED
org.apache.kafka.common.memory.GarbageCollectedMemoryPoolTest > testBuffersGarbageCollected PASSED
org.apache.kafka.common.memory.GarbageCollectedMemoryPoolTest > testAllocationBound STARTED
org.apache.kafka.common.memory.GarbageCollectedMemoryPoolTest > testAllocationBound PASSED
org.apache.kafka.common.memory.GarbageCollectedMemoryPoolTest > testReleaseNull STARTED
org.apache.kafka.common.memory.GarbageCollectedMemoryPoolTest > testReleaseNull PASSED
org.apache.kafka.common.memory.GarbageCollectedMemoryPoolTest > testAllocationZero STARTED
org.apache.kafka.common.memory.GarbageCollectedMemoryPoolTest > testAllocationZero PASSED
org.apache.kafka.common.memory.GarbageCollectedMemoryPoolTest > testDoubleFree STARTED
org.apache.kafka.common.memory.GarbageCollectedMemoryPoolTest > testDoubleFree PASSED
org.apache.kafka.common.memory.GarbageCollectedMemoryPoolTest > testNegativeMaxAllocation STARTED
org.apache.kafka.common.memory.GarbageCollectedMemoryPoolTest > testNegativeMaxAllocation PASSED
org.apache.kafka.common.memory.GarbageCollectedMemoryPoolTest > testAllocationOverMaxAllocation STARTED
org.apache.kafka.common.memory.GarbageCollectedMemoryPoolTest > testAllocationOverMaxAllocation PASSED
org.apache.kafka.common.memory.GarbageCollectedMemoryPoolTest > testMaxAllocationLargerThanSize STARTED
org.apache.kafka.common.memory.GarbageCollectedMemoryPoolTest > testMaxAllocationLargerThanSize PASSED
org.apache.kafka.common.memory.GarbageCollectedMemoryPoolTest > testZeroMaxAllocation STARTED
org.apache.kafka.common.memory.GarbageCollectedMemoryPoolTest > testZeroMaxAllocation PASSED
org.apache.kafka.common.memory.GarbageCollectedMemoryPoolTest > testZeroSize STARTED
org.apache.kafka.common.memory.GarbageCollectedMemoryPoolTest > testZeroSize PASSED
org.apache.kafka.common.memory.GarbageCollectedMemoryPoolTest > testNegativeSize STARTED
org.apache.kafka.common.memory.GarbageCollectedMemoryPoolTest > testNegativeSize PASSED
org.apache.kafka.common.memory.GarbageCollectedMemoryPoolTest > testAllocationNegative STARTED
org.apache.kafka.common.memory.GarbageCollectedMemoryPoolTest > testAllocationNegative PASSED
4271 tests completed, 1 failed, 1 skipped
> Task :clients:test FAILED
FAILURE: Build failed with an exception.
* What went wrong:
Execution failed for task ':clients:test'.
> There were failing tests. See the report at: file://<https://builds.apache.org/job/kafka-trunk-jdk10/ws/clients/build/reports/tests/test/index.html>
* Try:
Run with --stacktrace option to get the stack trace. Run with --info or --debug option to get more log output. Run with --scan to get full insights.
* Get more help at https://help.gradle.org
BUILD FAILED in 17m 59s
31 actionable tasks: 10 executed, 21 up-to-date
Build step 'Execute shell' marked build as failure
Recording test results
Setting GRADLE_4_4_HOME=/home/jenkins/tools/gradle/4.4
Setting GRADLE_4_4_HOME=/home/jenkins/tools/gradle/4.4
Jenkins build is back to normal : kafka-trunk-jdk10 #153
Posted by Apache Jenkins Server <je...@builds.apache.org>.
See <https://builds.apache.org/job/kafka-trunk-jdk10/153/display/redirect?page=changes>