You are viewing a plain text version of this content. The canonical link for it is here.
Posted to builds@lucene.apache.org by Policeman Jenkins Server <je...@thetaphi.de> on 2019/11/05 00:08:09 UTC
[JENKINS] Lucene-Solr-SOLR-13661-Windows (64bit/jdk-11.0.4) - Build
# 43 - Failure!
Build: https://jenkins.thetaphi.de/job/Lucene-Solr-SOLR-13661-Windows/43/
Java: 64bit/jdk-11.0.4 -XX:+UseCompressedOops -XX:+UseParallelGC
2 tests failed.
FAILED: org.apache.solr.ltr.store.rest.TestModelManagerPersistence.testFilePersistence
Error Message:
Software caused connection abort: recv failed
Stack Trace:
javax.net.ssl.SSLException: Software caused connection abort: recv failed
at __randomizedtesting.SeedInfo.seed([101DCF3E47D50AE0:32BCAB43E2B96CA5]:0)
at java.base/sun.security.ssl.Alert.createSSLException(Alert.java:127)
at java.base/sun.security.ssl.TransportContext.fatal(TransportContext.java:320)
at java.base/sun.security.ssl.TransportContext.fatal(TransportContext.java:263)
at java.base/sun.security.ssl.TransportContext.fatal(TransportContext.java:258)
at java.base/sun.security.ssl.SSLSocketImpl.handleException(SSLSocketImpl.java:1315)
at java.base/sun.security.ssl.SSLSocketImpl$AppInputStream.read(SSLSocketImpl.java:839)
at org.apache.http.impl.io.SessionInputBufferImpl.streamRead(SessionInputBufferImpl.java:137)
at org.apache.http.impl.io.SessionInputBufferImpl.fillBuffer(SessionInputBufferImpl.java:153)
at org.apache.http.impl.io.SessionInputBufferImpl.readLine(SessionInputBufferImpl.java:282)
at org.apache.http.impl.conn.DefaultHttpResponseParser.parseHead(DefaultHttpResponseParser.java:138)
at org.apache.http.impl.conn.DefaultHttpResponseParser.parseHead(DefaultHttpResponseParser.java:56)
at org.apache.http.impl.io.AbstractMessageParser.parse(AbstractMessageParser.java:259)
at org.apache.http.impl.DefaultBHttpClientConnection.receiveResponseHeader(DefaultBHttpClientConnection.java:163)
at org.apache.http.impl.conn.CPoolProxy.receiveResponseHeader(CPoolProxy.java:165)
at org.apache.http.protocol.HttpRequestExecutor.doReceiveResponse(HttpRequestExecutor.java:273)
at org.apache.http.protocol.HttpRequestExecutor.execute(HttpRequestExecutor.java:125)
at org.apache.http.impl.execchain.MainClientExec.execute(MainClientExec.java:272)
at org.apache.http.impl.execchain.ProtocolExec.execute(ProtocolExec.java:185)
at org.apache.http.impl.execchain.RetryExec.execute(RetryExec.java:89)
at org.apache.http.impl.execchain.RedirectExec.execute(RedirectExec.java:110)
at org.apache.http.impl.client.InternalHttpClient.doExecute(InternalHttpClient.java:185)
at org.apache.http.impl.client.CloseableHttpClient.execute(CloseableHttpClient.java:83)
at org.apache.solr.util.RestTestHarness.getResponse(RestTestHarness.java:215)
at org.apache.solr.util.RestTestHarness.query(RestTestHarness.java:107)
at org.apache.solr.util.RestTestBase.assertJQ(RestTestBase.java:226)
at org.apache.solr.util.RestTestBase.assertJQ(RestTestBase.java:192)
at org.apache.solr.ltr.store.rest.TestModelManagerPersistence.testFilePersistence(TestModelManagerPersistence.java:173)
at java.base/jdk.internal.reflect.NativeMethodAccessorImpl.invoke0(Native Method)
at java.base/jdk.internal.reflect.NativeMethodAccessorImpl.invoke(NativeMethodAccessorImpl.java:62)
at java.base/jdk.internal.reflect.DelegatingMethodAccessorImpl.invoke(DelegatingMethodAccessorImpl.java:43)
at java.base/java.lang.reflect.Method.invoke(Method.java:566)
at com.carrotsearch.randomizedtesting.RandomizedRunner.invoke(RandomizedRunner.java:1750)
at com.carrotsearch.randomizedtesting.RandomizedRunner$8.evaluate(RandomizedRunner.java:938)
at com.carrotsearch.randomizedtesting.RandomizedRunner$9.evaluate(RandomizedRunner.java:974)
at com.carrotsearch.randomizedtesting.RandomizedRunner$10.evaluate(RandomizedRunner.java:988)
at com.carrotsearch.randomizedtesting.rules.SystemPropertiesRestoreRule$1.evaluate(SystemPropertiesRestoreRule.java:57)
at org.apache.lucene.util.TestRuleSetupTeardownChained$1.evaluate(TestRuleSetupTeardownChained.java:49)
at org.apache.lucene.util.AbstractBeforeAfterRule$1.evaluate(AbstractBeforeAfterRule.java:45)
at org.apache.lucene.util.TestRuleThreadAndTestName$1.evaluate(TestRuleThreadAndTestName.java:48)
at org.apache.lucene.util.TestRuleIgnoreAfterMaxFailures$1.evaluate(TestRuleIgnoreAfterMaxFailures.java:64)
at org.apache.lucene.util.TestRuleMarkFailure$1.evaluate(TestRuleMarkFailure.java:47)
at com.carrotsearch.randomizedtesting.rules.StatementAdapter.evaluate(StatementAdapter.java:36)
at com.carrotsearch.randomizedtesting.ThreadLeakControl$StatementRunner.run(ThreadLeakControl.java:368)
at com.carrotsearch.randomizedtesting.ThreadLeakControl.forkTimeoutingTask(ThreadLeakControl.java:817)
at com.carrotsearch.randomizedtesting.ThreadLeakControl$3.evaluate(ThreadLeakControl.java:468)
at com.carrotsearch.randomizedtesting.RandomizedRunner.runSingleTest(RandomizedRunner.java:947)
at com.carrotsearch.randomizedtesting.RandomizedRunner$5.evaluate(RandomizedRunner.java:832)
at com.carrotsearch.randomizedtesting.RandomizedRunner$6.evaluate(RandomizedRunner.java:883)
at com.carrotsearch.randomizedtesting.RandomizedRunner$7.evaluate(RandomizedRunner.java:894)
at com.carrotsearch.randomizedtesting.rules.StatementAdapter.evaluate(StatementAdapter.java:36)
at com.carrotsearch.randomizedtesting.rules.SystemPropertiesRestoreRule$1.evaluate(SystemPropertiesRestoreRule.java:57)
at org.apache.lucene.util.AbstractBeforeAfterRule$1.evaluate(AbstractBeforeAfterRule.java:45)
at com.carrotsearch.randomizedtesting.rules.StatementAdapter.evaluate(StatementAdapter.java:36)
at org.apache.lucene.util.TestRuleStoreClassName$1.evaluate(TestRuleStoreClassName.java:41)
at com.carrotsearch.randomizedtesting.rules.NoShadowingOrOverridesOnMethodsRule$1.evaluate(NoShadowingOrOverridesOnMethodsRule.java:40)
at com.carrotsearch.randomizedtesting.rules.NoShadowingOrOverridesOnMethodsRule$1.evaluate(NoShadowingOrOverridesOnMethodsRule.java:40)
at com.carrotsearch.randomizedtesting.rules.StatementAdapter.evaluate(StatementAdapter.java:36)
at com.carrotsearch.randomizedtesting.rules.StatementAdapter.evaluate(StatementAdapter.java:36)
at org.apache.lucene.util.TestRuleAssertionsRequired$1.evaluate(TestRuleAssertionsRequired.java:53)
at org.apache.lucene.util.TestRuleMarkFailure$1.evaluate(TestRuleMarkFailure.java:47)
at org.apache.lucene.util.TestRuleIgnoreAfterMaxFailures$1.evaluate(TestRuleIgnoreAfterMaxFailures.java:64)
at org.apache.lucene.util.TestRuleIgnoreTestSuites$1.evaluate(TestRuleIgnoreTestSuites.java:54)
at com.carrotsearch.randomizedtesting.rules.StatementAdapter.evaluate(StatementAdapter.java:36)
at com.carrotsearch.randomizedtesting.ThreadLeakControl$StatementRunner.run(ThreadLeakControl.java:368)
at java.base/java.lang.Thread.run(Thread.java:834)
Suppressed: java.net.SocketException: Software caused connection abort: socket write error
at java.base/java.net.SocketOutputStream.socketWrite0(Native Method)
at java.base/java.net.SocketOutputStream.socketWrite(SocketOutputStream.java:110)
at java.base/java.net.SocketOutputStream.write(SocketOutputStream.java:150)
at java.base/sun.security.ssl.SSLSocketOutputRecord.encodeAlert(SSLSocketOutputRecord.java:81)
at java.base/sun.security.ssl.TransportContext.fatal(TransportContext.java:351)
... 63 more
Caused by: java.net.SocketException: Software caused connection abort: recv failed
at java.base/java.net.SocketInputStream.socketRead0(Native Method)
at java.base/java.net.SocketInputStream.socketRead(SocketInputStream.java:115)
at java.base/java.net.SocketInputStream.read(SocketInputStream.java:168)
at java.base/java.net.SocketInputStream.read(SocketInputStream.java:140)
at java.base/sun.security.ssl.SSLSocketInputRecord.read(SSLSocketInputRecord.java:448)
at java.base/sun.security.ssl.SSLSocketInputRecord.bytesInCompletePacket(SSLSocketInputRecord.java:68)
at java.base/sun.security.ssl.SSLSocketImpl.readApplicationRecord(SSLSocketImpl.java:1104)
at java.base/sun.security.ssl.SSLSocketImpl$AppInputStream.read(SSLSocketImpl.java:823)
... 59 more
FAILED: org.apache.solr.ltr.store.rest.TestModelManagerPersistence.testWrapperModelPersistence
Error Message:
Software caused connection abort: recv failed
Stack Trace:
javax.net.ssl.SSLException: Software caused connection abort: recv failed
at __randomizedtesting.SeedInfo.seed([101DCF3E47D50AE0:6577BCE0F82973A5]:0)
at java.base/sun.security.ssl.Alert.createSSLException(Alert.java:127)
at java.base/sun.security.ssl.TransportContext.fatal(TransportContext.java:320)
at java.base/sun.security.ssl.TransportContext.fatal(TransportContext.java:263)
at java.base/sun.security.ssl.TransportContext.fatal(TransportContext.java:258)
at java.base/sun.security.ssl.SSLSocketImpl.handleException(SSLSocketImpl.java:1315)
at java.base/sun.security.ssl.SSLSocketImpl$AppInputStream.read(SSLSocketImpl.java:839)
at org.apache.http.impl.io.SessionInputBufferImpl.streamRead(SessionInputBufferImpl.java:137)
at org.apache.http.impl.io.SessionInputBufferImpl.fillBuffer(SessionInputBufferImpl.java:153)
at org.apache.http.impl.io.SessionInputBufferImpl.readLine(SessionInputBufferImpl.java:282)
at org.apache.http.impl.conn.DefaultHttpResponseParser.parseHead(DefaultHttpResponseParser.java:138)
at org.apache.http.impl.conn.DefaultHttpResponseParser.parseHead(DefaultHttpResponseParser.java:56)
at org.apache.http.impl.io.AbstractMessageParser.parse(AbstractMessageParser.java:259)
at org.apache.http.impl.DefaultBHttpClientConnection.receiveResponseHeader(DefaultBHttpClientConnection.java:163)
at org.apache.http.impl.conn.CPoolProxy.receiveResponseHeader(CPoolProxy.java:165)
at org.apache.http.protocol.HttpRequestExecutor.doReceiveResponse(HttpRequestExecutor.java:273)
at org.apache.http.protocol.HttpRequestExecutor.execute(HttpRequestExecutor.java:125)
at org.apache.http.impl.execchain.MainClientExec.execute(MainClientExec.java:272)
at org.apache.http.impl.execchain.ProtocolExec.execute(ProtocolExec.java:185)
at org.apache.http.impl.execchain.RetryExec.execute(RetryExec.java:89)
at org.apache.http.impl.execchain.RedirectExec.execute(RedirectExec.java:110)
at org.apache.http.impl.client.InternalHttpClient.doExecute(InternalHttpClient.java:185)
at org.apache.http.impl.client.CloseableHttpClient.execute(CloseableHttpClient.java:83)
at org.apache.solr.util.RestTestHarness.getResponse(RestTestHarness.java:215)
at org.apache.solr.util.RestTestHarness.query(RestTestHarness.java:107)
at org.apache.solr.util.RestTestBase.assertJQ(RestTestBase.java:226)
at org.apache.solr.util.RestTestBase.assertJQ(RestTestBase.java:192)
at org.apache.solr.ltr.store.rest.TestModelManagerPersistence.doWrapperModelPersistenceChecks(TestModelManagerPersistence.java:207)
at org.apache.solr.ltr.store.rest.TestModelManagerPersistence.testWrapperModelPersistence(TestModelManagerPersistence.java:260)
at java.base/jdk.internal.reflect.NativeMethodAccessorImpl.invoke0(Native Method)
at java.base/jdk.internal.reflect.NativeMethodAccessorImpl.invoke(NativeMethodAccessorImpl.java:62)
at java.base/jdk.internal.reflect.DelegatingMethodAccessorImpl.invoke(DelegatingMethodAccessorImpl.java:43)
at java.base/java.lang.reflect.Method.invoke(Method.java:566)
at com.carrotsearch.randomizedtesting.RandomizedRunner.invoke(RandomizedRunner.java:1750)
at com.carrotsearch.randomizedtesting.RandomizedRunner$8.evaluate(RandomizedRunner.java:938)
at com.carrotsearch.randomizedtesting.RandomizedRunner$9.evaluate(RandomizedRunner.java:974)
at com.carrotsearch.randomizedtesting.RandomizedRunner$10.evaluate(RandomizedRunner.java:988)
at com.carrotsearch.randomizedtesting.rules.SystemPropertiesRestoreRule$1.evaluate(SystemPropertiesRestoreRule.java:57)
at org.apache.lucene.util.TestRuleSetupTeardownChained$1.evaluate(TestRuleSetupTeardownChained.java:49)
at org.apache.lucene.util.AbstractBeforeAfterRule$1.evaluate(AbstractBeforeAfterRule.java:45)
at org.apache.lucene.util.TestRuleThreadAndTestName$1.evaluate(TestRuleThreadAndTestName.java:48)
at org.apache.lucene.util.TestRuleIgnoreAfterMaxFailures$1.evaluate(TestRuleIgnoreAfterMaxFailures.java:64)
at org.apache.lucene.util.TestRuleMarkFailure$1.evaluate(TestRuleMarkFailure.java:47)
at com.carrotsearch.randomizedtesting.rules.StatementAdapter.evaluate(StatementAdapter.java:36)
at com.carrotsearch.randomizedtesting.ThreadLeakControl$StatementRunner.run(ThreadLeakControl.java:368)
at com.carrotsearch.randomizedtesting.ThreadLeakControl.forkTimeoutingTask(ThreadLeakControl.java:817)
at com.carrotsearch.randomizedtesting.ThreadLeakControl$3.evaluate(ThreadLeakControl.java:468)
at com.carrotsearch.randomizedtesting.RandomizedRunner.runSingleTest(RandomizedRunner.java:947)
at com.carrotsearch.randomizedtesting.RandomizedRunner$5.evaluate(RandomizedRunner.java:832)
at com.carrotsearch.randomizedtesting.RandomizedRunner$6.evaluate(RandomizedRunner.java:883)
at com.carrotsearch.randomizedtesting.RandomizedRunner$7.evaluate(RandomizedRunner.java:894)
at com.carrotsearch.randomizedtesting.rules.StatementAdapter.evaluate(StatementAdapter.java:36)
at com.carrotsearch.randomizedtesting.rules.SystemPropertiesRestoreRule$1.evaluate(SystemPropertiesRestoreRule.java:57)
at org.apache.lucene.util.AbstractBeforeAfterRule$1.evaluate(AbstractBeforeAfterRule.java:45)
at com.carrotsearch.randomizedtesting.rules.StatementAdapter.evaluate(StatementAdapter.java:36)
at org.apache.lucene.util.TestRuleStoreClassName$1.evaluate(TestRuleStoreClassName.java:41)
at com.carrotsearch.randomizedtesting.rules.NoShadowingOrOverridesOnMethodsRule$1.evaluate(NoShadowingOrOverridesOnMethodsRule.java:40)
at com.carrotsearch.randomizedtesting.rules.NoShadowingOrOverridesOnMethodsRule$1.evaluate(NoShadowingOrOverridesOnMethodsRule.java:40)
at com.carrotsearch.randomizedtesting.rules.StatementAdapter.evaluate(StatementAdapter.java:36)
at com.carrotsearch.randomizedtesting.rules.StatementAdapter.evaluate(StatementAdapter.java:36)
at org.apache.lucene.util.TestRuleAssertionsRequired$1.evaluate(TestRuleAssertionsRequired.java:53)
at org.apache.lucene.util.TestRuleMarkFailure$1.evaluate(TestRuleMarkFailure.java:47)
at org.apache.lucene.util.TestRuleIgnoreAfterMaxFailures$1.evaluate(TestRuleIgnoreAfterMaxFailures.java:64)
at org.apache.lucene.util.TestRuleIgnoreTestSuites$1.evaluate(TestRuleIgnoreTestSuites.java:54)
at com.carrotsearch.randomizedtesting.rules.StatementAdapter.evaluate(StatementAdapter.java:36)
at com.carrotsearch.randomizedtesting.ThreadLeakControl$StatementRunner.run(ThreadLeakControl.java:368)
at java.base/java.lang.Thread.run(Thread.java:834)
Suppressed: java.net.SocketException: Software caused connection abort: socket write error
at java.base/java.net.SocketOutputStream.socketWrite0(Native Method)
at java.base/java.net.SocketOutputStream.socketWrite(SocketOutputStream.java:110)
at java.base/java.net.SocketOutputStream.write(SocketOutputStream.java:150)
at java.base/sun.security.ssl.SSLSocketOutputRecord.encodeAlert(SSLSocketOutputRecord.java:81)
at java.base/sun.security.ssl.TransportContext.fatal(TransportContext.java:351)
... 64 more
Caused by: java.net.SocketException: Software caused connection abort: recv failed
at java.base/java.net.SocketInputStream.socketRead0(Native Method)
at java.base/java.net.SocketInputStream.socketRead(SocketInputStream.java:115)
at java.base/java.net.SocketInputStream.read(SocketInputStream.java:168)
at java.base/java.net.SocketInputStream.read(SocketInputStream.java:140)
at java.base/sun.security.ssl.SSLSocketInputRecord.read(SSLSocketInputRecord.java:448)
at java.base/sun.security.ssl.SSLSocketInputRecord.bytesInCompletePacket(SSLSocketInputRecord.java:68)
at java.base/sun.security.ssl.SSLSocketImpl.readApplicationRecord(SSLSocketImpl.java:1104)
at java.base/sun.security.ssl.SSLSocketImpl$AppInputStream.read(SSLSocketImpl.java:823)
... 60 more
Build Log:
[...truncated 24263 lines...]
[junit4] Suite: org.apache.solr.ltr.store.rest.TestModelManagerPersistence
[junit4] 1> 23:54:56.980 [TEST-TestModelManagerPersistence.testFilePersistence-seed#[101DCF3E47D50AE0]] ERROR org.apache.solr.util.StartupLoggingUtils - Missing Java Option solr.log.dir. Logging may be missing or incomplete.
[junit4] 2> Nov 04, 2019 4:54:57 PM org.restlet.Application start
[junit4] 2> INFO: Starting org.apache.solr.rest.SolrSchemaRestApi application
[junit4] 2> Nov 04, 2019 4:54:57 PM org.restlet.engine.log.LogFilter afterHandle
[junit4] 2> INFO: 2019-11-04 16:54:57 127.0.0.1 - 127.0.0.1 62385 GET /solr/schema/model-store wt=json&indent=on 200 - 0 3 https://127.0.0.1:62385 Apache-HttpClient/4.5.6 (Java/11.0.4) -
[junit4] 2> Nov 04, 2019 4:54:57 PM org.restlet.engine.log.LogFilter afterHandle
[junit4] 2> INFO: 2019-11-04 16:54:57 127.0.0.1 - 127.0.0.1 62385 GET /solr/schema/feature-store/_DEFAULT_ wt=json&indent=on 200 - 0 0 https://127.0.0.1:62385 Apache-HttpClient/4.5.6 (Java/11.0.4) -
[junit4] 2> Nov 04, 2019 4:54:57 PM org.restlet.engine.log.LogFilter afterHandle
[junit4] 2> INFO: 2019-11-04 16:54:57 127.0.0.1 - 127.0.0.1 62385 PUT /solr/schema/feature-store wt=json&indent=on 200 - 933 12 https://127.0.0.1:62385 Apache-HttpClient/4.5.6 (Java/11.0.4) -
[junit4] 2> Nov 04, 2019 4:54:57 PM org.restlet.engine.log.LogFilter afterHandle
[junit4] 2> INFO: 2019-11-04 16:54:57 127.0.0.1 - 127.0.0.1 62385 PUT /solr/schema/model-store wt=json&indent=on 200 - 835 9 https://127.0.0.1:62385 Apache-HttpClient/4.5.6 (Java/11.0.4) -
[junit4] 2> Nov 04, 2019 4:54:57 PM org.restlet.engine.log.LogFilter afterHandle
[junit4] 2> INFO: 2019-11-04 16:54:57 127.0.0.1 - 127.0.0.1 62385 GET /solr/schema/model-store wt=json&indent=on 200 - 0 0 https://127.0.0.1:62385 Apache-HttpClient/4.5.6 (Java/11.0.4) -
[junit4] 2> Nov 04, 2019 4:54:57 PM org.restlet.engine.log.LogFilter afterHandle
[junit4] 2> INFO: 2019-11-04 16:54:57 127.0.0.1 - 127.0.0.1 62385 GET /solr/schema/feature-store/_DEFAULT_ wt=json&indent=on 200 - 0 1 https://127.0.0.1:62385 Apache-HttpClient/4.5.6 (Java/11.0.4) -
[junit4] 2> Nov 04, 2019 4:54:57 PM org.restlet.engine.log.LogFilter afterHandle
[junit4] 2> INFO: 2019-11-04 16:54:57 127.0.0.1 - 127.0.0.1 62385 GET /solr/schema/feature-store/_DEFAULT_ wt=json&indent=on 200 - 0 0 https://127.0.0.1:62385 Apache-HttpClient/4.5.6 (Java/11.0.4) -
[junit4] 2> Nov 04, 2019 4:54:58 PM org.restlet.engine.log.LogFilter afterHandle
[junit4] 2> INFO: 2019-11-04 16:54:58 127.0.0.1 - 127.0.0.1 62385 GET /solr/schema/model-store wt=json&indent=on 200 - 0 1 https://127.0.0.1:62385 Apache-HttpClient/4.5.6 (Java/11.0.4) -
[junit4] 2> Nov 04, 2019 4:54:58 PM org.restlet.engine.log.LogFilter afterHandle
[junit4] 2> INFO: 2019-11-04 16:54:58 127.0.0.1 - 127.0.0.1 62385 GET /solr/schema/feature-store/_DEFAULT_ wt=json&indent=on 200 - 0 0 https://127.0.0.1:62385 Apache-HttpClient/4.5.6 (Java/11.0.4) -
[junit4] 2> Nov 04, 2019 4:54:58 PM org.restlet.engine.log.LogFilter afterHandle
[junit4] 2> INFO: 2019-11-04 16:54:58 127.0.0.1 - 127.0.0.1 62385 GET /solr/schema/feature-store/_DEFAULT_ wt=json&indent=on 200 - 0 1 https://127.0.0.1:62385 Apache-HttpClient/4.5.6 (Java/11.0.4) -
[junit4] 1> 23:54:58.166 [TEST-TestModelManagerPersistence.testFilePersistence-seed#[101DCF3E47D50AE0]] ERROR org.apache.solr.util.StartupLoggingUtils - Missing Java Option solr.log.dir. Logging may be missing or incomplete.
[junit4] 1> 23:54:58.490 [TEST-TestModelManagerPersistence.testFilePersistence-seed#[101DCF3E47D50AE0]] ERROR org.apache.solr.util.RestTestBase - REQUEST FAILED: /schema/model-store?wt=json&indent=on
[junit4] 2> NOTE: reproduce with: ant test -Dtestcase=TestModelManagerPersistence -Dtests.method=testFilePersistence -Dtests.seed=101DCF3E47D50AE0 -Dtests.slow=true -Dtests.locale=en-150 -Dtests.timezone=Navajo -Dtests.asserts=true -Dtests.file.encoding=US-ASCII
[junit4] ERROR 1.58s J1 | TestModelManagerPersistence.testFilePersistence <<<
[junit4] > Throwable #1: javax.net.ssl.SSLException: Software caused connection abort: recv failed
[junit4] > at __randomizedtesting.SeedInfo.seed([101DCF3E47D50AE0:32BCAB43E2B96CA5]:0)
[junit4] > at java.base/sun.security.ssl.Alert.createSSLException(Alert.java:127)
[junit4] > at java.base/sun.security.ssl.TransportContext.fatal(TransportContext.java:320)
[junit4] > at java.base/sun.security.ssl.TransportContext.fatal(TransportContext.java:263)
[junit4] > at java.base/sun.security.ssl.TransportContext.fatal(TransportContext.java:258)
[junit4] > at java.base/sun.security.ssl.SSLSocketImpl.handleException(SSLSocketImpl.java:1315)
[junit4] > at java.base/sun.security.ssl.SSLSocketImpl$AppInputStream.read(SSLSocketImpl.java:839)
[junit4] > at org.apache.http.impl.io.SessionInputBufferImpl.streamRead(SessionInputBufferImpl.java:137)
[junit4] > at org.apache.http.impl.io.SessionInputBufferImpl.fillBuffer(SessionInputBufferImpl.java:153)
[junit4] > at org.apache.http.impl.io.SessionInputBufferImpl.readLine(SessionInputBufferImpl.java:282)
[junit4] > at org.apache.http.impl.conn.DefaultHttpResponseParser.parseHead(DefaultHttpResponseParser.java:138)
[junit4] > at org.apache.http.impl.conn.DefaultHttpResponseParser.parseHead(DefaultHttpResponseParser.java:56)
[junit4] > at org.apache.http.impl.io.AbstractMessageParser.parse(AbstractMessageParser.java:259)
[junit4] > at org.apache.http.impl.DefaultBHttpClientConnection.receiveResponseHeader(DefaultBHttpClientConnection.java:163)
[junit4] > at org.apache.http.impl.conn.CPoolProxy.receiveResponseHeader(CPoolProxy.java:165)
[junit4] > at org.apache.http.protocol.HttpRequestExecutor.doReceiveResponse(HttpRequestExecutor.java:273)
[junit4] > at org.apache.http.protocol.HttpRequestExecutor.execute(HttpRequestExecutor.java:125)
[junit4] > at org.apache.http.impl.execchain.MainClientExec.execute(MainClientExec.java:272)
[junit4] > at org.apache.http.impl.execchain.ProtocolExec.execute(ProtocolExec.java:185)
[junit4] > at org.apache.http.impl.execchain.RetryExec.execute(RetryExec.java:89)
[junit4] > at org.apache.http.impl.execchain.RedirectExec.execute(RedirectExec.java:110)
[junit4] > at org.apache.http.impl.client.InternalHttpClient.doExecute(InternalHttpClient.java:185)
[junit4] > at org.apache.http.impl.client.CloseableHttpClient.execute(CloseableHttpClient.java:83)
[junit4] > at org.apache.solr.util.RestTestHarness.getResponse(RestTestHarness.java:215)
[junit4] > at org.apache.solr.util.RestTestHarness.query(RestTestHarness.java:107)
[junit4] > at org.apache.solr.util.RestTestBase.assertJQ(RestTestBase.java:226)
[junit4] > at org.apache.solr.util.RestTestBase.assertJQ(RestTestBase.java:192)
[junit4] > at org.apache.solr.ltr.store.rest.TestModelManagerPersistence.testFilePersistence(TestModelManagerPersistence.java:173)
[junit4] > at java.base/jdk.internal.reflect.NativeMethodAccessorImpl.invoke0(Native Method)
[junit4] > at java.base/jdk.internal.reflect.NativeMethodAccessorImpl.invoke(NativeMethodAccessorImpl.java:62)
[junit4] > at java.base/jdk.internal.reflect.DelegatingMethodAccessorImpl.invoke(DelegatingMethodAccessorImpl.java:43)
[junit4] > at java.base/java.lang.reflect.Method.invoke(Method.java:566)
[junit4] > at java.base/java.lang.Thread.run(Thread.java:834)
[junit4] > Suppressed: java.net.SocketException: Software caused connection abort: socket write error
[junit4] > at java.base/java.net.SocketOutputStream.socketWrite0(Native Method)
[junit4] > at java.base/java.net.SocketOutputStream.socketWrite(SocketOutputStream.java:110)
[junit4] > at java.base/java.net.SocketOutputStream.write(SocketOutputStream.java:150)
[junit4] > at java.base/sun.security.ssl.SSLSocketOutputRecord.encodeAlert(SSLSocketOutputRecord.java:81)
[junit4] > at java.base/sun.security.ssl.TransportContext.fatal(TransportContext.java:351)
[junit4] > ... 63 more
[junit4] > Caused by: java.net.SocketException: Software caused connection abort: recv failed
[junit4] > at java.base/java.net.SocketInputStream.socketRead0(Native Method)
[junit4] > at java.base/java.net.SocketInputStream.socketRead(SocketInputStream.java:115)
[junit4] > at java.base/java.net.SocketInputStream.read(SocketInputStream.java:168)
[junit4] > at java.base/java.net.SocketInputStream.read(SocketInputStream.java:140)
[junit4] > at java.base/sun.security.ssl.SSLSocketInputRecord.read(SSLSocketInputRecord.java:448)
[junit4] > at java.base/sun.security.ssl.SSLSocketInputRecord.bytesInCompletePacket(SSLSocketInputRecord.java:68)
[junit4] > at java.base/sun.security.ssl.SSLSocketImpl.readApplicationRecord(SSLSocketImpl.java:1104)
[junit4] > at java.base/sun.security.ssl.SSLSocketImpl$AppInputStream.read(SSLSocketImpl.java:823)
[junit4] > ... 59 more
[junit4] 1> 23:54:58.545 [TEST-TestModelManagerPersistence.testFeaturePersistence-seed#[101DCF3E47D50AE0]] ERROR org.apache.solr.util.StartupLoggingUtils - Missing Java Option solr.log.dir. Logging may be missing or incomplete.
[junit4] 2> Nov 04, 2019 4:54:59 PM org.restlet.Application start
[junit4] 2> INFO: Starting org.apache.solr.rest.SolrSchemaRestApi application
[junit4] 2> Nov 04, 2019 4:54:59 PM org.restlet.engine.log.LogFilter afterHandle
[junit4] 2> INFO: 2019-11-04 16:54:59 127.0.0.1 - 127.0.0.1 62406 PUT /solr/schema/feature-store wt=json&indent=on 200 - 111 7 https://127.0.0.1:62406 Apache-HttpClient/4.5.6 (Java/11.0.4) -
[junit4] 2> Nov 04, 2019 4:54:59 PM org.restlet.engine.log.LogFilter afterHandle
[junit4] 2> INFO: 2019-11-04 16:54:59 127.0.0.1 - 127.0.0.1 62406 GET /solr/schema/feature-store/test wt=json&indent=on 200 - 0 1 https://127.0.0.1:62406 Apache-HttpClient/4.5.6 (Java/11.0.4) -
[junit4] 2> Nov 04, 2019 4:54:59 PM org.restlet.engine.log.LogFilter afterHandle
[junit4] 2> INFO: 2019-11-04 16:54:59 127.0.0.1 - 127.0.0.1 62406 GET /solr/schema/feature-store/test wt=json&indent=on 200 - 0 1 https://127.0.0.1:62406 Apache-HttpClient/4.5.6 (Java/11.0.4) -
[junit4] 2> Nov 04, 2019 4:54:59 PM org.restlet.engine.log.LogFilter afterHandle
[junit4] 2> INFO: 2019-11-04 16:54:59 127.0.0.1 - 127.0.0.1 62406 PUT /solr/schema/feature-store wt=json&indent=on 200 - 113 3 https://127.0.0.1:62406 Apache-HttpClient/4.5.6 (Java/11.0.4) -
[junit4] 2> Nov 04, 2019 4:54:59 PM org.restlet.engine.log.LogFilter afterHandle
[junit4] 2> INFO: 2019-11-04 16:54:59 127.0.0.1 - 127.0.0.1 62406 PUT /solr/schema/feature-store wt=json&indent=on 200 - 112 5 https://127.0.0.1:62406 Apache-HttpClient/4.5.6 (Java/11.0.4) -
[junit4] 2> Nov 04, 2019 4:54:59 PM org.restlet.engine.log.LogFilter afterHandle
[junit4] 2> INFO: 2019-11-04 16:54:59 127.0.0.1 - 127.0.0.1 62406 PUT /solr/schema/feature-store wt=json&indent=on 200 - 113 4 https://127.0.0.1:62406 Apache-HttpClient/4.5.6 (Java/11.0.4) -
[junit4] 2> Nov 04, 2019 4:54:59 PM org.restlet.engine.log.LogFilter afterHandle
[junit4] 2> INFO: 2019-11-04 16:54:59 127.0.0.1 - 127.0.0.1 62406 GET /solr/schema/feature-store/test wt=json&indent=on 200 - 0 0 https://127.0.0.1:62406 Apache-HttpClient/4.5.6 (Java/11.0.4) -
[junit4] 2> Nov 04, 2019 4:54:59 PM org.restlet.engine.log.LogFilter afterHandle
[junit4] 2> INFO: 2019-11-04 16:54:59 127.0.0.1 - 127.0.0.1 62406 GET /solr/schema/feature-store/test wt=json&indent=on 200 - 0 1 https://127.0.0.1:62406 Apache-HttpClient/4.5.6 (Java/11.0.4) -
[junit4] 2> Nov 04, 2019 4:54:59 PM org.restlet.engine.log.LogFilter afterHandle
[junit4] 2> INFO: 2019-11-04 16:54:59 127.0.0.1 - 127.0.0.1 62406 GET /solr/schema/feature-store/test1 wt=json&indent=on 200 - 0 0 https://127.0.0.1:62406 Apache-HttpClient/4.5.6 (Java/11.0.4) -
[junit4] 2> Nov 04, 2019 4:54:59 PM org.restlet.engine.log.LogFilter afterHandle
[junit4] 2> INFO: 2019-11-04 16:54:59 127.0.0.1 - 127.0.0.1 62406 GET /solr/schema/feature-store/test2 wt=json&indent=on 200 - 0 0 https://127.0.0.1:62406 Apache-HttpClient/4.5.6 (Java/11.0.4) -
[junit4] 2> Nov 04, 2019 4:54:59 PM org.restlet.engine.log.LogFilter afterHandle
[junit4] 2> INFO: 2019-11-04 16:54:59 127.0.0.1 - 127.0.0.1 62406 GET /solr/schema/feature-store/test wt=json&indent=on 200 - 0 0 https://127.0.0.1:62406 Apache-HttpClient/4.5.6 (Java/11.0.4) -
[junit4] 2> Nov 04, 2019 4:54:59 PM org.restlet.engine.log.LogFilter afterHandle
[junit4] 2> INFO: 2019-11-04 16:54:59 127.0.0.1 - 127.0.0.1 62406 GET /solr/schema/feature-store/test wt=json&indent=on 200 - 0 1 https://127.0.0.1:62406 Apache-HttpClient/4.5.6 (Java/11.0.4) -
[junit4] 2> Nov 04, 2019 4:54:59 PM org.restlet.engine.log.LogFilter afterHandle
[junit4] 2> INFO: 2019-11-04 16:54:59 127.0.0.1 - 127.0.0.1 62406 GET /solr/schema/feature-store/test1 wt=json&indent=on 200 - 0 0 https://127.0.0.1:62406 Apache-HttpClient/4.5.6 (Java/11.0.4) -
[junit4] 2> Nov 04, 2019 4:54:59 PM org.restlet.engine.log.LogFilter afterHandle
[junit4] 2> INFO: 2019-11-04 16:54:59 127.0.0.1 - 127.0.0.1 62406 GET /solr/schema/feature-store/test2 wt=json&indent=on 200 - 0 0 https://127.0.0.1:62406 Apache-HttpClient/4.5.6 (Java/11.0.4) -
[junit4] 2> Nov 04, 2019 4:54:59 PM org.restlet.engine.log.LogFilter afterHandle
[junit4] 2> INFO: 2019-11-04 16:54:59 127.0.0.1 - 127.0.0.1 62406 PUT /solr/schema/model-store wt=json&indent=on 200 - 165 5 https://127.0.0.1:62406 Apache-HttpClient/4.5.6 (Java/11.0.4) -
[junit4] 2> Nov 04, 2019 4:54:59 PM org.restlet.engine.log.LogFilter afterHandle
[junit4] 2> INFO: 2019-11-04 16:54:59 127.0.0.1 - 127.0.0.1 62406 PUT /solr/schema/model-store wt=json&indent=on 200 - 169 5 https://127.0.0.1:62406 Apache-HttpClient/4.5.6 (Java/11.0.4) -
[junit4] 2> Nov 04, 2019 4:54:59 PM org.restlet.engine.log.LogFilter afterHandle
[junit4] 2> INFO: 2019-11-04 16:54:59 127.0.0.1 - 127.0.0.1 62406 DELETE /solr/schema/feature-store/test2 wt=json&indent=on 200 - 0 3 https://127.0.0.1:62406 Apache-HttpClient/4.5.6 (Java/11.0.4) -
[junit4] 2> Nov 04, 2019 4:54:59 PM org.restlet.engine.log.LogFilter afterHandle
[junit4] 2> INFO: 2019-11-04 16:54:59 127.0.0.1 - 127.0.0.1 62406 DELETE /solr/schema/model-store/test-model2 wt=json&indent=on 200 - 0 3 https://127.0.0.1:62406 Apache-HttpClient/4.5.6 (Java/11.0.4) -
[junit4] 2> Nov 04, 2019 4:54:59 PM org.restlet.engine.log.LogFilter afterHandle
[junit4] 2> INFO: 2019-11-04 16:54:59 127.0.0.1 - 127.0.0.1 62406 GET /solr/schema/feature-store/test2 wt=json&indent=on 200 - 0 1 https://127.0.0.1:62406 Apache-HttpClient/4.5.6 (Java/11.0.4) -
[junit4] 2> Nov 04, 2019 4:54:59 PM org.restlet.engine.log.LogFilter afterHandle
[junit4] 2> INFO: 2019-11-04 16:54:59 127.0.0.1 - 127.0.0.1 62406 GET /solr/schema/model-store wt=json&indent=on 200 - 0 0 https://127.0.0.1:62406 Apache-HttpClient/4.5.6 (Java/11.0.4) -
[junit4] 2> Nov 04, 2019 4:54:59 PM org.restlet.engine.log.LogFilter afterHandle
[junit4] 2> INFO: 2019-11-04 16:54:59 127.0.0.1 - 127.0.0.1 62406 GET /solr/schema/feature-store/test2 wt=json&indent=on 200 - 0 0 https://127.0.0.1:62406 Apache-HttpClient/4.5.6 (Java/11.0.4) -
[junit4] 2> Nov 04, 2019 4:54:59 PM org.restlet.engine.log.LogFilter afterHandle
[junit4] 2> INFO: 2019-11-04 16:54:59 127.0.0.1 - 127.0.0.1 62406 GET /solr/schema/model-store wt=json&indent=on 200 - 0 0 https://127.0.0.1:62406 Apache-HttpClient/4.5.6 (Java/11.0.4) -
[junit4] 2> Nov 04, 2019 4:54:59 PM org.restlet.engine.log.LogFilter afterHandle
[junit4] 2> INFO: 2019-11-04 16:54:59 127.0.0.1 - 127.0.0.1 62406 DELETE /solr/schema/model-store/test-model wt=json&indent=on 200 - 0 3 https://127.0.0.1:62406 Apache-HttpClient/4.5.6 (Java/11.0.4) -
[junit4] 2> Nov 04, 2019 4:54:59 PM org.restlet.engine.log.LogFilter afterHandle
[junit4] 2> INFO: 2019-11-04 16:54:59 127.0.0.1 - 127.0.0.1 62406 DELETE /solr/schema/feature-store/test1 wt=json&indent=on 200 - 0 3 https://127.0.0.1:62406 Apache-HttpClient/4.5.6 (Java/11.0.4) -
[junit4] 2> Nov 04, 2019 4:54:59 PM org.restlet.engine.log.LogFilter afterHandle
[junit4] 2> INFO: 2019-11-04 16:54:59 127.0.0.1 - 127.0.0.1 62406 GET /solr/schema/feature-store/test1 wt=json&indent=on 200 - 0 1 https://127.0.0.1:62406 Apache-HttpClient/4.5.6 (Java/11.0.4) -
[junit4] 2> Nov 04, 2019 4:54:59 PM org.restlet.engine.log.LogFilter afterHandle
[junit4] 2> INFO: 2019-11-04 16:54:59 127.0.0.1 - 127.0.0.1 62406 GET /solr/schema/model-store wt=json&indent=on 200 - 0 1 https://127.0.0.1:62406 Apache-HttpClient/4.5.6 (Java/11.0.4) -
[junit4] 2> Nov 04, 2019 4:54:59 PM org.restlet.engine.log.LogFilter afterHandle
[junit4] 2> INFO: 2019-11-04 16:54:59 127.0.0.1 - 127.0.0.1 62406 GET /solr/schema/feature-store/test1 wt=json&indent=on 200 - 0 1 https://127.0.0.1:62406 Apache-HttpClient/4.5.6 (Java/11.0.4) -
[junit4] 2> Nov 04, 2019 4:54:59 PM org.restlet.engine.log.LogFilter afterHandle
[junit4] 2> INFO: 2019-11-04 16:54:59 127.0.0.1 - 127.0.0.1 62406 GET /solr/schema/model-store wt=json&indent=on 200 - 0 0 https://127.0.0.1:62406 Apache-HttpClient/4.5.6 (Java/11.0.4) -
[junit4] 1> 23:55:00.089 [TEST-TestModelManagerPersistence.testInnerCustomClassesPersistence-seed#[101DCF3E47D50AE0]] ERROR org.apache.solr.util.StartupLoggingUtils - Missing Java Option solr.log.dir. Logging may be missing or incomplete.
[junit4] 2> Nov 04, 2019 4:55:00 PM org.restlet.Application start
[junit4] 2> INFO: Starting org.apache.solr.rest.SolrSchemaRestApi application
[junit4] 2> Nov 04, 2019 4:55:00 PM org.restlet.engine.log.LogFilter afterHandle
[junit4] 2> INFO: 2019-11-04 16:55:00 127.0.0.1 - 127.0.0.1 62414 PUT /solr/schema/feature-store wt=json&indent=on 200 - 152 16 https://127.0.0.1:62414 Apache-HttpClient/4.5.6 (Java/11.0.4) -
[junit4] 2> Nov 04, 2019 4:55:00 PM org.restlet.engine.log.LogFilter afterHandle
[junit4] 2> INFO: 2019-11-04 16:55:00 127.0.0.1 - 127.0.0.1 62414 GET /solr/schema/feature-store/test42 wt=json&indent=on 200 - 0 0 https://127.0.0.1:62414 Apache-HttpClient/4.5.6 (Java/11.0.4) -
[junit4] 2> Nov 04, 2019 4:55:00 PM org.restlet.engine.log.LogFilter afterHandle
[junit4] 2> INFO: 2019-11-04 16:55:00 127.0.0.1 - 127.0.0.1 62414 PUT /solr/schema/model-store wt=json&indent=on 200 - 206 11 https://127.0.0.1:62414 Apache-HttpClient/4.5.6 (Java/11.0.4) -
[junit4] 2> Nov 04, 2019 4:55:00 PM org.restlet.engine.log.LogFilter afterHandle
[junit4] 2> INFO: 2019-11-04 16:55:00 127.0.0.1 - 127.0.0.1 62414 GET /solr/schema/model-store wt=json&indent=on 200 - 0 0 https://127.0.0.1:62414 Apache-HttpClient/4.5.6 (Java/11.0.4) -
[junit4] 2> Nov 04, 2019 4:55:01 PM org.restlet.engine.log.LogFilter afterHandle
[junit4] 2> INFO: 2019-11-04 16:55:01 127.0.0.1 - 127.0.0.1 62414 GET /solr/schema/feature-store/test42 wt=json&indent=on 200 - 0 1 https://127.0.0.1:62414 Apache-HttpClient/4.5.6 (Java/11.0.4) -
[junit4] 2> Nov 04, 2019 4:55:01 PM org.restlet.engine.log.LogFilter afterHandle
[junit4] 2> INFO: 2019-11-04 16:55:01 127.0.0.1 - 127.0.0.1 62414 GET /solr/schema/model-store wt=json&indent=on 200 - 0 1 https://127.0.0.1:62414 Apache-HttpClient/4.5.6 (Java/11.0.4) -
[junit4] 2> Nov 04, 2019 4:55:01 PM org.restlet.engine.log.LogFilter afterHandle
[junit4] 2> INFO: 2019-11-04 16:55:01 127.0.0.1 - 127.0.0.1 62414 DELETE /solr/schema/model-store/model42 wt=json&indent=on 200 - 0 11 https://127.0.0.1:62414 Apache-HttpClient/4.5.6 (Java/11.0.4) -
[junit4] 2> Nov 04, 2019 4:55:01 PM org.restlet.engine.log.LogFilter afterHandle
[junit4] 2> INFO: 2019-11-04 16:55:01 127.0.0.1 - 127.0.0.1 62414 GET /solr/schema/model-store wt=json&indent=on 200 - 0 0 https://127.0.0.1:62414 Apache-HttpClient/4.5.6 (Java/11.0.4) -
[junit4] 2> Nov 04, 2019 4:55:01 PM org.restlet.engine.log.LogFilter afterHandle
[junit4] 2> INFO: 2019-11-04 16:55:01 127.0.0.1 - 127.0.0.1 62414 DELETE /solr/schema/feature-store/test42 wt=json&indent=on 200 - 0 0 https://127.0.0.1:62414 Apache-HttpClient/4.5.6 (Java/11.0.4) -
[junit4] 2> Nov 04, 2019 4:55:01 PM org.restlet.engine.log.LogFilter afterHandle
[junit4] 2> INFO: 2019-11-04 16:55:01 127.0.0.1 - 127.0.0.1 62414 GET /solr/schema/feature-store/test42 wt=json&indent=on 200 - 0 0 https://127.0.0.1:62414 Apache-HttpClient/4.5.6 (Java/11.0.4) -
[junit4] 1> 23:55:01.173 [TEST-TestModelManagerPersistence.testWrapperModelPersistence-seed#[101DCF3E47D50AE0]] ERROR org.apache.solr.util.StartupLoggingUtils - Missing Java Option solr.log.dir. Logging may be missing or incomplete.
[junit4] 2> Nov 04, 2019 4:55:01 PM org.restlet.Application start
[junit4] 2> INFO: Starting org.apache.solr.rest.SolrSchemaRestApi application
[junit4] 2> Nov 04, 2019 4:55:01 PM org.restlet.engine.log.LogFilter afterHandle
[junit4] 2> INFO: 2019-11-04 16:55:01 127.0.0.1 - 127.0.0.1 62422 GET /solr/schema/model-store wt=json&indent=on 200 - 0 3 https://127.0.0.1:62422 Apache-HttpClient/4.5.6 (Java/11.0.4) -
[junit4] 2> Nov 04, 2019 4:55:01 PM org.restlet.engine.log.LogFilter afterHandle
[junit4] 2> INFO: 2019-11-04 16:55:01 127.0.0.1 - 127.0.0.1 62422 GET /solr/schema/feature-store/testWrapper wt=json&indent=on 200 - 0 0 https://127.0.0.1:62422 Apache-HttpClient/4.5.6 (Java/11.0.4) -
[junit4] 2> Nov 04, 2019 4:55:01 PM org.restlet.engine.log.LogFilter afterHandle
[junit4] 2> INFO: 2019-11-04 16:55:01 127.0.0.1 - 127.0.0.1 62422 PUT /solr/schema/feature-store wt=json&indent=on 200 - 137 10 https://127.0.0.1:62422 Apache-HttpClient/4.5.6 (Java/11.0.4) -
[junit4] 2> Nov 04, 2019 4:55:01 PM org.restlet.engine.log.LogFilter afterHandle
[junit4] 2> INFO: 2019-11-04 16:55:01 127.0.0.1 - 127.0.0.1 62422 PUT /solr/schema/feature-store wt=json&indent=on 200 - 116 8 https://127.0.0.1:62422 Apache-HttpClient/4.5.6 (Java/11.0.4) -
[junit4] 2> Nov 04, 2019 4:55:01 PM org.restlet.engine.log.LogFilter afterHandle
[junit4] 2> INFO: 2019-11-04 16:55:01 127.0.0.1 - 127.0.0.1 62422 PUT /solr/schema/model-store wt=json&indent=on 200 - 171 23 https://127.0.0.1:62422 Apache-HttpClient/4.5.6 (Java/11.0.4) -
[junit4] 2> Nov 04, 2019 4:55:01 PM org.restlet.engine.log.LogFilter afterHandle
[junit4] 2> INFO: 2019-11-04 16:55:01 127.0.0.1 - 127.0.0.1 62422 GET /solr/schema/model-store wt=json&indent=on 200 - 0 2 https://127.0.0.1:62422 Apache-HttpClient/4.5.6 (Java/11.0.4) -
[junit4] 2> Nov 04, 2019 4:55:02 PM org.restlet.engine.log.LogFilter afterHandle
[junit4] 2> INFO: 2019-11-04 16:55:02 127.0.0.1 - 127.0.0.1 62422 GET /solr/schema/model-store wt=json&indent=on 200 - 0 0 https://127.0.0.1:62422 Apache-HttpClient/4.5.6 (Java/11.0.4) -
[junit4] 1> 23:55:02.122 [TEST-TestModelManagerPersistence.testWrapperModelPersistence-seed#[101DCF3E47D50AE0]] ERROR org.apache.solr.util.StartupLoggingUtils - Missing Java Option solr.log.dir. Logging may be missing or incomplete.
[junit4] 1> 23:55:02.318 [TEST-TestModelManagerPersistence.testWrapperModelPersistence-seed#[101DCF3E47D50AE0]] ERROR org.apache.solr.util.RestTestBase - REQUEST FAILED: /schema/model-store?wt=json&indent=on
[junit4] 2> NOTE: reproduce with: ant test -Dtestcase=TestModelManagerPersistence -Dtests.method=testWrapperModelPersistence -Dtests.seed=101DCF3E47D50AE0 -Dtests.slow=true -Dtests.locale=en-150 -Dtests.timezone=Navajo -Dtests.asserts=true -Dtests.file.encoding=US-ASCII
[junit4] ERROR 1.22s J1 | TestModelManagerPersistence.testWrapperModelPersistence <<<
[junit4] > Throwable #1: javax.net.ssl.SSLException: Software caused connection abort: recv failed
[junit4] > at __randomizedtesting.SeedInfo.seed([101DCF3E47D50AE0:6577BCE0F82973A5]:0)
[junit4] > at java.base/sun.security.ssl.Alert.createSSLException(Alert.java:127)
[junit4] > at java.base/sun.security.ssl.TransportContext.fatal(TransportContext.java:320)
[junit4] > at java.base/sun.security.ssl.TransportContext.fatal(TransportContext.java:263)
[junit4] > at java.base/sun.security.ssl.TransportContext.fatal(TransportContext.java:258)
[junit4] > at java.base/sun.security.ssl.SSLSocketImpl.handleException(SSLSocketImpl.java:1315)
[junit4] > at java.base/sun.security.ssl.SSLSocketImpl$AppInputStream.read(SSLSocketImpl.java:839)
[junit4] > at org.apache.http.impl.io.SessionInputBufferImpl.streamRead(SessionInputBufferImpl.java:137)
[junit4] > at org.apache.http.impl.io.SessionInputBufferImpl.fillBuffer(SessionInputBufferImpl.java:153)
[junit4] > at org.apache.http.impl.io.SessionInputBufferImpl.readLine(SessionInputBufferImpl.java:282)
[junit4] > at org.apache.http.impl.conn.DefaultHttpResponseParser.parseHead(DefaultHttpResponseParser.java:138)
[junit4] > at org.apache.http.impl.conn.DefaultHttpResponseParser.parseHead(DefaultHttpResponseParser.java:56)
[junit4] > at org.apache.http.impl.io.AbstractMessageParser.parse(AbstractMessageParser.java:259)
[junit4] > at org.apache.http.impl.DefaultBHttpClientConnection.receiveResponseHeader(DefaultBHttpClientConnection.java:163)
[junit4] > at org.apache.http.impl.conn.CPoolProxy.receiveResponseHeader(CPoolProxy.java:165)
[junit4] > at org.apache.http.protocol.HttpRequestExecutor.doReceiveResponse(HttpRequestExecutor.java:273)
[junit4] > at org.apache.http.protocol.HttpRequestExecutor.execute(HttpRequestExecutor.java:125)
[junit4] > at org.apache.http.impl.execchain.MainClientExec.execute(MainClientExec.java:272)
[junit4] > at org.apache.http.impl.execchain.ProtocolExec.execute(ProtocolExec.java:185)
[junit4] > at org.apache.http.impl.execchain.RetryExec.execute(RetryExec.java:89)
[junit4] > at org.apache.http.impl.execchain.RedirectExec.execute(RedirectExec.java:110)
[junit4] > at org.apache.http.impl.client.InternalHttpClient.doExecute(InternalHttpClient.java:185)
[junit4] > at org.apache.http.impl.client.CloseableHttpClient.execute(CloseableHttpClient.java:83)
[junit4] > at org.apache.solr.util.RestTestHarness.getResponse(RestTestHarness.java:215)
[junit4] > at org.apache.solr.util.RestTestHarness.query(RestTestHarness.java:107)
[junit4] > at org.apache.solr.util.RestTestBase.assertJQ(RestTestBase.java:226)
[junit4] > at org.apache.solr.util.RestTestBase.assertJQ(RestTestBase.java:192)
[junit4] > at org.apache.solr.ltr.store.rest.TestModelManagerPersistence.doWrapperModelPersistenceChecks(TestModelManagerPersistence.java:207)
[junit4] > at org.apache.solr.ltr.store.rest.TestModelManagerPersistence.testWrapperModelPersistence(TestModelManagerPersistence.java:260)
[junit4] > at java.base/jdk.internal.reflect.NativeMethodAccessorImpl.invoke0(Native Method)
[junit4] > at java.base/jdk.internal.reflect.NativeMethodAccessorImpl.invoke(NativeMethodAccessorImpl.java:62)
[junit4] > at java.base/jdk.internal.reflect.DelegatingMethodAccessorImpl.invoke(DelegatingMethodAccessorImpl.java:43)
[junit4] > at java.base/java.lang.reflect.Method.invoke(Method.java:566)
[junit4] > at java.base/java.lang.Thread.run(Thread.java:834)
[junit4] > Suppressed: java.net.SocketException: Software caused connection abort: socket write error
[junit4] > at java.base/java.net.SocketOutputStream.socketWrite0(Native Method)
[junit4] > at java.base/java.net.SocketOutputStream.socketWrite(SocketOutputStream.java:110)
[junit4] > at java.base/java.net.SocketOutputStream.write(SocketOutputStream.java:150)
[junit4] > at java.base/sun.security.ssl.SSLSocketOutputRecord.encodeAlert(SSLSocketOutputRecord.java:81)
[junit4] > at java.base/sun.security.ssl.TransportContext.fatal(TransportContext.java:351)
[junit4] > ... 64 more
[junit4] > Caused by: java.net.SocketException: Software caused connection abort: recv failed
[junit4] > at java.base/java.net.SocketInputStream.socketRead0(Native Method)
[junit4] > at java.base/java.net.SocketInputStream.socketRead(SocketInputStream.java:115)
[junit4] > at java.base/java.net.SocketInputStream.read(SocketInputStream.java:168)
[junit4] > at java.base/java.net.SocketInputStream.read(SocketInputStream.java:140)
[junit4] > at java.base/sun.security.ssl.SSLSocketInputRecord.read(SSLSocketInputRecord.java:448)
[junit4] > at java.base/sun.security.ssl.SSLSocketInputRecord.bytesInCompletePacket(SSLSocketInputRecord.java:68)
[junit4] > at java.base/sun.security.ssl.SSLSocketImpl.readApplicationRecord(SSLSocketImpl.java:1104)
[junit4] > at java.base/sun.security.ssl.SSLSocketImpl$AppInputStream.read(SSLSocketImpl.java:823)
[junit4] > ... 60 more
[junit4] 2> NOTE: leaving temporary files on disk at: C:\Users\jenkins\workspace\Lucene-Solr-SOLR-13661-Windows\solr\build\contrib\solr-ltr\test\J1\temp\solr.ltr.store.rest.TestModelManagerPersistence_101DCF3E47D50AE0-001
[junit4] 2> NOTE: test params are: codec=Asserting(Lucene80): {description=BlockTreeOrds(blocksize=128), id=FSTOrd50, text=PostingsFormat(name=MockRandom), title=BlockTreeOrds(blocksize=128)}, docValues:{}, maxPointsInLeafNode=196, maxMBSortInHeap=6.5418813712299615, sim=Asserting(org.apache.lucene.search.similarities.AssertingSimilarity@53e4a5c2), locale=en-150, timezone=Navajo
[junit4] 2> NOTE: Windows 10 10.0 amd64/AdoptOpenJDK 11.0.4 (64-bit)/cpus=3,threads=1,free=39443416,total=253231104
[junit4] 2> NOTE: All tests run in this JVM: [TestMultipleAdditiveTreesModel, TestValueFeature, TestFeatureExtractionFromMultipleSegments, TestOriginalScoreFeature, TestWrapperModel, TestUserTermScorerQuery, TestRankingFeature, TestFieldLengthFeature, TestSelectiveWeightCreation, TestLTRQParserExplain, TestLTRScoringQuery, TestLTRWithSort, TestParallelWeightCreation, TestExternalFeatures, TestDefaultWrapperModel, TestManagedFeatureStore, TestModelManager, TestModelManagerPersistence]
[junit4] Completed [37/37 (1!)] on J1 in 5.55s, 4 tests, 2 errors <<< FAILURES!
[...truncated 40183 lines...]
-ecj-javadoc-lint-src:
[mkdir] Created dir: C:\Users\jenkins\AppData\Local\Temp\ecj1585373714
[ecj-lint] Compiling 1298 source files to C:\Users\jenkins\AppData\Local\Temp\ecj1585373714
[ecj-lint] Processing annotations
[ecj-lint] Annotations processed
[ecj-lint] Processing annotations
[ecj-lint] No elements to process
[ecj-lint] invalid Class-Path header in manifest of jar file: C:\Users\jenkins\workspace\Lucene-Solr-SOLR-13661-Windows\solr\core\lib\org.restlet-2.3.0.jar
[ecj-lint] invalid Class-Path header in manifest of jar file: C:\Users\jenkins\workspace\Lucene-Solr-SOLR-13661-Windows\solr\core\lib\org.restlet.ext.servlet-2.3.0.jar
[ecj-lint] ----------
[ecj-lint] 1. WARNING in C:\Users\jenkins\workspace\Lucene-Solr-SOLR-13661-Windows\solr\core\src\java\org\apache\solr\client\solrj\embedded\EmbeddedSolrServer.java (at line 255)
[ecj-lint] return (NamedList<Object>) new JavaBinCodec(resolver).unmarshal(in);
[ecj-lint] ^^^^^^^^^^^^^^^^^^^^^^^^^^
[ecj-lint] Resource leak: '<unassigned Closeable value>' is never closed
[ecj-lint] ----------
[ecj-lint] ----------
[ecj-lint] 2. WARNING in C:\Users\jenkins\workspace\Lucene-Solr-SOLR-13661-Windows\solr\core\src\java\org\apache\solr\cloud\RecoveryStrategy.java (at line 232)
[ecj-lint] ReplicationHandler replicationHandler = (ReplicationHandler) handler;
[ecj-lint] ^^^^^^^^^^^^^^^^^^
[ecj-lint] Resource leak: 'replicationHandler' is never closed
[ecj-lint] ----------
[ecj-lint] 3. WARNING in C:\Users\jenkins\workspace\Lucene-Solr-SOLR-13661-Windows\solr\core\src\java\org\apache\solr\cloud\RecoveryStrategy.java (at line 628)
[ecj-lint] PeerSyncWithLeader peerSyncWithLeader = new PeerSyncWithLeader(core,
[ecj-lint] ^^^^^^^^^^^^^^^^^^
[ecj-lint] Resource leak: 'peerSyncWithLeader' is never closed
[ecj-lint] ----------
[ecj-lint] ----------
[ecj-lint] 4. WARNING in C:\Users\jenkins\workspace\Lucene-Solr-SOLR-13661-Windows\solr\core\src\java\org\apache\solr\cloud\SyncStrategy.java (at line 186)
[ecj-lint] PeerSync peerSync = new PeerSync(core, syncWith, core.getUpdateHandler().getUpdateLog().getNumRecordsToKeep(), true, peerSyncOnlyWithActive, false);
[ecj-lint] ^^^^^^^^
[ecj-lint] Resource leak: 'peerSync' is never closed
[ecj-lint] ----------
[ecj-lint] ----------
[ecj-lint] 5. WARNING in C:\Users\jenkins\workspace\Lucene-Solr-SOLR-13661-Windows\solr\core\src\java\org\apache\solr\cloud\autoscaling\sim\SimCloudManager.java (at line 794)
[ecj-lint] throw new UnsupportedOperationException("must add at least 1 node first");
[ecj-lint] ^^^^^^^^^^^^^^^^^^^^^^^^^^^^^^^^^^^^^^^^^^^^^^^^^^^^^^^^^^^^^^^^^^^^^^^^^^
[ecj-lint] Resource leak: 'queryRequest' is not closed at this location
[ecj-lint] ----------
[ecj-lint] 6. WARNING in C:\Users\jenkins\workspace\Lucene-Solr-SOLR-13661-Windows\solr\core\src\java\org\apache\solr\cloud\autoscaling\sim\SimCloudManager.java (at line 800)
[ecj-lint] throw new UnsupportedOperationException("must add at least 1 node first");
[ecj-lint] ^^^^^^^^^^^^^^^^^^^^^^^^^^^^^^^^^^^^^^^^^^^^^^^^^^^^^^^^^^^^^^^^^^^^^^^^^^
[ecj-lint] Resource leak: 'queryRequest' is not closed at this location
[ecj-lint] ----------
[ecj-lint] ----------
[ecj-lint] 7. WARNING in C:\Users\jenkins\workspace\Lucene-Solr-SOLR-13661-Windows\solr\core\src\java\org\apache\solr\cloud\autoscaling\sim\SimScenario.java (at line 406)
[ecj-lint] SnapshotCloudManager snapshotCloudManager = new SnapshotCloudManager(scenario.cluster, null);
[ecj-lint] ^^^^^^^^^^^^^^^^^^^^
[ecj-lint] Resource leak: 'snapshotCloudManager' is never closed
[ecj-lint] ----------
[ecj-lint] 8. WARNING in C:\Users\jenkins\workspace\Lucene-Solr-SOLR-13661-Windows\solr\core\src\java\org\apache\solr\cloud\autoscaling\sim\SimScenario.java (at line 739)
[ecj-lint] throw new IOException("currently only one listener can be set per trigger. Trigger name: " + trigger);
[ecj-lint] ^^^^^^^^^^^^^^^^^^^^^^^^^^^^^^^^^^^^^^^^^^^^^^^^^^^^^^^^^^^^^^^^^^^^^^^^^^^^^^^^^^^^^^^^^^^^^^^^^^^^^^
[ecj-lint] Resource leak: 'listener' is not closed at this location
[ecj-lint] ----------
[ecj-lint] 9. WARNING in C:\Users\jenkins\workspace\Lucene-Solr-SOLR-13661-Windows\solr\core\src\java\org\apache\solr\cloud\autoscaling\sim\SimScenario.java (at line 929)
[ecj-lint] SnapshotCloudManager snapshotCloudManager = new SnapshotCloudManager(scenario.cluster, null);
[ecj-lint] ^^^^^^^^^^^^^^^^^^^^
[ecj-lint] Resource leak: 'snapshotCloudManager' is never closed
[ecj-lint] ----------
[ecj-lint] 10. WARNING in C:\Users\jenkins\workspace\Lucene-Solr-SOLR-13661-Windows\solr\core\src\java\org\apache\solr\cloud\autoscaling\sim\SimScenario.java (at line 968)
[ecj-lint] SimScenario scenario = new SimScenario();
[ecj-lint] ^^^^^^^^
[ecj-lint] Resource leak: 'scenario' is never closed
[ecj-lint] ----------
[ecj-lint] ----------
[ecj-lint] 11. WARNING in C:\Users\jenkins\workspace\Lucene-Solr-SOLR-13661-Windows\solr\core\src\java\org\apache\solr\core\CoreContainer.java (at line 740)
[ecj-lint] SolrFieldCacheBean fieldCacheBean = new SolrFieldCacheBean();
[ecj-lint] ^^^^^^^^^^^^^^
[ecj-lint] Resource leak: 'fieldCacheBean' is never closed
[ecj-lint] ----------
[ecj-lint] ----------
[ecj-lint] 12. ERROR in C:\Users\jenkins\workspace\Lucene-Solr-SOLR-13661-Windows\solr\core\src\java\org\apache\solr\core\SolrResourceLoader.java (at line 19)
[ecj-lint] import javax.naming.Context;
[ecj-lint] ^^^^^^^^^^^^^^^^^^^^
[ecj-lint] The type javax.naming.Context is not accessible
[ecj-lint] ----------
[ecj-lint] 13. ERROR in C:\Users\jenkins\workspace\Lucene-Solr-SOLR-13661-Windows\solr\core\src\java\org\apache\solr\core\SolrResourceLoader.java (at line 20)
[ecj-lint] import javax.naming.InitialContext;
[ecj-lint] ^^^^^^^^^^^^^^^^^^^^^^^^^^^
[ecj-lint] The type javax.naming.InitialContext is not accessible
[ecj-lint] ----------
[ecj-lint] 14. ERROR in C:\Users\jenkins\workspace\Lucene-Solr-SOLR-13661-Windows\solr\core\src\java\org\apache\solr\core\SolrResourceLoader.java (at line 21)
[ecj-lint] import javax.naming.NamingException;
[ecj-lint] ^^^^^^^^^^^^^^^^^^^^^^^^^^^^
[ecj-lint] The type javax.naming.NamingException is not accessible
[ecj-lint] ----------
[ecj-lint] 15. ERROR in C:\Users\jenkins\workspace\Lucene-Solr-SOLR-13661-Windows\solr\core\src\java\org\apache\solr\core\SolrResourceLoader.java (at line 22)
[ecj-lint] import javax.naming.NoInitialContextException;
[ecj-lint] ^^^^^^^^^^^^^^^^^^^^^^^^^^^^^^^^^^^^^^
[ecj-lint] The type javax.naming.NoInitialContextException is not accessible
[ecj-lint] ----------
[ecj-lint] 16. ERROR in C:\Users\jenkins\workspace\Lucene-Solr-SOLR-13661-Windows\solr\core\src\java\org\apache\solr\core\SolrResourceLoader.java (at line 802)
[ecj-lint] Context c = new InitialContext();
[ecj-lint] ^^^^^^^
[ecj-lint] Context cannot be resolved to a type
[ecj-lint] ----------
[ecj-lint] 17. ERROR in C:\Users\jenkins\workspace\Lucene-Solr-SOLR-13661-Windows\solr\core\src\java\org\apache\solr\core\SolrResourceLoader.java (at line 802)
[ecj-lint] Context c = new InitialContext();
[ecj-lint] ^^^^^^^^^^^^^^
[ecj-lint] InitialContext cannot be resolved to a type
[ecj-lint] ----------
[ecj-lint] 18. ERROR in C:\Users\jenkins\workspace\Lucene-Solr-SOLR-13661-Windows\solr\core\src\java\org\apache\solr\core\SolrResourceLoader.java (at line 805)
[ecj-lint] } catch (NoInitialContextException e) {
[ecj-lint] ^^^^^^^^^^^^^^^^^^^^^^^^^
[ecj-lint] NoInitialContextException cannot be resolved to a type
[ecj-lint] ----------
[ecj-lint] 19. ERROR in C:\Users\jenkins\workspace\Lucene-Solr-SOLR-13661-Windows\solr\core\src\java\org\apache\solr\core\SolrResourceLoader.java (at line 807)
[ecj-lint] } catch (NamingException e) {
[ecj-lint] ^^^^^^^^^^^^^^^
[ecj-lint] NamingException cannot be resolved to a type
[ecj-lint] ----------
[ecj-lint] ----------
[ecj-lint] 20. WARNING in C:\Users\jenkins\workspace\Lucene-Solr-SOLR-13661-Windows\solr\core\src\java\org\apache\solr\handler\CdcrRequestHandler.java (at line 741)
[ecj-lint] ReplicationHandler replicationHandler = (ReplicationHandler) handler;
[ecj-lint] ^^^^^^^^^^^^^^^^^^
[ecj-lint] Resource leak: 'replicationHandler' is never closed
[ecj-lint] ----------
[ecj-lint] 21. WARNING in C:\Users\jenkins\workspace\Lucene-Solr-SOLR-13661-Windows\solr\core\src\java\org\apache\solr\handler\CdcrRequestHandler.java (at line 760)
[ecj-lint] ReplicationHandler replicationHandler = (ReplicationHandler) handler;
[ecj-lint] ^^^^^^^^^^^^^^^^^^
[ecj-lint] Resource leak: 'replicationHandler' is never closed
[ecj-lint] ----------
[ecj-lint] ----------
[ecj-lint] 22. WARNING in C:\Users\jenkins\workspace\Lucene-Solr-SOLR-13661-Windows\solr\core\src\java\org\apache\solr\handler\SolrConfigHandler.java (at line 557)
[ecj-lint] new PluginBag.RuntimeLib(req.getCore()).init(new PluginInfo(info.tag, op.getDataMap()));
[ecj-lint] ^^^^^^^^^^^^^^^^^^^^^^^^^^^^^^^^^^^^^^^
[ecj-lint] Resource leak: '<unassigned Closeable value>' is never closed
[ecj-lint] ----------
[ecj-lint] ----------
[ecj-lint] 23. WARNING in C:\Users\jenkins\workspace\Lucene-Solr-SOLR-13661-Windows\solr\core\src\java\org\apache\solr\handler\admin\SegmentsInfoRequestHandler.java (at line 243)
[ecj-lint] leafReader = ((FilterLeafReader)leafReader).getDelegate();
[ecj-lint] ^^^^^^^^^^^^^^^^^^^^^^^^^^^^^^^^^^^^^^^^^^^^^^^^^^^^^^^^^
[ecj-lint] Resource leak: 'leafReader' is not closed at this location
[ecj-lint] ----------
[ecj-lint] ----------
[ecj-lint] 24. WARNING in C:\Users\jenkins\workspace\Lucene-Solr-SOLR-13661-Windows\solr\core\src\java\org\apache\solr\handler\component\HttpShardHandler.java (at line 149)
[ecj-lint] return new JavaBinCodec(null, stringCache).setReadStringAsCharSeq(true);
[ecj-lint] ^^^^^^^^^^^^^^^^^^^^^^^^^^^^^^^^^^^
[ecj-lint] Resource leak: '<unassigned Closeable value>' is never closed
[ecj-lint] ----------
[ecj-lint] ----------
[ecj-lint] 25. WARNING in C:\Users\jenkins\workspace\Lucene-Solr-SOLR-13661-Windows\solr\core\src\java\org\apache\solr\handler\component\HttpShardHandlerFactory.java (at line 415)
[ecj-lint] ZkController zkController = core == null ? null : core.getCoreContainer().getZkController();
[ecj-lint] ^^^^^^^^^^^^
[ecj-lint] Resource leak: 'zkController' is never closed
[ecj-lint] ----------
[ecj-lint] ----------
[ecj-lint] 26. WARNING in C:\Users\jenkins\workspace\Lucene-Solr-SOLR-13661-Windows\solr\core\src\java\org\apache\solr\handler\component\RealTimeGetComponent.java (at line 1118)
[ecj-lint] PeerSyncWithLeader peerSync = new PeerSyncWithLeader(rb.req.getCore(), syncWithLeader, nVersions);
[ecj-lint] ^^^^^^^^
[ecj-lint] Resource leak: 'peerSync' is never closed
[ecj-lint] ----------
[ecj-lint] 27. WARNING in C:\Users\jenkins\workspace\Lucene-Solr-SOLR-13661-Windows\solr\core\src\java\org\apache\solr\handler\component\RealTimeGetComponent.java (at line 1140)
[ecj-lint] PeerSync peerSync = new PeerSync(rb.req.getCore(), replicas, nVersions, cantReachIsSuccess);
[ecj-lint] ^^^^^^^^
[ecj-lint] Resource leak: 'peerSync' is never closed
[ecj-lint] ----------
[ecj-lint] ----------
[ecj-lint] 28. WARNING in C:\Users\jenkins\workspace\Lucene-Solr-SOLR-13661-Windows\solr\core\src\java\org\apache\solr\handler\loader\JavabinLoader.java (at line 137)
[ecj-lint] new JavaBinCodec() {
[ecj-lint] SolrParams params;
[ecj-lint] AddUpdateCommand addCmd = null;
[ecj-lint]
[ecj-lint] @Override
[ecj-lint] public List<Object> readIterator(DataInputInputStream fis) throws IOException {
[ecj-lint] while (true) {
[ecj-lint] Object o = readVal(fis);
[ecj-lint] if (o == END_OBJ) break;
[ecj-lint] if (o instanceof NamedList) {
[ecj-lint] params = ((NamedList) o).toSolrParams();
[ecj-lint] } else {
[ecj-lint] try {
[ecj-lint] if (o instanceof byte[]) {
[ecj-lint] if (params != null) req.setParams(params);
[ecj-lint] byte[] buf = (byte[]) o;
[ecj-lint] contentStreamLoader.load(req, rsp, new ContentStreamBase.ByteArrayStream(buf, null), processor);
[ecj-lint] } else {
[ecj-lint] throw new RuntimeException("unsupported type ");
[ecj-lint] }
[ecj-lint] } catch (Exception e) {
[ecj-lint] throw new RuntimeException(e);
[ecj-lint] } finally {
[ecj-lint] params = null;
[ecj-lint] req.setParams(old);
[ecj-lint] }
[ecj-lint] }
[ecj-lint] }
[ecj-lint] return Collections.emptyList();
[ecj-lint] }
[ecj-lint]
[ecj-lint] }.unmarshal(in);
[ecj-lint] ^^^^^^^^^^^^^^^^^^^^^^^^^^^^^^^^^^^^^^^^^^^^^^^^^^^^^^^^^^^^^^^^^^^^^^^^^^^^^^^^^^^^^^^^^^^^^^^^^^^^^^^^^^^^^^^^^^^^^^^^^^^^^^^^^^^^^^^^^^^^^^^^^^^^^^^^^^^^^^^^^^^^^^^^^^^^^^^^^^^^^^^^^^^^^^^^^^^^^^^^^^^^^^^^^^^^^^^^^^^^^^^^^^^^^^^^^^^^^^^^^^^^^^^^^^^^^^^^^^^^^^^^^^^^^^^^^^^^^^^^^^^^^^^^^^^^^^^^^^^^^^^^^^^^^^^^^^^^^^^^^^^^^^^^^^^^^^^^^^^^^^^^^^^^^^^^^^^^^^^^^^^^^^^^^^^^^^^^^^^^^^^^^^^^^^^^^^^^^^^^^^^^^^^^^^^^^^^^^^^^^^^^^^^^^^^^^^^^^^^^^^^^^^^^^^^^^^^^^^^^^^^^^^^^^^^^^^^^^^^^^^^^^^^^^^^^^^^^^^^^^^^^^^^^^^^^^^^^^^^^^^^^^^^^^^^^^^^^^^^^^^^^^^^^^^^^^^^^^^^^^^^^^^^^^^^^^^^^^^^^^^^^^^^^^^^^^^^^^^^^^^^^^^^^^^^^^^^^^^^^^^^^^^^^^^^^^^^^^^^^^^^^^^^^^^^^^^^^^^^^^^^^^^^^^^^^^^^^^^^^^^^^^^^^^^^^^^^^^^^^^^^^^^^^^^^^^^^^^^^^^^^^^^^^^^^^^^^^^^^^^^^^^^^^^^^^^^^^^^^^^^^^^^^^^^^^^^^^^^^^^^^^^^^^^^^^^^^^^^^^^^^^^^^^^^^^^^^^^^^^^^^^^^^^^^^^^^^^^^^^^^^^^^^^^^^^^^^^^^^^^^^^^^^^^^^^^^^^^^^^^^^^^^^^^^^^^^^^^^^^^^^^^^^^^^^^^^^^^^^^^^^^^^^^^^^^^^^^^^^^^^^^^^^^^^^^^^^^^^^^^^^^^^^^^^^^^^^^^^^^^^^^^^^^^^^^^^^^^^^^^^^^^^^^^^^^^^^^^^^^^^^^^^
[ecj-lint] Resource leak: '<unassigned Closeable value>' is never closed
[ecj-lint] ----------
[ecj-lint] ----------
[ecj-lint] 29. INFO in C:\Users\jenkins\workspace\Lucene-Solr-SOLR-13661-Windows\solr\core\src\java\org\apache\solr\logging\log4j2\Log4j2Watcher.java (at line 187)
[ecj-lint] if (logger == root || root.equals(logger) || isRootLogger(name) || "".equals(name)) {
[ecj-lint] ^^^^^^
[ecj-lint] Unlikely argument type for equals(): Map.Entry<String,LoggerConfig> seems to be unrelated to Logger
[ecj-lint] ----------
[ecj-lint] ----------
[ecj-lint] 30. ERROR in C:\Users\jenkins\workspace\Lucene-Solr-SOLR-13661-Windows\solr\core\src\java\org\apache\solr\search\CacheConfig.java (at line 35)
[ecj-lint] import org.apache.solr.pkg.PackageLoader;
[ecj-lint] ^^^^^^^^^^^^^^^^^^^^^^^^^^^^^^^^^
[ecj-lint] The import org.apache.solr.pkg.PackageLoader is never used
[ecj-lint] ----------
[ecj-lint] 31. ERROR in C:\Users\jenkins\workspace\Lucene-Solr-SOLR-13661-Windows\solr\core\src\java\org\apache\solr\search\CacheConfig.java (at line 36)
[ecj-lint] import org.apache.solr.pkg.PackagePluginHolder;
[ecj-lint] ^^^^^^^^^^^^^^^^^^^^^^^^^^^^^^^^^^^^^^^
[ecj-lint] The import org.apache.solr.pkg.PackagePluginHolder is never used
[ecj-lint] ----------
[ecj-lint] ----------
[ecj-lint] 32. WARNING in C:\Users\jenkins\workspace\Lucene-Solr-SOLR-13661-Windows\solr\core\src\java\org\apache\solr\update\SolrIndexSplitter.java (at line 258)
[ecj-lint] HardlinkCopyDirectoryWrapper hardLinkedDir = new HardlinkCopyDirectoryWrapper(splitDir);
[ecj-lint] ^^^^^^^^^^^^^
[ecj-lint] Resource leak: 'hardLinkedDir' is never closed
[ecj-lint] ----------
[ecj-lint] ----------
[ecj-lint] 33. WARNING in C:\Users\jenkins\workspace\Lucene-Solr-SOLR-13661-Windows\solr\core\src\java\org\apache\solr\util\FileUtils.java (at line 52)
[ecj-lint] try (FileChannel in = new FileInputStream(src).getChannel();
[ecj-lint] ^^^^^^^^^^^^^^^^^^^^^^^^
[ecj-lint] Resource leak: '<unassigned Closeable value>' is never closed
[ecj-lint] ----------
[ecj-lint] 34. WARNING in C:\Users\jenkins\workspace\Lucene-Solr-SOLR-13661-Windows\solr\core\src\java\org\apache\solr\util\FileUtils.java (at line 53)
[ecj-lint] FileChannel out = new FileOutputStream(destination).getChannel()) {
[ecj-lint] ^^^^^^^^^^^^^^^^^^^^^^^^^^^^^^^^^
[ecj-lint] Resource leak: '<unassigned Closeable value>' is never closed
[ecj-lint] ----------
[ecj-lint] ----------
[ecj-lint] 35. WARNING in C:\Users\jenkins\workspace\Lucene-Solr-SOLR-13661-Windows\solr\core\src\java\org\apache\solr\util\SolrCLI.java (at line 1142)
[ecj-lint] SnapshotCloudManager snapshotCloudManager = new SnapshotCloudManager(simCloudManager, config);
[ecj-lint] ^^^^^^^^^^^^^^^^^^^^
[ecj-lint] Resource leak: 'snapshotCloudManager' is never closed
[ecj-lint] ----------
[ecj-lint] ----------
[ecj-lint] 36. WARNING in C:\Users\jenkins\workspace\Lucene-Solr-SOLR-13661-Windows\solr\core\src\java\org\apache\solr\util\TestInjection.java (at line 265)
[ecj-lint] timers.remove(this);
[ecj-lint] ^^^^
[ecj-lint] Unlikely argument type new TimerTask(){} for remove(Object) on a Collection<Timer>
[ecj-lint] ----------
[ecj-lint] 36 problems (10 errors, 25 warnings, 1 info)
BUILD FAILED
C:\Users\jenkins\workspace\Lucene-Solr-SOLR-13661-Windows\build.xml:634: The following error occurred while executing this line:
C:\Users\jenkins\workspace\Lucene-Solr-SOLR-13661-Windows\build.xml:101: The following error occurred while executing this line:
C:\Users\jenkins\workspace\Lucene-Solr-SOLR-13661-Windows\solr\build.xml:645: The following error occurred while executing this line:
C:\Users\jenkins\workspace\Lucene-Solr-SOLR-13661-Windows\lucene\common-build.xml:2027: The following error occurred while executing this line:
C:\Users\jenkins\workspace\Lucene-Solr-SOLR-13661-Windows\lucene\common-build.xml:2066: Compile failed; see the compiler error output for details.
Total time: 149 minutes 13 seconds
Build step 'Invoke Ant' marked build as failure
Archiving artifacts
Setting ANT_1_8_2_HOME=C:\Users\jenkins\tools\hudson.tasks.Ant_AntInstallation\ANT_1.8.2
[WARNINGS] Skipping publisher since build result is FAILURE
Recording test results
Setting ANT_1_8_2_HOME=C:\Users\jenkins\tools\hudson.tasks.Ant_AntInstallation\ANT_1.8.2
Email was triggered for: Failure - Any
Sending email for trigger: Failure - Any
Setting ANT_1_8_2_HOME=C:\Users\jenkins\tools\hudson.tasks.Ant_AntInstallation\ANT_1.8.2
Setting ANT_1_8_2_HOME=C:\Users\jenkins\tools\hudson.tasks.Ant_AntInstallation\ANT_1.8.2
Setting ANT_1_8_2_HOME=C:\Users\jenkins\tools\hudson.tasks.Ant_AntInstallation\ANT_1.8.2
Setting ANT_1_8_2_HOME=C:\Users\jenkins\tools\hudson.tasks.Ant_AntInstallation\ANT_1.8.2
Setting ANT_1_8_2_HOME=C:\Users\jenkins\tools\hudson.tasks.Ant_AntInstallation\ANT_1.8.2
Setting ANT_1_8_2_HOME=C:\Users\jenkins\tools\hudson.tasks.Ant_AntInstallation\ANT_1.8.2