You are viewing a plain text version of this content. The canonical link for it is here.
Posted to dev@lucene.apache.org by Policeman Jenkins Server <je...@thetaphi.de> on 2017/04/13 02:29:22 UTC
[JENKINS] Lucene-Solr-6.x-Solaris (64bit/jdk1.8.0) - Build # 785 -
Unstable!
Build: https://jenkins.thetaphi.de/job/Lucene-Solr-6.x-Solaris/785/
Java: 64bit/jdk1.8.0 -XX:-UseCompressedOops -XX:+UseG1GC
1 tests failed.
FAILED: org.apache.solr.cloud.ShardSplitTest.testSplitWithChaosMonkey
Error Message:
There are still nodes recoverying - waited for 330 seconds
Stack Trace:
java.lang.AssertionError: There are still nodes recoverying - waited for 330 seconds
at __randomizedtesting.SeedInfo.seed([F66B59B6E2C1936E:7D4C8A67A3C738EA]:0)
at org.junit.Assert.fail(Assert.java:93)
at org.apache.solr.cloud.AbstractDistribZkTestBase.waitForRecoveriesToFinish(AbstractDistribZkTestBase.java:187)
at org.apache.solr.cloud.AbstractDistribZkTestBase.waitForRecoveriesToFinish(AbstractDistribZkTestBase.java:144)
at org.apache.solr.cloud.AbstractDistribZkTestBase.waitForRecoveriesToFinish(AbstractDistribZkTestBase.java:139)
at org.apache.solr.cloud.AbstractFullDistribZkTestBase.waitForRecoveriesToFinish(AbstractFullDistribZkTestBase.java:865)
at org.apache.solr.cloud.ShardSplitTest.testSplitWithChaosMonkey(ShardSplitTest.java:437)
at sun.reflect.NativeMethodAccessorImpl.invoke0(Native Method)
at sun.reflect.NativeMethodAccessorImpl.invoke(NativeMethodAccessorImpl.java:62)
at sun.reflect.DelegatingMethodAccessorImpl.invoke(DelegatingMethodAccessorImpl.java:43)
at java.lang.reflect.Method.invoke(Method.java:498)
at com.carrotsearch.randomizedtesting.RandomizedRunner.invoke(RandomizedRunner.java:1713)
at com.carrotsearch.randomizedtesting.RandomizedRunner$8.evaluate(RandomizedRunner.java:907)
at com.carrotsearch.randomizedtesting.RandomizedRunner$9.evaluate(RandomizedRunner.java:943)
at com.carrotsearch.randomizedtesting.RandomizedRunner$10.evaluate(RandomizedRunner.java:957)
at org.apache.solr.BaseDistributedSearchTestCase$ShardsRepeatRule$ShardsFixedStatement.callStatement(BaseDistributedSearchTestCase.java:992)
at org.apache.solr.BaseDistributedSearchTestCase$ShardsRepeatRule$ShardsStatement.evaluate(BaseDistributedSearchTestCase.java:967)
at com.carrotsearch.randomizedtesting.rules.SystemPropertiesRestoreRule$1.evaluate(SystemPropertiesRestoreRule.java:57)
at org.apache.lucene.util.TestRuleSetupTeardownChained$1.evaluate(TestRuleSetupTeardownChained.java:49)
at org.apache.lucene.util.AbstractBeforeAfterRule$1.evaluate(AbstractBeforeAfterRule.java:45)
at org.apache.lucene.util.TestRuleThreadAndTestName$1.evaluate(TestRuleThreadAndTestName.java:48)
at org.apache.lucene.util.TestRuleIgnoreAfterMaxFailures$1.evaluate(TestRuleIgnoreAfterMaxFailures.java:64)
at org.apache.lucene.util.TestRuleMarkFailure$1.evaluate(TestRuleMarkFailure.java:47)
at com.carrotsearch.randomizedtesting.rules.StatementAdapter.evaluate(StatementAdapter.java:36)
at com.carrotsearch.randomizedtesting.ThreadLeakControl$StatementRunner.run(ThreadLeakControl.java:368)
at com.carrotsearch.randomizedtesting.ThreadLeakControl.forkTimeoutingTask(ThreadLeakControl.java:817)
at com.carrotsearch.randomizedtesting.ThreadLeakControl$3.evaluate(ThreadLeakControl.java:468)
at com.carrotsearch.randomizedtesting.RandomizedRunner.runSingleTest(RandomizedRunner.java:916)
at com.carrotsearch.randomizedtesting.RandomizedRunner$5.evaluate(RandomizedRunner.java:802)
at com.carrotsearch.randomizedtesting.RandomizedRunner$6.evaluate(RandomizedRunner.java:852)
at com.carrotsearch.randomizedtesting.RandomizedRunner$7.evaluate(RandomizedRunner.java:863)
at com.carrotsearch.randomizedtesting.rules.StatementAdapter.evaluate(StatementAdapter.java:36)
at com.carrotsearch.randomizedtesting.rules.SystemPropertiesRestoreRule$1.evaluate(SystemPropertiesRestoreRule.java:57)
at org.apache.lucene.util.AbstractBeforeAfterRule$1.evaluate(AbstractBeforeAfterRule.java:45)
at com.carrotsearch.randomizedtesting.rules.StatementAdapter.evaluate(StatementAdapter.java:36)
at org.apache.lucene.util.TestRuleStoreClassName$1.evaluate(TestRuleStoreClassName.java:41)
at com.carrotsearch.randomizedtesting.rules.NoShadowingOrOverridesOnMethodsRule$1.evaluate(NoShadowingOrOverridesOnMethodsRule.java:40)
at com.carrotsearch.randomizedtesting.rules.NoShadowingOrOverridesOnMethodsRule$1.evaluate(NoShadowingOrOverridesOnMethodsRule.java:40)
at com.carrotsearch.randomizedtesting.rules.StatementAdapter.evaluate(StatementAdapter.java:36)
at com.carrotsearch.randomizedtesting.rules.StatementAdapter.evaluate(StatementAdapter.java:36)
at com.carrotsearch.randomizedtesting.rules.StatementAdapter.evaluate(StatementAdapter.java:36)
at org.apache.lucene.util.TestRuleAssertionsRequired$1.evaluate(TestRuleAssertionsRequired.java:53)
at org.apache.lucene.util.TestRuleMarkFailure$1.evaluate(TestRuleMarkFailure.java:47)
at org.apache.lucene.util.TestRuleIgnoreAfterMaxFailures$1.evaluate(TestRuleIgnoreAfterMaxFailures.java:64)
at org.apache.lucene.util.TestRuleIgnoreTestSuites$1.evaluate(TestRuleIgnoreTestSuites.java:54)
at com.carrotsearch.randomizedtesting.rules.StatementAdapter.evaluate(StatementAdapter.java:36)
at com.carrotsearch.randomizedtesting.ThreadLeakControl$StatementRunner.run(ThreadLeakControl.java:368)
at java.lang.Thread.run(Thread.java:745)
Build Log:
[...truncated 11393 lines...]
[junit4] Suite: org.apache.solr.cloud.ShardSplitTest
[junit4] 2> Creating dataDir: /export/home/jenkins/workspace/Lucene-Solr-6.x-Solaris/solr/build/solr-core/test/J1/temp/solr.cloud.ShardSplitTest_F66B59B6E2C1936E-001/init-core-data-001
[junit4] 2> 159421 WARN (SUITE-ShardSplitTest-seed#[F66B59B6E2C1936E]-worker) [ ] o.a.s.SolrTestCaseJ4 startTrackingSearchers: numOpens=1 numCloses=1
[junit4] 2> 159421 INFO (SUITE-ShardSplitTest-seed#[F66B59B6E2C1936E]-worker) [ ] o.a.s.SolrTestCaseJ4 Using TrieFields
[junit4] 2> 159423 INFO (SUITE-ShardSplitTest-seed#[F66B59B6E2C1936E]-worker) [ ] o.a.s.SolrTestCaseJ4 Randomized ssl (false) and clientAuth (false) via: @org.apache.solr.SolrTestCaseJ4$SuppressSSL(bugUrl=https://issues.apache.org/jira/browse/SOLR-5776)
[junit4] 2> 159423 INFO (SUITE-ShardSplitTest-seed#[F66B59B6E2C1936E]-worker) [ ] o.a.s.BaseDistributedSearchTestCase Setting hostContext system property: /
[junit4] 2> 159426 INFO (TEST-ShardSplitTest.testSplitWithChaosMonkey-seed#[F66B59B6E2C1936E]) [ ] o.a.s.c.ZkTestServer STARTING ZK TEST SERVER
[junit4] 2> 159427 INFO (Thread-418) [ ] o.a.s.c.ZkTestServer client port:0.0.0.0/0.0.0.0:0
[junit4] 2> 159427 INFO (Thread-418) [ ] o.a.s.c.ZkTestServer Starting server
[junit4] 2> 159532 INFO (TEST-ShardSplitTest.testSplitWithChaosMonkey-seed#[F66B59B6E2C1936E]) [ ] o.a.s.c.ZkTestServer start zk server on port:48321
[junit4] 2> 159592 INFO (TEST-ShardSplitTest.testSplitWithChaosMonkey-seed#[F66B59B6E2C1936E]) [ ] o.a.s.c.AbstractZkTestCase put /export/home/jenkins/workspace/Lucene-Solr-6.x-Solaris/solr/core/src/test-files/solr/collection1/conf/solrconfig-tlog.xml to /configs/conf1/solrconfig.xml
[junit4] 2> 159595 INFO (TEST-ShardSplitTest.testSplitWithChaosMonkey-seed#[F66B59B6E2C1936E]) [ ] o.a.s.c.AbstractZkTestCase put /export/home/jenkins/workspace/Lucene-Solr-6.x-Solaris/solr/core/src/test-files/solr/collection1/conf/schema15.xml to /configs/conf1/schema.xml
[junit4] 2> 159598 INFO (TEST-ShardSplitTest.testSplitWithChaosMonkey-seed#[F66B59B6E2C1936E]) [ ] o.a.s.c.AbstractZkTestCase put /export/home/jenkins/workspace/Lucene-Solr-6.x-Solaris/solr/core/src/test-files/solr/collection1/conf/solrconfig.snippet.randomindexconfig.xml to /configs/conf1/solrconfig.snippet.randomindexconfig.xml
[junit4] 2> 159601 INFO (TEST-ShardSplitTest.testSplitWithChaosMonkey-seed#[F66B59B6E2C1936E]) [ ] o.a.s.c.AbstractZkTestCase put /export/home/jenkins/workspace/Lucene-Solr-6.x-Solaris/solr/core/src/test-files/solr/collection1/conf/stopwords.txt to /configs/conf1/stopwords.txt
[junit4] 2> 159605 INFO (TEST-ShardSplitTest.testSplitWithChaosMonkey-seed#[F66B59B6E2C1936E]) [ ] o.a.s.c.AbstractZkTestCase put /export/home/jenkins/workspace/Lucene-Solr-6.x-Solaris/solr/core/src/test-files/solr/collection1/conf/protwords.txt to /configs/conf1/protwords.txt
[junit4] 2> 159608 INFO (TEST-ShardSplitTest.testSplitWithChaosMonkey-seed#[F66B59B6E2C1936E]) [ ] o.a.s.c.AbstractZkTestCase put /export/home/jenkins/workspace/Lucene-Solr-6.x-Solaris/solr/core/src/test-files/solr/collection1/conf/currency.xml to /configs/conf1/currency.xml
[junit4] 2> 159611 INFO (TEST-ShardSplitTest.testSplitWithChaosMonkey-seed#[F66B59B6E2C1936E]) [ ] o.a.s.c.AbstractZkTestCase put /export/home/jenkins/workspace/Lucene-Solr-6.x-Solaris/solr/core/src/test-files/solr/collection1/conf/enumsConfig.xml to /configs/conf1/enumsConfig.xml
[junit4] 2> 159613 INFO (TEST-ShardSplitTest.testSplitWithChaosMonkey-seed#[F66B59B6E2C1936E]) [ ] o.a.s.c.AbstractZkTestCase put /export/home/jenkins/workspace/Lucene-Solr-6.x-Solaris/solr/core/src/test-files/solr/collection1/conf/open-exchange-rates.json to /configs/conf1/open-exchange-rates.json
[junit4] 2> 159615 INFO (TEST-ShardSplitTest.testSplitWithChaosMonkey-seed#[F66B59B6E2C1936E]) [ ] o.a.s.c.AbstractZkTestCase put /export/home/jenkins/workspace/Lucene-Solr-6.x-Solaris/solr/core/src/test-files/solr/collection1/conf/mapping-ISOLatin1Accent.txt to /configs/conf1/mapping-ISOLatin1Accent.txt
[junit4] 2> 159616 INFO (TEST-ShardSplitTest.testSplitWithChaosMonkey-seed#[F66B59B6E2C1936E]) [ ] o.a.s.c.AbstractZkTestCase put /export/home/jenkins/workspace/Lucene-Solr-6.x-Solaris/solr/core/src/test-files/solr/collection1/conf/old_synonyms.txt to /configs/conf1/old_synonyms.txt
[junit4] 2> 159618 INFO (TEST-ShardSplitTest.testSplitWithChaosMonkey-seed#[F66B59B6E2C1936E]) [ ] o.a.s.c.AbstractZkTestCase put /export/home/jenkins/workspace/Lucene-Solr-6.x-Solaris/solr/core/src/test-files/solr/collection1/conf/synonyms.txt to /configs/conf1/synonyms.txt
[junit4] 2> 160044 INFO (TEST-ShardSplitTest.testSplitWithChaosMonkey-seed#[F66B59B6E2C1936E]) [ ] o.a.s.SolrTestCaseJ4 Writing core.properties file to /export/home/jenkins/workspace/Lucene-Solr-6.x-Solaris/solr/build/solr-core/test/J1/temp/solr.cloud.ShardSplitTest_F66B59B6E2C1936E-001/control-001/cores/collection1
[junit4] 2> 160046 INFO (TEST-ShardSplitTest.testSplitWithChaosMonkey-seed#[F66B59B6E2C1936E]) [ ] o.e.j.s.Server jetty-9.3.14.v20161028
[junit4] 2> 160049 INFO (TEST-ShardSplitTest.testSplitWithChaosMonkey-seed#[F66B59B6E2C1936E]) [ ] o.e.j.s.h.ContextHandler Started o.e.j.s.ServletContextHandler@43020a4b{/,null,AVAILABLE}
[junit4] 2> 160055 INFO (TEST-ShardSplitTest.testSplitWithChaosMonkey-seed#[F66B59B6E2C1936E]) [ ] o.e.j.s.AbstractConnector Started ServerConnector@47168b9{HTTP/1.1,[http/1.1]}{127.0.0.1:65139}
[junit4] 2> 160056 INFO (TEST-ShardSplitTest.testSplitWithChaosMonkey-seed#[F66B59B6E2C1936E]) [ ] o.e.j.s.Server Started @162897ms
[junit4] 2> 160056 INFO (TEST-ShardSplitTest.testSplitWithChaosMonkey-seed#[F66B59B6E2C1936E]) [ ] o.a.s.c.s.e.JettySolrRunner Jetty properties: {solr.data.dir=/export/home/jenkins/workspace/Lucene-Solr-6.x-Solaris/solr/build/solr-core/test/J1/temp/solr.cloud.ShardSplitTest_F66B59B6E2C1936E-001/tempDir-001/control/data, hostContext=/, hostPort=65139, coreRootDirectory=/export/home/jenkins/workspace/Lucene-Solr-6.x-Solaris/solr/build/solr-core/test/J1/../../../../../../../../../../export/home/jenkins/workspace/Lucene-Solr-6.x-Solaris/solr/build/solr-core/test/J1/temp/solr.cloud.ShardSplitTest_F66B59B6E2C1936E-001/control-001/cores}
[junit4] 2> 160056 ERROR (TEST-ShardSplitTest.testSplitWithChaosMonkey-seed#[F66B59B6E2C1936E]) [ ] o.a.s.s.StartupLoggingUtils Missing Java Option solr.log.dir. Logging may be missing or incomplete.
[junit4] 2> 160056 INFO (TEST-ShardSplitTest.testSplitWithChaosMonkey-seed#[F66B59B6E2C1936E]) [ ] o.a.s.s.SolrDispatchFilter ___ _ Welcome to Apache Solr™ version 6.6.0
[junit4] 2> 160056 INFO (TEST-ShardSplitTest.testSplitWithChaosMonkey-seed#[F66B59B6E2C1936E]) [ ] o.a.s.s.SolrDispatchFilter / __| ___| |_ _ Starting in cloud mode on port null
[junit4] 2> 160056 INFO (TEST-ShardSplitTest.testSplitWithChaosMonkey-seed#[F66B59B6E2C1936E]) [ ] o.a.s.s.SolrDispatchFilter \__ \/ _ \ | '_| Install dir: null
[junit4] 2> 160056 INFO (TEST-ShardSplitTest.testSplitWithChaosMonkey-seed#[F66B59B6E2C1936E]) [ ] o.a.s.s.SolrDispatchFilter |___/\___/_|_| Start time: 2017-04-13T01:21:23.023Z
[junit4] 2> 160093 INFO (TEST-ShardSplitTest.testSplitWithChaosMonkey-seed#[F66B59B6E2C1936E]) [ ] o.a.s.s.SolrDispatchFilter Loading solr.xml from SolrHome (not found in ZooKeeper)
[junit4] 2> 160097 INFO (TEST-ShardSplitTest.testSplitWithChaosMonkey-seed#[F66B59B6E2C1936E]) [ ] o.a.s.c.SolrXmlConfig Loading container configuration from /export/home/jenkins/workspace/Lucene-Solr-6.x-Solaris/solr/build/solr-core/test/J1/temp/solr.cloud.ShardSplitTest_F66B59B6E2C1936E-001/control-001/solr.xml
[junit4] 2> 160114 INFO (TEST-ShardSplitTest.testSplitWithChaosMonkey-seed#[F66B59B6E2C1936E]) [ ] o.a.s.u.UpdateShardHandler Creating UpdateShardHandler HTTP client with params: socketTimeout=340000&connTimeout=45000&retry=true
[junit4] 2> 160115 INFO (TEST-ShardSplitTest.testSplitWithChaosMonkey-seed#[F66B59B6E2C1936E]) [ ] o.a.s.c.ZkContainer Zookeeper client=127.0.0.1:48321/solr
[junit4] 2> 160283 INFO (TEST-ShardSplitTest.testSplitWithChaosMonkey-seed#[F66B59B6E2C1936E]) [n:127.0.0.1:65139_ ] o.a.s.c.Overseer Overseer (id=null) closing
[junit4] 2> 160298 INFO (TEST-ShardSplitTest.testSplitWithChaosMonkey-seed#[F66B59B6E2C1936E]) [n:127.0.0.1:65139_ ] o.a.s.c.OverseerElectionContext I am going to be the leader 127.0.0.1:65139_
[junit4] 2> 160306 INFO (TEST-ShardSplitTest.testSplitWithChaosMonkey-seed#[F66B59B6E2C1936E]) [n:127.0.0.1:65139_ ] o.a.s.c.Overseer Overseer (id=97782758270369796-127.0.0.1:65139_-n_0000000000) starting
[junit4] 2> 160333 INFO (TEST-ShardSplitTest.testSplitWithChaosMonkey-seed#[F66B59B6E2C1936E]) [n:127.0.0.1:65139_ ] o.a.s.c.ZkController Register node as live in ZooKeeper:/live_nodes/127.0.0.1:65139_
[junit4] 2> 160355 INFO (OverseerStateUpdate-97782758270369796-127.0.0.1:65139_-n_0000000000) [n:127.0.0.1:65139_ ] o.a.s.c.c.ZkStateReader Updated live nodes from ZooKeeper... (0) -> (1)
[junit4] 2> 160975 INFO (TEST-ShardSplitTest.testSplitWithChaosMonkey-seed#[F66B59B6E2C1936E]) [n:127.0.0.1:65139_ ] o.a.s.c.CorePropertiesLocator Found 1 core definitions underneath /export/home/jenkins/workspace/Lucene-Solr-6.x-Solaris/solr/build/solr-core/test/J1/../../../../../../../../../../export/home/jenkins/workspace/Lucene-Solr-6.x-Solaris/solr/build/solr-core/test/J1/temp/solr.cloud.ShardSplitTest_F66B59B6E2C1936E-001/control-001/cores
[junit4] 2> 160975 INFO (TEST-ShardSplitTest.testSplitWithChaosMonkey-seed#[F66B59B6E2C1936E]) [n:127.0.0.1:65139_ ] o.a.s.c.CorePropertiesLocator Cores are: [collection1]
[junit4] 2> 161117 INFO (coreLoadExecutor-1365-thread-1-processing-n:127.0.0.1:65139_) [n:127.0.0.1:65139_ c:control_collection x:collection1] o.a.s.c.TransientSolrCoreCacheDefault Allocating transient cache for 4 transient cores
[junit4] 2> 161124 INFO (OverseerStateUpdate-97782758270369796-127.0.0.1:65139_-n_0000000000) [n:127.0.0.1:65139_ ] o.a.s.c.o.ReplicaMutator Assigning new node to shard shard=shard1
[junit4] 2> 161228 WARN (coreLoadExecutor-1365-thread-1-processing-n:127.0.0.1:65139_) [n:127.0.0.1:65139_ c:control_collection x:collection1] o.a.s.c.Config Beginning with Solr 5.5, <mergePolicy> is deprecated, use <mergePolicyFactory> instead.
[junit4] 2> 161228 INFO (coreLoadExecutor-1365-thread-1-processing-n:127.0.0.1:65139_) [n:127.0.0.1:65139_ c:control_collection x:collection1] o.a.s.c.SolrConfig Using Lucene MatchVersion: 6.6.0
[junit4] 2> 161244 INFO (coreLoadExecutor-1365-thread-1-processing-n:127.0.0.1:65139_) [n:127.0.0.1:65139_ c:control_collection x:collection1] o.a.s.s.IndexSchema [collection1] Schema name=test
[junit4] 2> 161321 WARN (coreLoadExecutor-1365-thread-1-processing-n:127.0.0.1:65139_) [n:127.0.0.1:65139_ c:control_collection x:collection1] o.a.s.s.IndexSchema [collection1] default search field in schema is text. WARNING: Deprecated, please use 'df' on request instead.
[junit4] 2> 161322 INFO (coreLoadExecutor-1365-thread-1-processing-n:127.0.0.1:65139_) [n:127.0.0.1:65139_ c:control_collection x:collection1] o.a.s.s.IndexSchema Loaded schema test/1.6 with uniqueid field id
[junit4] 2> 161380 INFO (coreLoadExecutor-1365-thread-1-processing-n:127.0.0.1:65139_) [n:127.0.0.1:65139_ c:control_collection x:collection1] o.a.s.c.CoreContainer Creating SolrCore 'collection1' using configuration from collection control_collection, trusted=true
[junit4] 2> 161421 INFO (coreLoadExecutor-1365-thread-1-processing-n:127.0.0.1:65139_) [n:127.0.0.1:65139_ c:control_collection x:collection1] o.a.s.c.SolrCore solr.RecoveryStrategy.Builder
[junit4] 2> 161421 INFO (coreLoadExecutor-1365-thread-1-processing-n:127.0.0.1:65139_) [n:127.0.0.1:65139_ c:control_collection x:collection1] o.a.s.c.SolrCore [[collection1] ] Opening new SolrCore at [/export/home/jenkins/workspace/Lucene-Solr-6.x-Solaris/solr/build/solr-core/test/J1/temp/solr.cloud.ShardSplitTest_F66B59B6E2C1936E-001/control-001/cores/collection1], dataDir=[/export/home/jenkins/workspace/Lucene-Solr-6.x-Solaris/solr/build/solr-core/test/J1/../../../../../../../../../../export/home/jenkins/workspace/Lucene-Solr-6.x-Solaris/solr/build/solr-core/test/J1/temp/solr.cloud.ShardSplitTest_F66B59B6E2C1936E-001/control-001/cores/collection1/data/]
[junit4] 2> 161421 INFO (coreLoadExecutor-1365-thread-1-processing-n:127.0.0.1:65139_) [n:127.0.0.1:65139_ c:control_collection x:collection1] o.a.s.c.JmxMonitoredMap JMX monitoring is enabled. Adding Solr mbeans to JMX Server: com.sun.jmx.mbeanserver.JmxMBeanServer@5298713f
[junit4] 2> 161426 INFO (coreLoadExecutor-1365-thread-1-processing-n:127.0.0.1:65139_) [n:127.0.0.1:65139_ c:control_collection x:collection1] o.a.s.u.RandomMergePolicy RandomMergePolicy wrapping class org.apache.lucene.index.LogByteSizeMergePolicy: [LogByteSizeMergePolicy: minMergeSize=1677721, mergeFactor=18, maxMergeSize=2147483648, maxMergeSizeForForcedMerge=9223372036854775807, calibrateSizeByDeletes=false, maxMergeDocs=2147483647, maxCFSSegmentSizeMB=8.796093022207999E12, noCFSRatio=0.1741569011706913]
[junit4] 2> 161476 WARN (coreLoadExecutor-1365-thread-1-processing-n:127.0.0.1:65139_) [n:127.0.0.1:65139_ c:control_collection x:collection1] o.a.s.c.RequestHandlers INVALID paramSet a in requestHandler {type = requestHandler,name = /dump,class = DumpRequestHandler,attributes = {initParams=a, name=/dump, class=DumpRequestHandler},args = {defaults={a=A,b=B}}}
[junit4] 2> 161633 INFO (coreLoadExecutor-1365-thread-1-processing-n:127.0.0.1:65139_) [n:127.0.0.1:65139_ c:control_collection x:collection1] o.a.s.u.UpdateHandler Using UpdateLog implementation: org.apache.solr.update.UpdateLog
[junit4] 2> 161633 INFO (coreLoadExecutor-1365-thread-1-processing-n:127.0.0.1:65139_) [n:127.0.0.1:65139_ c:control_collection x:collection1] o.a.s.u.UpdateLog Initializing UpdateLog: dataDir= defaultSyncLevel=FLUSH numRecordsToKeep=100 maxNumLogsToKeep=10 numVersionBuckets=65536
[junit4] 2> 161676 INFO (coreLoadExecutor-1365-thread-1-processing-n:127.0.0.1:65139_) [n:127.0.0.1:65139_ c:control_collection x:collection1] o.a.s.u.CommitTracker Hard AutoCommit: disabled
[junit4] 2> 161676 INFO (coreLoadExecutor-1365-thread-1-processing-n:127.0.0.1:65139_) [n:127.0.0.1:65139_ c:control_collection x:collection1] o.a.s.u.CommitTracker Soft AutoCommit: disabled
[junit4] 2> 161677 INFO (coreLoadExecutor-1365-thread-1-processing-n:127.0.0.1:65139_) [n:127.0.0.1:65139_ c:control_collection x:collection1] o.a.s.u.RandomMergePolicy RandomMergePolicy wrapping class org.apache.lucene.index.TieredMergePolicy: [TieredMergePolicy: maxMergeAtOnce=49, maxMergeAtOnceExplicit=47, maxMergedSegmentMB=66.2197265625, floorSegmentMB=1.6015625, forceMergeDeletesPctAllowed=21.08031223556061, segmentsPerTier=19.0, maxCFSSegmentSizeMB=8.796093022207999E12, noCFSRatio=0.6362546164532266
[junit4] 2> 161678 INFO (coreLoadExecutor-1365-thread-1-processing-n:127.0.0.1:65139_) [n:127.0.0.1:65139_ c:control_collection x:collection1] o.a.s.s.SolrIndexSearcher Opening [Searcher@4dd24dc3[collection1] main]
[junit4] 2> 161688 INFO (coreLoadExecutor-1365-thread-1-processing-n:127.0.0.1:65139_) [n:127.0.0.1:65139_ c:control_collection x:collection1] o.a.s.r.ManagedResourceStorage Configured ZooKeeperStorageIO with znodeBase: /configs/conf1
[junit4] 2> 161689 INFO (coreLoadExecutor-1365-thread-1-processing-n:127.0.0.1:65139_) [n:127.0.0.1:65139_ c:control_collection x:collection1] o.a.s.r.ManagedResourceStorage Loaded null at path _rest_managed.json using ZooKeeperStorageIO:path=/configs/conf1
[junit4] 2> 161701 INFO (coreLoadExecutor-1365-thread-1-processing-n:127.0.0.1:65139_) [n:127.0.0.1:65139_ c:control_collection x:collection1] o.a.s.h.ReplicationHandler Commits will be reserved for 10000
[junit4] 2> 161704 INFO (coreLoadExecutor-1365-thread-1-processing-n:127.0.0.1:65139_) [n:127.0.0.1:65139_ c:control_collection x:collection1] o.a.s.u.UpdateLog Could not find max version in index or recent updates, using new clock 1564524134710378496
[junit4] 2> 161720 INFO (coreZkRegister-1358-thread-1-processing-n:127.0.0.1:65139_ x:collection1 c:control_collection) [n:127.0.0.1:65139_ c:control_collection s:shard1 r:core_node1 x:collection1] o.a.s.c.ShardLeaderElectionContext Enough replicas found to continue.
[junit4] 2> 161720 INFO (coreZkRegister-1358-thread-1-processing-n:127.0.0.1:65139_ x:collection1 c:control_collection) [n:127.0.0.1:65139_ c:control_collection s:shard1 r:core_node1 x:collection1] o.a.s.c.ShardLeaderElectionContext I may be the new leader - try and sync
[junit4] 2> 161720 INFO (coreZkRegister-1358-thread-1-processing-n:127.0.0.1:65139_ x:collection1 c:control_collection) [n:127.0.0.1:65139_ c:control_collection s:shard1 r:core_node1 x:collection1] o.a.s.c.SyncStrategy Sync replicas to http://127.0.0.1:65139/collection1/
[junit4] 2> 161720 INFO (coreZkRegister-1358-thread-1-processing-n:127.0.0.1:65139_ x:collection1 c:control_collection) [n:127.0.0.1:65139_ c:control_collection s:shard1 r:core_node1 x:collection1] o.a.s.c.SyncStrategy Sync Success - now sync replicas to me
[junit4] 2> 161720 INFO (coreZkRegister-1358-thread-1-processing-n:127.0.0.1:65139_ x:collection1 c:control_collection) [n:127.0.0.1:65139_ c:control_collection s:shard1 r:core_node1 x:collection1] o.a.s.c.SyncStrategy http://127.0.0.1:65139/collection1/ has no replicas
[junit4] 2> 161720 INFO (coreZkRegister-1358-thread-1-processing-n:127.0.0.1:65139_ x:collection1 c:control_collection) [n:127.0.0.1:65139_ c:control_collection s:shard1 r:core_node1 x:collection1] o.a.s.c.ShardLeaderElectionContext Found all replicas participating in election, clear LIR
[junit4] 2> 161726 INFO (coreZkRegister-1358-thread-1-processing-n:127.0.0.1:65139_ x:collection1 c:control_collection) [n:127.0.0.1:65139_ c:control_collection s:shard1 r:core_node1 x:collection1] o.a.s.c.ShardLeaderElectionContext I am the new leader: http://127.0.0.1:65139/collection1/ shard1
[junit4] 2> 161779 INFO (searcherExecutor-1366-thread-1-processing-n:127.0.0.1:65139_ x:collection1 c:control_collection) [n:127.0.0.1:65139_ c:control_collection x:collection1] o.a.s.c.SolrCore [collection1] Registered new searcher Searcher@4dd24dc3[collection1] main{ExitableDirectoryReader(UninvertingDirectoryReader())}
[junit4] 2> 161981 INFO (coreZkRegister-1358-thread-1-processing-n:127.0.0.1:65139_ x:collection1 c:control_collection) [n:127.0.0.1:65139_ c:control_collection s:shard1 r:core_node1 x:collection1] o.a.s.c.ZkController I am the leader, no recovery necessary
[junit4] 2> 162205 INFO (TEST-ShardSplitTest.testSplitWithChaosMonkey-seed#[F66B59B6E2C1936E]) [ ] o.a.s.c.c.ZkStateReader Updated live nodes from ZooKeeper... (0) -> (1)
[junit4] 2> 162207 INFO (TEST-ShardSplitTest.testSplitWithChaosMonkey-seed#[F66B59B6E2C1936E]) [ ] o.a.s.c.s.i.ZkClientClusterStateProvider Cluster at 127.0.0.1:48321/solr ready
[junit4] 2> 162207 INFO (TEST-ShardSplitTest.testSplitWithChaosMonkey-seed#[F66B59B6E2C1936E]) [ ] o.a.s.c.ChaosMonkey monkey: init - expire sessions:false cause connection loss:false
[junit4] 2> 162207 INFO (TEST-ShardSplitTest.testSplitWithChaosMonkey-seed#[F66B59B6E2C1936E]) [ ] o.a.s.c.AbstractFullDistribZkTestBase Creating collection1 with stateFormat=2
[junit4] 2> 162358 INFO (TEST-ShardSplitTest.testSplitWithChaosMonkey-seed#[F66B59B6E2C1936E]) [ ] o.a.s.SolrTestCaseJ4 Writing core.properties file to /export/home/jenkins/workspace/Lucene-Solr-6.x-Solaris/solr/build/solr-core/test/J1/temp/solr.cloud.ShardSplitTest_F66B59B6E2C1936E-001/shard-1-001/cores/collection1
[junit4] 2> 162359 INFO (TEST-ShardSplitTest.testSplitWithChaosMonkey-seed#[F66B59B6E2C1936E]) [ ] o.a.s.c.AbstractFullDistribZkTestBase create jetty 1 in directory /export/home/jenkins/workspace/Lucene-Solr-6.x-Solaris/solr/build/solr-core/test/J1/temp/solr.cloud.ShardSplitTest_F66B59B6E2C1936E-001/shard-1-001
[junit4] 2> 162359 INFO (TEST-ShardSplitTest.testSplitWithChaosMonkey-seed#[F66B59B6E2C1936E]) [ ] o.e.j.s.Server jetty-9.3.14.v20161028
[junit4] 2> 162361 INFO (TEST-ShardSplitTest.testSplitWithChaosMonkey-seed#[F66B59B6E2C1936E]) [ ] o.e.j.s.h.ContextHandler Started o.e.j.s.ServletContextHandler@75140678{/,null,AVAILABLE}
[junit4] 2> 162362 INFO (TEST-ShardSplitTest.testSplitWithChaosMonkey-seed#[F66B59B6E2C1936E]) [ ] o.e.j.s.AbstractConnector Started ServerConnector@709330e8{HTTP/1.1,[http/1.1]}{127.0.0.1:53486}
[junit4] 2> 162362 INFO (TEST-ShardSplitTest.testSplitWithChaosMonkey-seed#[F66B59B6E2C1936E]) [ ] o.e.j.s.Server Started @165204ms
[junit4] 2> 162362 INFO (TEST-ShardSplitTest.testSplitWithChaosMonkey-seed#[F66B59B6E2C1936E]) [ ] o.a.s.c.s.e.JettySolrRunner Jetty properties: {solr.data.dir=/export/home/jenkins/workspace/Lucene-Solr-6.x-Solaris/solr/build/solr-core/test/J1/temp/solr.cloud.ShardSplitTest_F66B59B6E2C1936E-001/tempDir-001/jetty1, solrconfig=solrconfig.xml, hostContext=/, hostPort=53486, coreRootDirectory=/export/home/jenkins/workspace/Lucene-Solr-6.x-Solaris/solr/build/solr-core/test/J1/temp/solr.cloud.ShardSplitTest_F66B59B6E2C1936E-001/shard-1-001/cores}
[junit4] 2> 162363 ERROR (TEST-ShardSplitTest.testSplitWithChaosMonkey-seed#[F66B59B6E2C1936E]) [ ] o.a.s.s.StartupLoggingUtils Missing Java Option solr.log.dir. Logging may be missing or incomplete.
[junit4] 2> 162363 INFO (TEST-ShardSplitTest.testSplitWithChaosMonkey-seed#[F66B59B6E2C1936E]) [ ] o.a.s.s.SolrDispatchFilter ___ _ Welcome to Apache Solr™ version 6.6.0
[junit4] 2> 162363 INFO (TEST-ShardSplitTest.testSplitWithChaosMonkey-seed#[F66B59B6E2C1936E]) [ ] o.a.s.s.SolrDispatchFilter / __| ___| |_ _ Starting in cloud mode on port null
[junit4] 2> 162363 INFO (TEST-ShardSplitTest.testSplitWithChaosMonkey-seed#[F66B59B6E2C1936E]) [ ] o.a.s.s.SolrDispatchFilter \__ \/ _ \ | '_| Install dir: null
[junit4] 2> 162363 INFO (TEST-ShardSplitTest.testSplitWithChaosMonkey-seed#[F66B59B6E2C1936E]) [ ] o.a.s.s.SolrDispatchFilter |___/\___/_|_| Start time: 2017-04-13T01:21:25.330Z
[junit4] 2> 162368 INFO (TEST-ShardSplitTest.testSplitWithChaosMonkey-seed#[F66B59B6E2C1936E]) [ ] o.a.s.s.SolrDispatchFilter Loading solr.xml from SolrHome (not found in ZooKeeper)
[junit4] 2> 162368 INFO (TEST-ShardSplitTest.testSplitWithChaosMonkey-seed#[F66B59B6E2C1936E]) [ ] o.a.s.c.SolrXmlConfig Loading container configuration from /export/home/jenkins/workspace/Lucene-Solr-6.x-Solaris/solr/build/solr-core/test/J1/temp/solr.cloud.ShardSplitTest_F66B59B6E2C1936E-001/shard-1-001/solr.xml
[junit4] 2> 162375 INFO (TEST-ShardSplitTest.testSplitWithChaosMonkey-seed#[F66B59B6E2C1936E]) [ ] o.a.s.u.UpdateShardHandler Creating UpdateShardHandler HTTP client with params: socketTimeout=340000&connTimeout=45000&retry=true
[junit4] 2> 162376 INFO (TEST-ShardSplitTest.testSplitWithChaosMonkey-seed#[F66B59B6E2C1936E]) [ ] o.a.s.c.ZkContainer Zookeeper client=127.0.0.1:48321/solr
[junit4] 2> 162392 INFO (TEST-ShardSplitTest.testSplitWithChaosMonkey-seed#[F66B59B6E2C1936E]) [n:127.0.0.1:53486_ ] o.a.s.c.c.ZkStateReader Updated live nodes from ZooKeeper... (0) -> (1)
[junit4] 2> 162396 INFO (TEST-ShardSplitTest.testSplitWithChaosMonkey-seed#[F66B59B6E2C1936E]) [n:127.0.0.1:53486_ ] o.a.s.c.Overseer Overseer (id=null) closing
[junit4] 2> 162399 INFO (TEST-ShardSplitTest.testSplitWithChaosMonkey-seed#[F66B59B6E2C1936E]) [n:127.0.0.1:53486_ ] o.a.s.c.ZkController Register node as live in ZooKeeper:/live_nodes/127.0.0.1:53486_
[junit4] 2> 162402 INFO (zkCallback-1324-thread-2-processing-n:127.0.0.1:65139_) [n:127.0.0.1:65139_ ] o.a.s.c.c.ZkStateReader Updated live nodes from ZooKeeper... (1) -> (2)
[junit4] 2> 162403 INFO (zkCallback-1328-thread-1) [ ] o.a.s.c.c.ZkStateReader Updated live nodes from ZooKeeper... (1) -> (2)
[junit4] 2> 162404 INFO (zkCallback-1334-thread-1-processing-n:127.0.0.1:53486_) [n:127.0.0.1:53486_ ] o.a.s.c.c.ZkStateReader Updated live nodes from ZooKeeper... (1) -> (2)
[junit4] 2> 162480 INFO (TEST-ShardSplitTest.testSplitWithChaosMonkey-seed#[F66B59B6E2C1936E]) [n:127.0.0.1:53486_ ] o.a.s.c.CorePropertiesLocator Found 1 core definitions underneath /export/home/jenkins/workspace/Lucene-Solr-6.x-Solaris/solr/build/solr-core/test/J1/temp/solr.cloud.ShardSplitTest_F66B59B6E2C1936E-001/shard-1-001/cores
[junit4] 2> 162480 INFO (TEST-ShardSplitTest.testSplitWithChaosMonkey-seed#[F66B59B6E2C1936E]) [n:127.0.0.1:53486_ ] o.a.s.c.CorePropertiesLocator Cores are: [collection1]
[junit4] 2> 162481 INFO (coreLoadExecutor-1376-thread-1-processing-n:127.0.0.1:53486_) [n:127.0.0.1:53486_ c:collection1 x:collection1] o.a.s.c.TransientSolrCoreCacheDefault Allocating transient cache for 4 transient cores
[junit4] 2> 162483 INFO (OverseerStateUpdate-97782758270369796-127.0.0.1:65139_-n_0000000000) [n:127.0.0.1:65139_ ] o.a.s.c.o.ReplicaMutator Assigning new node to shard shard=shard2
[junit4] 2> 162588 INFO (zkCallback-1334-thread-1-processing-n:127.0.0.1:53486_) [n:127.0.0.1:53486_ ] o.a.s.c.c.ZkStateReader A cluster state change: [WatchedEvent state:SyncConnected type:NodeDataChanged path:/collections/collection1/state.json] for collection [collection1] has occurred - updating... (live nodes size: [2])
[junit4] 2> 163501 WARN (coreLoadExecutor-1376-thread-1-processing-n:127.0.0.1:53486_) [n:127.0.0.1:53486_ c:collection1 x:collection1] o.a.s.c.Config Beginning with Solr 5.5, <mergePolicy> is deprecated, use <mergePolicyFactory> instead.
[junit4] 2> 163502 INFO (coreLoadExecutor-1376-thread-1-processing-n:127.0.0.1:53486_) [n:127.0.0.1:53486_ c:collection1 x:collection1] o.a.s.c.SolrConfig Using Lucene MatchVersion: 6.6.0
[junit4] 2> 163513 INFO (coreLoadExecutor-1376-thread-1-processing-n:127.0.0.1:53486_) [n:127.0.0.1:53486_ c:collection1 x:collection1] o.a.s.s.IndexSchema [collection1] Schema name=test
[junit4] 2> 163660 WARN (coreLoadExecutor-1376-thread-1-processing-n:127.0.0.1:53486_) [n:127.0.0.1:53486_ c:collection1 x:collection1] o.a.s.s.IndexSchema [collection1] default search field in schema is text. WARNING: Deprecated, please use 'df' on request instead.
[junit4] 2> 163661 INFO (coreLoadExecutor-1376-thread-1-processing-n:127.0.0.1:53486_) [n:127.0.0.1:53486_ c:collection1 x:collection1] o.a.s.s.IndexSchema Loaded schema test/1.6 with uniqueid field id
[junit4] 2> 163686 INFO (coreLoadExecutor-1376-thread-1-processing-n:127.0.0.1:53486_) [n:127.0.0.1:53486_ c:collection1 x:collection1] o.a.s.c.CoreContainer Creating SolrCore 'collection1' using configuration from collection collection1, trusted=true
[junit4] 2> 163687 INFO (coreLoadExecutor-1376-thread-1-processing-n:127.0.0.1:53486_) [n:127.0.0.1:53486_ c:collection1 x:collection1] o.a.s.c.SolrCore solr.RecoveryStrategy.Builder
[junit4] 2> 163687 INFO (coreLoadExecutor-1376-thread-1-processing-n:127.0.0.1:53486_) [n:127.0.0.1:53486_ c:collection1 x:collection1] o.a.s.c.SolrCore [[collection1] ] Opening new SolrCore at [/export/home/jenkins/workspace/Lucene-Solr-6.x-Solaris/solr/build/solr-core/test/J1/temp/solr.cloud.ShardSplitTest_F66B59B6E2C1936E-001/shard-1-001/cores/collection1], dataDir=[/export/home/jenkins/workspace/Lucene-Solr-6.x-Solaris/solr/build/solr-core/test/J1/temp/solr.cloud.ShardSplitTest_F66B59B6E2C1936E-001/shard-1-001/cores/collection1/data/]
[junit4] 2> 163687 INFO (coreLoadExecutor-1376-thread-1-processing-n:127.0.0.1:53486_) [n:127.0.0.1:53486_ c:collection1 x:collection1] o.a.s.c.JmxMonitoredMap JMX monitoring is enabled. Adding Solr mbeans to JMX Server: com.sun.jmx.mbeanserver.JmxMBeanServer@5298713f
[junit4] 2> 163689 INFO (coreLoadExecutor-1376-thread-1-processing-n:127.0.0.1:53486_) [n:127.0.0.1:53486_ c:collection1 x:collection1] o.a.s.u.RandomMergePolicy RandomMergePolicy wrapping class org.apache.lucene.index.LogByteSizeMergePolicy: [LogByteSizeMergePolicy: minMergeSize=1677721, mergeFactor=18, maxMergeSize=2147483648, maxMergeSizeForForcedMerge=9223372036854775807, calibrateSizeByDeletes=false, maxMergeDocs=2147483647, maxCFSSegmentSizeMB=8.796093022207999E12, noCFSRatio=0.1741569011706913]
[junit4] 2> 163696 WARN (coreLoadExecutor-1376-thread-1-processing-n:127.0.0.1:53486_) [n:127.0.0.1:53486_ c:collection1 x:collection1] o.a.s.c.RequestHandlers INVALID paramSet a in requestHandler {type = requestHandler,name = /dump,class = DumpRequestHandler,attributes = {initParams=a, name=/dump, class=DumpRequestHandler},args = {defaults={a=A,b=B}}}
[junit4] 2> 163744 INFO (coreLoadExecutor-1376-thread-1-processing-n:127.0.0.1:53486_) [n:127.0.0.1:53486_ c:collection1 x:collection1] o.a.s.u.UpdateHandler Using UpdateLog implementation: org.apache.solr.update.UpdateLog
[junit4] 2> 163744 INFO (coreLoadExecutor-1376-thread-1-processing-n:127.0.0.1:53486_) [n:127.0.0.1:53486_ c:collection1 x:collection1] o.a.s.u.UpdateLog Initializing UpdateLog: dataDir= defaultSyncLevel=FLUSH numRecordsToKeep=100 maxNumLogsToKeep=10 numVersionBuckets=65536
[junit4] 2> 163746 INFO (coreLoadExecutor-1376-thread-1-processing-n:127.0.0.1:53486_) [n:127.0.0.1:53486_ c:collection1 x:collection1] o.a.s.u.CommitTracker Hard AutoCommit: disabled
[junit4] 2> 163746 INFO (coreLoadExecutor-1376-thread-1-processing-n:127.0.0.1:53486_) [n:127.0.0.1:53486_ c:collection1 x:collection1] o.a.s.u.CommitTracker Soft AutoCommit: disabled
[junit4] 2> 163747 INFO (coreLoadExecutor-1376-thread-1-processing-n:127.0.0.1:53486_) [n:127.0.0.1:53486_ c:collection1 x:collection1] o.a.s.u.RandomMergePolicy RandomMergePolicy wrapping class org.apache.lucene.index.TieredMergePolicy: [TieredMergePolicy: maxMergeAtOnce=49, maxMergeAtOnceExplicit=47, maxMergedSegmentMB=66.2197265625, floorSegmentMB=1.6015625, forceMergeDeletesPctAllowed=21.08031223556061, segmentsPerTier=19.0, maxCFSSegmentSizeMB=8.796093022207999E12, noCFSRatio=0.6362546164532266
[junit4] 2> 163748 INFO (coreLoadExecutor-1376-thread-1-processing-n:127.0.0.1:53486_) [n:127.0.0.1:53486_ c:collection1 x:collection1] o.a.s.s.SolrIndexSearcher Opening [Searcher@5e006776[collection1] main]
[junit4] 2> 163750 INFO (coreLoadExecutor-1376-thread-1-processing-n:127.0.0.1:53486_) [n:127.0.0.1:53486_ c:collection1 x:collection1] o.a.s.r.ManagedResourceStorage Configured ZooKeeperStorageIO with znodeBase: /configs/conf1
[junit4] 2> 163751 INFO (coreLoadExecutor-1376-thread-1-processing-n:127.0.0.1:53486_) [n:127.0.0.1:53486_ c:collection1 x:collection1] o.a.s.r.ManagedResourceStorage Loaded null at path _rest_managed.json using ZooKeeperStorageIO:path=/configs/conf1
[junit4] 2> 163751 INFO (coreLoadExecutor-1376-thread-1-processing-n:127.0.0.1:53486_) [n:127.0.0.1:53486_ c:collection1 x:collection1] o.a.s.h.ReplicationHandler Commits will be reserved for 10000
[junit4] 2> 163753 INFO (searcherExecutor-1377-thread-1-processing-n:127.0.0.1:53486_ x:collection1 c:collection1) [n:127.0.0.1:53486_ c:collection1 x:collection1] o.a.s.c.SolrCore [collection1] Registered new searcher Searcher@5e006776[collection1] main{ExitableDirectoryReader(UninvertingDirectoryReader())}
[junit4] 2> 163753 INFO (coreLoadExecutor-1376-thread-1-processing-n:127.0.0.1:53486_) [n:127.0.0.1:53486_ c:collection1 x:collection1] o.a.s.u.UpdateLog Could not find max version in index or recent updates, using new clock 1564524136858910720
[junit4] 2> 163766 INFO (coreZkRegister-1371-thread-1-processing-n:127.0.0.1:53486_ x:collection1 c:collection1) [n:127.0.0.1:53486_ c:collection1 s:shard2 r:core_node1 x:collection1] o.a.s.c.ShardLeaderElectionContext Enough replicas found to continue.
[junit4] 2> 163766 INFO (coreZkRegister-1371-thread-1-processing-n:127.0.0.1:53486_ x:collection1 c:collection1) [n:127.0.0.1:53486_ c:collection1 s:shard2 r:core_node1 x:collection1] o.a.s.c.ShardLeaderElectionContext I may be the new leader - try and sync
[junit4] 2> 163766 INFO (coreZkRegister-1371-thread-1-processing-n:127.0.0.1:53486_ x:collection1 c:collection1) [n:127.0.0.1:53486_ c:collection1 s:shard2 r:core_node1 x:collection1] o.a.s.c.SyncStrategy Sync replicas to http://127.0.0.1:53486/collection1/
[junit4] 2> 163766 INFO (coreZkRegister-1371-thread-1-processing-n:127.0.0.1:53486_ x:collection1 c:collection1) [n:127.0.0.1:53486_ c:collection1 s:shard2 r:core_node1 x:collection1] o.a.s.c.SyncStrategy Sync Success - now sync replicas to me
[junit4] 2> 163766 INFO (coreZkRegister-1371-thread-1-processing-n:127.0.0.1:53486_ x:collection1 c:collection1) [n:127.0.0.1:53486_ c:collection1 s:shard2 r:core_node1 x:collection1] o.a.s.c.SyncStrategy http://127.0.0.1:53486/collection1/ has no replicas
[junit4] 2> 163766 INFO (coreZkRegister-1371-thread-1-processing-n:127.0.0.1:53486_ x:collection1 c:collection1) [n:127.0.0.1:53486_ c:collection1 s:shard2 r:core_node1 x:collection1] o.a.s.c.ShardLeaderElectionContext Found all replicas participating in election, clear LIR
[junit4] 2> 163774 INFO (coreZkRegister-1371-thread-1-processing-n:127.0.0.1:53486_ x:collection1 c:collection1) [n:127.0.0.1:53486_ c:collection1 s:shard2 r:core_node1 x:collection1] o.a.s.c.ShardLeaderElectionContext I am the new leader: http://127.0.0.1:53486/collection1/ shard2
[junit4] 2> 163879 INFO (zkCallback-1334-thread-1-processing-n:127.0.0.1:53486_) [n:127.0.0.1:53486_ ] o.a.s.c.c.ZkStateReader A cluster state change: [WatchedEvent state:SyncConnected type:NodeDataChanged path:/collections/collection1/state.json] for collection [collection1] has occurred - updating... (live nodes size: [2])
[junit4] 2> 163928 INFO (coreZkRegister-1371-thread-1-processing-n:127.0.0.1:53486_ x:collection1 c:collection1) [n:127.0.0.1:53486_ c:collection1 s:shard2 r:core_node1 x:collection1] o.a.s.c.ZkController I am the leader, no recovery necessary
[junit4] 2> 164035 INFO (zkCallback-1334-thread-1-processing-n:127.0.0.1:53486_) [n:127.0.0.1:53486_ ] o.a.s.c.c.ZkStateReader A cluster state change: [WatchedEvent state:SyncConnected type:NodeDataChanged path:/collections/collection1/state.json] for collection [collection1] has occurred - updating... (live nodes size: [2])
[junit4] 2> 164181 INFO (TEST-ShardSplitTest.testSplitWithChaosMonkey-seed#[F66B59B6E2C1936E]) [ ] o.a.s.SolrTestCaseJ4 Writing core.properties file to /export/home/jenkins/workspace/Lucene-Solr-6.x-Solaris/solr/build/solr-core/test/J1/temp/solr.cloud.ShardSplitTest_F66B59B6E2C1936E-001/shard-2-001/cores/collection1
[junit4] 2> 164182 INFO (TEST-ShardSplitTest.testSplitWithChaosMonkey-seed#[F66B59B6E2C1936E]) [ ] o.a.s.c.AbstractFullDistribZkTestBase create jetty 2 in directory /export/home/jenkins/workspace/Lucene-Solr-6.x-Solaris/solr/build/solr-core/test/J1/temp/solr.cloud.ShardSplitTest_F66B59B6E2C1936E-001/shard-2-001
[junit4] 2> 164183 INFO (TEST-ShardSplitTest.testSplitWithChaosMonkey-seed#[F66B59B6E2C1936E]) [ ] o.e.j.s.Server jetty-9.3.14.v20161028
[junit4] 2> 164184 INFO (TEST-ShardSplitTest.testSplitWithChaosMonkey-seed#[F66B59B6E2C1936E]) [ ] o.e.j.s.h.ContextHandler Started o.e.j.s.ServletContextHandler@68839ce6{/,null,AVAILABLE}
[junit4] 2> 164185 INFO (TEST-ShardSplitTest.testSplitWithChaosMonkey-seed#[F66B59B6E2C1936E]) [ ] o.e.j.s.AbstractConnector Started ServerConnector@43d5952a{HTTP/1.1,[http/1.1]}{127.0.0.1:42302}
[junit4] 2> 164185 INFO (TEST-ShardSplitTest.testSplitWithChaosMonkey-seed#[F66B59B6E2C1936E]) [ ] o.e.j.s.Server Started @167027ms
[junit4] 2> 164185 INFO (TEST-ShardSplitTest.testSplitWithChaosMonkey-seed#[F66B59B6E2C1936E]) [ ] o.a.s.c.s.e.JettySolrRunner Jetty properties: {solr.data.dir=/export/home/jenkins/workspace/Lucene-Solr-6.x-Solaris/solr/build/solr-core/test/J1/temp/solr.cloud.ShardSplitTest_F66B59B6E2C1936E-001/tempDir-001/jetty2, solrconfig=solrconfig.xml, hostContext=/, hostPort=42302, coreRootDirectory=/export/home/jenkins/workspace/Lucene-Solr-6.x-Solaris/solr/build/solr-core/test/J1/temp/solr.cloud.ShardSplitTest_F66B59B6E2C1936E-001/shard-2-001/cores}
[junit4] 2> 164185 ERROR (TEST-ShardSplitTest.testSplitWithChaosMonkey-seed#[F66B59B6E2C1936E]) [ ] o.a.s.s.StartupLoggingUtils Missing Java Option solr.log.dir. Logging may be missing or incomplete.
[junit4] 2> 164186 INFO (TEST-ShardSplitTest.testSplitWithChaosMonkey-seed#[F66B59B6E2C1936E]) [ ] o.a.s.s.SolrDispatchFilter ___ _ Welcome to Apache Solr™ version 6.6.0
[junit4] 2> 164186 INFO (TEST-ShardSplitTest.testSplitWithChaosMonkey-seed#[F66B59B6E2C1936E]) [ ] o.a.s.s.SolrDispatchFilter / __| ___| |_ _ Starting in cloud mode on port null
[junit4] 2> 164186 INFO (TEST-ShardSplitTest.testSplitWithChaosMonkey-seed#[F66B59B6E2C1936E]) [ ] o.a.s.s.SolrDispatchFilter \__ \/ _ \ | '_| Install dir: null
[junit4] 2> 164186 INFO (TEST-ShardSplitTest.testSplitWithChaosMonkey-seed#[F66B59B6E2C1936E]) [ ] o.a.s.s.SolrDispatchFilter |___/\___/_|_| Start time: 2017-04-13T01:21:27.153Z
[junit4] 2> 164191 INFO (TEST-ShardSplitTest.testSplitWithChaosMonkey-seed#[F66B59B6E2C1936E]) [ ] o.a.s.s.SolrDispatchFilter Loading solr.xml from SolrHome (not found in ZooKeeper)
[junit4] 2> 164191 INFO (TEST-ShardSplitTest.testSplitWithChaosMonkey-seed#[F66B59B6E2C1936E]) [ ] o.a.s.c.SolrXmlConfig Loading container configuration from /export/home/jenkins/workspace/Lucene-Solr-6.x-Solaris/solr/build/solr-core/test/J1/temp/solr.cloud.ShardSplitTest_F66B59B6E2C1936E-001/shard-2-001/solr.xml
[junit4] 2> 164197 INFO (TEST-ShardSplitTest.testSplitWithChaosMonkey-seed#[F66B59B6E2C1936E]) [ ] o.a.s.u.UpdateShardHandler Creating UpdateShardHandler HTTP client with params: socketTimeout=340000&connTimeout=45000&retry=true
[junit4] 2> 164198 INFO (TEST-ShardSplitTest.testSplitWithChaosMonkey-seed#[F66B59B6E2C1936E]) [ ] o.a.s.c.ZkContainer Zookeeper client=127.0.0.1:48321/solr
[junit4] 2> 164214 INFO (TEST-ShardSplitTest.testSplitWithChaosMonkey-seed#[F66B59B6E2C1936E]) [n:127.0.0.1:42302_ ] o.a.s.c.c.ZkStateReader Updated live nodes from ZooKeeper... (0) -> (2)
[junit4] 2> 164217 INFO (TEST-ShardSplitTest.testSplitWithChaosMonkey-seed#[F66B59B6E2C1936E]) [n:127.0.0.1:42302_ ] o.a.s.c.Overseer Overseer (id=null) closing
[junit4] 2> 164221 INFO (TEST-ShardSplitTest.testSplitWithChaosMonkey-seed#[F66B59B6E2C1936E]) [n:127.0.0.1:42302_ ] o.a.s.c.ZkController Register node as live in ZooKeeper:/live_nodes/127.0.0.1:42302_
[junit4] 2> 164224 INFO (zkCallback-1334-thread-1-processing-n:127.0.0.1:53486_) [n:127.0.0.1:53486_ ] o.a.s.c.c.ZkStateReader Updated live nodes from ZooKeeper... (2) -> (3)
[junit4] 2> 164224 INFO (zkCallback-1328-thread-1) [ ] o.a.s.c.c.ZkStateReader Updated live nodes from ZooKeeper... (2) -> (3)
[junit4] 2> 164224 INFO (zkCallback-1324-thread-3-processing-n:127.0.0.1:65139_) [n:127.0.0.1:65139_ ] o.a.s.c.c.ZkStateReader Updated live nodes from ZooKeeper... (2) -> (3)
[junit4] 2> 164225 INFO (zkCallback-1340-thread-1-processing-n:127.0.0.1:42302_) [n:127.0.0.1:42302_ ] o.a.s.c.c.ZkStateReader Updated live nodes from ZooKeeper... (2) -> (3)
[junit4] 2> 164306 INFO (TEST-ShardSplitTest.testSplitWithChaosMonkey-seed#[F66B59B6E2C1936E]) [n:127.0.0.1:42302_ ] o.a.s.c.CorePropertiesLocator Found 1 core definitions underneath /export/home/jenkins/workspace/Lucene-Solr-6.x-Solaris/solr/build/solr-core/test/J1/temp/solr.cloud.ShardSplitTest_F66B59B6E2C1936E-001/shard-2-001/cores
[junit4] 2> 164306 INFO (TEST-ShardSplitTest.testSplitWithChaosMonkey-seed#[F66B59B6E2C1936E]) [n:127.0.0.1:42302_ ] o.a.s.c.CorePropertiesLocator Cores are: [collection1]
[junit4] 2> 164308 INFO (coreLoadExecutor-1387-thread-1-processing-n:127.0.0.1:42302_) [n:127.0.0.1:42302_ c:collection1 x:collection1] o.a.s.c.TransientSolrCoreCacheDefault Allocating transient cache for 4 transient cores
[junit4] 2> 164310 INFO (OverseerStateUpdate-97782758270369796-127.0.0.1:65139_-n_0000000000) [n:127.0.0.1:65139_ ] o.a.s.c.o.ReplicaMutator Assigning new node to shard shard=shard1
[junit4] 2> 164413 INFO (zkCallback-1334-thread-1-processing-n:127.0.0.1:53486_) [n:127.0.0.1:53486_ ] o.a.s.c.c.ZkStateReader A cluster state change: [WatchedEvent state:SyncConnected type:NodeDataChanged path:/collections/collection1/state.json] for collection [collection1] has occurred - updating... (live nodes size: [3])
[junit4] 2> 164413 INFO (zkCallback-1340-thread-1-processing-n:127.0.0.1:42302_) [n:127.0.0.1:42302_ ] o.a.s.c.c.ZkStateReader A cluster state change: [WatchedEvent state:SyncConnected type:NodeDataChanged path:/collections/collection1/state.json] for collection [collection1] has occurred - updating... (live nodes size: [3])
[junit4] 2> 165329 WARN (coreLoadExecutor-1387-thread-1-processing-n:127.0.0.1:42302_) [n:127.0.0.1:42302_ c:collection1 x:collection1] o.a.s.c.Config Beginning with Solr 5.5, <mergePolicy> is deprecated, use <mergePolicyFactory> instead.
[junit4] 2> 165330 INFO (coreLoadExecutor-1387-thread-1-processing-n:127.0.0.1:42302_) [n:127.0.0.1:42302_ c:collection1 x:collection1] o.a.s.c.SolrConfig Using Lucene MatchVersion: 6.6.0
[junit4] 2> 165341 INFO (coreLoadExecutor-1387-thread-1-processing-n:127.0.0.1:42302_) [n:127.0.0.1:42302_ c:collection1 x:collection1] o.a.s.s.IndexSchema [collection1] Schema name=test
[junit4] 2> 165419 WARN (coreLoadExecutor-1387-thread-1-processing-n:127.0.0.1:42302_) [n:127.0.0.1:42302_ c:collection1 x:collection1] o.a.s.s.IndexSchema [collection1] default search field in schema is text. WARNING: Deprecated, please use 'df' on request instead.
[junit4] 2> 165419 INFO (coreLoadExecutor-1387-thread-1-processing-n:127.0.0.1:42302_) [n:127.0.0.1:42302_ c:collection1 x:collection1] o.a.s.s.IndexSchema Loaded schema test/1.6 with uniqueid field id
[junit4] 2> 165445 INFO (coreLoadExecutor-1387-thread-1-processing-n:127.0.0.1:42302_) [n:127.0.0.1:42302_ c:collection1 x:collection1] o.a.s.c.CoreContainer Creating SolrCore 'collection1' using configuration from collection collection1, trusted=true
[junit4] 2> 165445 INFO (coreLoadExecutor-1387-thread-1-processing-n:127.0.0.1:42302_) [n:127.0.0.1:42302_ c:collection1 x:collection1] o.a.s.c.SolrCore solr.RecoveryStrategy.Builder
[junit4] 2> 165445 INFO (coreLoadExecutor-1387-thread-1-processing-n:127.0.0.1:42302_) [n:127.0.0.1:42302_ c:collection1 x:collection1] o.a.s.c.SolrCore [[collection1] ] Opening new SolrCore at [/export/home/jenkins/workspace/Lucene-Solr-6.x-Solaris/solr/build/solr-core/test/J1/temp/solr.cloud.ShardSplitTest_F66B59B6E2C1936E-001/shard-2-001/cores/collection1], dataDir=[/export/home/jenkins/workspace/Lucene-Solr-6.x-Solaris/solr/build/solr-core/test/J1/temp/solr.cloud.ShardSplitTest_F66B59B6E2C1936E-001/shard-2-001/cores/collection1/data/]
[junit4] 2> 165446 INFO (coreLoadExecutor-1387-thread-1-processing-n:127.0.0.1:42302_) [n:127.0.0.1:42302_ c:collection1 x:collection1] o.a.s.c.JmxMonitoredMap JMX monitoring is enabled. Adding Solr mbeans to JMX Server: com.sun.jmx.mbeanserver.JmxMBeanServer@5298713f
[junit4] 2> 165448 INFO (coreLoadExecutor-1387-thread-1-processing-n:127.0.0.1:42302_) [n:127.0.0.1:42302_ c:collection1 x:collection1] o.a.s.u.RandomMergePolicy RandomMergePolicy wrapping class org.apache.lucene.index.LogByteSizeMergePolicy: [LogByteSizeMergePolicy: minMergeSize=1677721, mergeFactor=18, maxMergeSize=2147483648, maxMergeSizeForForcedMerge=9223372036854775807, calibrateSizeByDeletes=false, maxMergeDocs=2147483647, maxCFSSegmentSizeMB=8.796093022207999E12, noCFSRatio=0.1741569011706913]
[junit4] 2> 165455 WARN (coreLoadExecutor-1387-thread-1-processing-n:127.0.0.1:42302_) [n:127.0.0.1:42302_ c:collection1 x:collection1] o.a.s.c.RequestHandlers INVALID paramSet a in requestHandler {type = requestHandler,name = /dump,class = DumpRequestHandler,attributes = {initParams=a, name=/dump, class=DumpRequestHandler},args = {defaults={a=A,b=B}}}
[junit4] 2> 165500 INFO (coreLoadExecutor-1387-thread-1-processing-n:127.0.0.1:42302_) [n:127.0.0.1:42302_ c:collection1 x:collection1] o.a.s.u.UpdateHandler Using UpdateLog implementation: org.apache.solr.update.UpdateLog
[junit4] 2> 165500 INFO (coreLoadExecutor-1387-thread-1-processing-n:127.0.0.1:42302_) [n:127.0.0.1:42302_ c:collection1 x:collection1] o.a.s.u.UpdateLog Initializing UpdateLog: dataDir= defaultSyncLevel=FLUSH numRecordsToKeep=100 maxNumLogsToKeep=10 numVersionBuckets=65536
[junit4] 2> 165501 INFO (coreLoadExecutor-1387-thread-1-processing-n:127.0.0.1:42302_) [n:127.0.0.1:42302_ c:collection1 x:collection1] o.a.s.u.CommitTracker Hard AutoCommit: disabled
[junit4] 2> 165501 INFO (coreLoadExecutor-1387-thread-1-processing-n:127.0.0.1:42302_) [n:127.0.0.1:42302_ c:collection1 x:collection1] o.a.s.u.CommitTracker Soft AutoCommit: disabled
[junit4] 2> 165502 INFO (coreLoadExecutor-1387-thread-1-processing-n:127.0.0.1:42302_) [n:127.0.0.1:42302_ c:collection1 x:collection1] o.a.s.u.RandomMergePolicy RandomMergePolicy wrapping class org.apache.lucene.index.TieredMergePolicy: [TieredMergePolicy: maxMergeAtOnce=49, maxMergeAtOnceExplicit=47, maxMergedSegmentMB=66.2197265625, floorSegmentMB=1.6015625, forceMergeDeletesPctAllowed=21.08031223556061, segmentsPerTier=19.0, maxCFSSegmentSizeMB=8.796093022207999E12, noCFSRatio=0.6362546164532266
[junit4] 2> 165503 INFO (coreLoadExecutor-1387-thread-1-processing-n:127.0.0.1:42302_) [n:127.0.0.1:42302_ c:collection1 x:collection1] o.a.s.s.SolrIndexSearcher Opening [Searcher@385af0b4[collection1] main]
[junit4] 2> 165505 INFO (coreLoadExecutor-1387-thread-1-processing-n:127.0.0.1:42302_) [n:127.0.0.1:42302_ c:collection1 x:collection1] o.a.s.r.ManagedResourceStorage Configured ZooKeeperStorageIO with znodeBase: /configs/conf1
[junit4] 2> 165505 INFO (coreLoadExecutor-1387-thread-1-processing-n:127.0.0.1:42302_) [n:127.0.0.1:42302_ c:collection1 x:collection1] o.a.s.r.ManagedResourceStorage Loaded null at path _rest_managed.json using ZooKeeperStorageIO:path=/configs/conf1
[junit4] 2> 165505 INFO (coreLoadExecutor-1387-thread-1-processing-n:127.0.0.1:42302_) [n:127.0.0.1:42302_ c:collection1 x:collection1] o.a.s.h.ReplicationHandler Commits will be reserved for 10000
[junit4] 2> 165507 INFO (searcherExecutor-1388-thread-1-processing-n:127.0.0.1:42302_ x:collection1 c:collection1) [n:127.0.0.1:42302_ c:collection1 x:collection1] o.a.s.c.SolrCore [collection1] Registered new searcher Searcher@385af0b4[collection1] main{ExitableDirectoryReader(UninvertingDirectoryReader())}
[junit4] 2> 165507 INFO (coreLoadExecutor-1387-thread-1-processing-n:127.0.0.1:42302_) [n:127.0.0.1:42302_ c:collection1 x:collection1] o.a.s.u.UpdateLog Could not find max version in index or recent updates, using new clock 1564524138698113024
[junit4] 2> 165517 INFO (coreZkRegister-1382-thread-1-processing-n:127.0.0.1:42302_ x:collection1 c:collection1) [n:127.0.0.1:42302_ c:collection1 s:shard1 r:core_node2 x:collection1] o.a.s.c.ShardLeaderElectionContext Enough replicas found to continue.
[junit4] 2> 165517 INFO (coreZkRegister-1382-thread-1-processing-n:127.0.0.1:42302_ x:collection1 c:collection1) [n:127.0.0.1:42302_ c:collection1 s:shard1 r:core_node2 x:collection1] o.a.s.c.ShardLeaderElectionContext I may be the new leader - try and sync
[junit4] 2> 165517 INFO (coreZkRegister-1382-thread-1-processing-n:127.0.0.1:42302_ x:collection1 c:collection1) [n:127.0.0.1:42302_ c:collection1 s:shard1 r:core_node2 x:collection1] o.a.s.c.SyncStrategy Sync replicas to http://127.0.0.1:42302/collection1/
[junit4] 2> 165517 INFO (coreZkRegister-1382-thread-1-processing-n:127.0.0.1:42302_ x:collection1 c:collection1) [n:127.0.0.1:42302_ c:collection1 s:shard1 r:core_node2 x:collection1] o.a.s.c.SyncStrategy Sync Success - now sync replicas to me
[junit4] 2> 165517 INFO (coreZkRegister-1382-thread-1-processing-n:127.0.0.1:42302_ x:collection1 c:collection1) [n:127.0.0.1:42302_ c:collection1 s:shard1 r:core_node2 x:collection1] o.a.s.c.SyncStrategy http://127.0.0.1:42302/collection1/ has no replicas
[junit4] 2> 165517 INFO (coreZkRegister-1382-thread-1-processing-n:127.0.0.1:42302_ x:collection1 c:collection1) [n:127.0.0.1:42302_ c:collection1 s:shard1 r:core_node2 x:collection1] o.a.s.c.ShardLeaderElectionContext Found all replicas participating in election, clear LIR
[junit4] 2> 165524 INFO (coreZkRegister-1382-thread-1-processing-n:127.0.0.1:42302_ x:collection1 c:collection1) [n:127.0.0.1:42302_ c:collection1 s:shard1 r:core_node2 x:collection1] o.a.s.c.ShardLeaderElectionContext I am the new leader: http://127.0.0.1:42302/collection1/ shard1
[junit4] 2> 165629 INFO (zkCallback-1334-thread-1-processing-n:127.0.0.1:53486_) [n:127.0.0.1:53486_ ] o.a.s.c.c.ZkStateReader A cluster state change: [WatchedEvent state:SyncConnected type:NodeDataChanged path:/collections/collection1/state.json] for collection [collection1] has occurred - updating... (live nodes size: [3])
[junit4] 2> 165629 INFO (zkCallback-1340-thread-1-processing-n:127.0.0.1:42302_) [n:127.0.0.1:42302_ ] o.a.s.c.c.ZkStateReader A cluster state change: [WatchedEvent state:SyncConnected type:NodeDataChanged path:/collections/collection1/state.json] for collection [collection1] has occurred - updating... (live nodes size: [3])
[junit4] 2> 165677 INFO (coreZkRegister-1382-thread-1-processing-n:127.0.0.1:42302_ x:collection1 c:collection1) [n:127.0.0.1:42302_ c:collection1 s:shard1 r:core_node2 x:collection1] o.a.s.c.ZkController I am the leader, no recovery necessary
[junit4] 2> 165783 INFO (zkCallback-1340-thread-1-processing-n:127.0.0.1:42302_) [n:127.0.0.1:42302_ ] o.a.s.c.c.ZkStateReader A cluster state change: [WatchedEvent state:SyncConnected type:NodeDataChanged path:/collections/collection1/state.json] for collection [collection1] has occurred - updating... (live nodes size: [3])
[junit4] 2> 165784 INFO (zkCallback-1334-thread-1-processing-n:127.0.0.1:53486_) [n:127.0.0.1:53486_ ] o.a.s.c.c.ZkStateReader A cluster state change: [WatchedEvent state:SyncConnected type:NodeDataChanged path:/collections/collection1/state.json] for collection [collection1] has occurred - updating... (live nodes size: [3])
[junit4] 2> 166004 INFO (TEST-ShardSplitTest.testSplitWithChaosMonkey-seed#[F66B59B6E2C1936E]) [ ] o.a.s.SolrTestCaseJ4 Writing core.properties file to /export/home/jenkins/workspace/Lucene-Solr-6.x-Solaris/solr/build/solr-core/test/J1/temp/solr.cloud.ShardSplitTest_F66B59B6E2C1936E-001/shard-3-001/cores/collection1
[junit4] 2> 166004 INFO (TEST-ShardSplitTest.testSplitWithChaosMonkey-seed#[F66B59B6E2C1936E]) [ ] o.a.s.c.AbstractFullDistribZkTestBase create jetty 3 in directory /export/home/jenkins/workspace/Lucene-Solr-6.x-Solaris/solr/build/solr-core/test/J1/temp/solr.cloud.ShardSplitTest_F66B59B6E2C1936E-001/shard-3-001
[junit4] 2> 166005 INFO (TEST-ShardSplitTest.testSplitWithChaosMonkey-seed#[F66B59B6E2C1936E]) [ ] o.e.j.s.Server jetty-9.3.14.v20161028
[junit4] 2> 166007 INFO (TEST-ShardSplitTest.testSplitWithChaosMonkey-seed#[F66B59B6E2C1936E]) [ ] o.e.j.s.h.ContextHandler Started o.e.j.s.ServletContextHandler@26d4958f{/,null,AVAILABLE}
[junit4] 2> 166008 INFO (TEST-ShardSplitTest.testSplitWithChaosMonkey-seed#[F66B59B6E2C1936E]) [ ] o.e.j.s.AbstractConnector Started ServerConnector@72b65f57{HTTP/1.1,[http/1.1]}{127.0.0.1:37636}
[junit4] 2> 166008 INFO (TEST-ShardSplitTest.testSplitWithChaosMonkey-seed#[F66B59B6E2C1936E]) [ ] o.e.j.s.Server Started @168851ms
[junit4] 2> 166008 INFO (TEST-ShardSplitTest.testSplitWithChaosMonkey-seed#[F66B59B6E2C1936E]) [ ] o.a.s.c.s.e.JettySolrRunner Jetty properties: {solr.data.dir=/export/home/jenkins/workspace/Lucene-Solr-6.x-Solaris/solr/build/solr-core/test/J1/temp/solr.cloud.ShardSplitTest_F66B59B6E2C1936E-001/tempDir-001/jetty3, solrconfig=solrconfig.xml, hostContext=/, hostPort=37636, coreRootDirectory=/export/home/jenkins/workspace/Lucene-Solr-6.x-Solaris/solr/build/solr-core/test/J1/temp/solr.cloud.ShardSplitTest_F66B59B6E2C1936E-001/shard-3-001/cores}
[junit4] 2> 166009 ERROR (TEST-ShardSplitTest.testSplitWithChaosMonkey-seed#[F66B59B6E2C1936E]) [ ] o.a.s.s.StartupLoggingUtils Missing Java Option solr.log.dir. Logging may be missing or incomplete.
[junit4] 2> 166009 INFO (TEST-ShardSplitTest.testSplitWithChaosMonkey-seed#[F66B59B6E2C1936E]) [ ] o.a.s.s.SolrDispatchFilter ___ _ Welcome to Apache Solr™ version 6.6.0
[junit4] 2> 166009 INFO (TEST-ShardSplitTest.testSplitWithChaosMonkey-seed#[F66B59B6E2C1936E]) [ ] o.a.s.s.SolrDispatchFilter / __| ___| |_ _ Starting in cloud mode on port null
[junit4] 2> 166009 INFO (TEST-ShardSplitTest.testSplitWithChaosMonkey-seed#[F66B59B6E2C1936E]) [ ] o.a.s.s.SolrDispatchFilter \__ \/ _ \ | '_| Install dir: null
[junit4] 2> 166009 INFO (TEST-ShardSplitTest.testSplitWithChaosMonkey-seed#[F66B59B6E2C1936E]) [ ] o.a.s.s.SolrDispatchFilter |___/\___/_|_| Start time: 2017-04-13T01:21:28.976Z
[junit4] 2> 166014 INFO (TEST-ShardSplitTest.testSplitWithChaosMonkey-seed#[F66B59B6E2C1936E]) [ ] o.a.s.s.SolrDispatchFilter Loading solr.xml from SolrHome (not found in ZooKeeper)
[junit4] 2> 166014 INFO (TEST-ShardSplitTest.testSplitWithChaosMonkey-seed#[F66B59B6E2C1936E]) [ ] o.a.s.c.SolrXmlConfig Loading container configuration from /export/home/jenkins/workspace/Lucene-Solr-6.x-Solaris/solr/build/solr-core/test/J1/temp/solr.cloud.ShardSplitTest_F66B59B6E2C1936E-001/shard-3-001/solr.xml
[junit4] 2> 166020 INFO (TEST-ShardSplitTest.testSplitWithChaosMonkey-seed#[F66B59B6E2C1936E]) [ ] o.a.s.u.UpdateShardHandler Creating UpdateShardHandler HTTP client with params: socketTimeout=340000&connTimeout=45000&retry=true
[junit4] 2> 166021 INFO (TEST-ShardSplitTest.testSplitWithChaosMonkey-seed#[F66B59B6E2C1936E]) [ ] o.a.s.c.ZkContainer Zookeeper client=127.0.0.1:48321/solr
[junit4] 2> 166039 INFO (TEST-ShardSplitTest.testSplitWithChaosMonkey-seed#[F66B59B6E2C1936E]) [n:127.0.0.1:37636_ ] o.a.s.c.c.ZkStateReader Updated live nodes from ZooKeeper... (0) -> (3)
[junit4] 2> 166043 INFO (TEST-ShardSplitTest.testSplitWithChaosMonkey-seed#[F66B59B6E2C1936E]) [n:127.0.0.1:37636_ ] o.a.s.c.Overseer Overseer (id=null) closing
[junit4] 2> 166047 INFO (TEST-ShardSplitTest.testSplitWithChaosMonkey-seed#[F66B59B6E2C1936E]) [n:127.0.0.1:37636_ ] o.a.s.c.ZkController Register node as live in ZooKeeper:/live_nodes/127.0.0.1:37636_
[junit4] 2> 166050 INFO (zkCallback-1340-thread-1-processing-n:127.0.0.1:42302_) [n:127.0.0.1:42302_ ] o.a.s.c.c.ZkStateReader Updated live nodes from ZooKeeper... (3) -> (4)
[junit4] 2> 166051 INFO (zkCallback-1328-thread-1) [ ] o.a.s.c.c.ZkStateReader Updated live nodes from ZooKeeper... (3) -> (4)
[junit4] 2> 166051 INFO (zkCallback-1324-thread-1-processing-n:127.0.0.1:65139_) [n:127.0.0.1:65139_ ] o.a.s.c.c.ZkStateReader Updated live nodes from ZooKeeper... (3) -> (4)
[junit4] 2> 166051 INFO (zkCallback-1334-thread-1-processing-n:127.0.0.1:53486_) [n:127.0.0.1:53486_ ] o.a.s.c.c.ZkStateReader Updated live nodes from ZooKeeper... (3) -> (4)
[junit4] 2> 166052 INFO (zkCallback-1346-thread-1-processing-n:127.0.0.1:37636_) [n:127.0.0.1:37636_ ] o.a.s.c.c.ZkStateReader Updated live nodes from ZooKeeper... (3) -> (4)
[junit4] 2> 166119 INFO (TEST-ShardSplitTest.testSplitWithChaosMonkey-seed#[F66B59B6E2C1936E]) [n:127.0.0.1:37636_ ] o.a.s.c.CorePropertiesLocator Found 1 core definitions underneath /export/home/jenkins/workspace/Lucene-Solr-6.x-Solaris/solr/build/solr-core/test/J1/temp/solr.cloud.ShardSplitTest_F66B59B6E2C1936E-001/shard-3-001/cores
[junit4] 2> 166119 INFO (TEST-ShardSplitTest.testSplitWithChaosMonkey-seed#[F66B59B6E2C1936E]) [n:127.0.0.1:37636_ ] o.a.s.c.CorePropertiesLocator Cores are: [collection1]
[junit4] 2> 166120 INFO (coreLoadExecutor-1398-thread-1-processing-n:127.0.0.1:37636_) [n:127.0.0.1:37636_ c:collection1 x:collection1] o.a.s.c.TransientSolrCoreCacheDefault Allocating transient cache for 4 transient cores
[junit4] 2> 166123 INFO (OverseerStateUpdate-97782758270369796-127.0.0.1:65139_-n_0000000000) [n:127.0.0.1:65139_ ] o.a.s.c.o.ReplicaMutator Assigning new node to shard shard=shard2
[junit4] 2> 166227 INFO (zkCallback-1334-thread-1-processing-n:127.0.0.1:53486_) [n:127.0.0.1:53486_ ] o.a.s.c.c.ZkStateReader A cluster state change: [WatchedEvent state:SyncConnected type:NodeDataChanged path:/collections/collection1/state.json] for collection [collection1] has occurred - updating... (live nodes size: [4])
[junit4] 2> 166227 INFO (zkCallback-1340-thread-1-processing-n:127.0.0.1:42302_) [n:127.0.0.1:42302_ ] o.a.s.c.c.ZkStateReader A cluster state change: [WatchedEvent state:SyncConnected type:NodeDataChanged path:/collections/collection1/state.json] for collection [collection1] has occurred - updating... (live nodes size: [4])
[junit4] 2> 166227 INFO (zkCallback-1346-thread-1-processing-n:127.0.0.1:37636_) [n:127.0.0.1:37636_ ] o.a.s.c.c.ZkStateReader A cluster state change: [WatchedEvent state:SyncConnected type:NodeDataChanged path:/collections/collection1/state.json] for collection [collection1] has occurred - updating... (live nodes size: [4])
[junit4] 2> 167160 WARN (coreLoadExecutor-1398-thread-1-processing-n:127.0.0.1:37636_) [n:127.0.0.1:37636_ c:collection1 x:collection1] o.a.s.c.Config Beginning with Solr 5.5, <mergePolicy> is deprecated, use <mergePolicyFactory> instead.
[junit4] 2> 167160 INFO (coreLoadExecutor-1398-thread-1-processing-n:127.0.0.1:37636_) [n:127.0.0.1:37636_ c:collection1 x:collection1] o.a.s.c.SolrConfig Using Lucene MatchVersion: 6.6.0
[junit4] 2> 167213 INFO (coreLoadExecutor-1398-thread-1-processing-n:127.0.0.1:37636_) [n:127.0.0.1:37636_ c:collection1 x:collection1] o.a.s.s.IndexSchema [collection1] Schema name=test
[junit4] 2> 167432 WARN (coreLoadExecutor-1398-thread-1-processing-n:127.0.0.1:37636_) [n:127.0.0.1:37636_ c:collection1 x:collection1] o.a.s.s.IndexSchema [collection1] default search field in schema is text. WARNING: Deprecated, please use 'df' on request instead.
[junit4] 2> 167439 INFO (coreLoadExecutor-1398-thread-1-processing-n:127.0.0.1:37636_) [n:127.0.0.1:37636_ c:collection1 x:collection1] o.a.s.s.IndexSchema Loaded schema test/1.6 with uniqueid field id
[junit4] 2> 167540 INFO (coreLoadExecutor-1398-thread-1-processing-n:127.0.0.1:37636_) [n:127.0.0.1:37636_ c:collection1 x:collection1] o.a.s.c.CoreContainer Creating SolrCore 'collection1' using configuration from collection collection1, trusted=true
[junit4] 2> 167545 INFO (coreLoadExecutor-1398-thread-1-processing-n:127.0.0.1:37636_) [n:127.0.0.1:37636_ c:collection1 x:collection1] o.a.s.c.SolrCore solr.RecoveryStrategy.Builder
[junit4] 2> 167545 INFO (coreLoadExecutor-1398-thread-1-processing-n:127.0.0.1:37636_) [n:127.0.0.1:37636_ c:collection1 x:collection1] o.a.s.c.SolrCore [[collection1] ] Opening new SolrCore at [/export/home/jenkins/workspace/Lucene-Solr-6.x-Solaris/solr/build/solr-core/test/J1/temp/solr.cloud.ShardSplitTest_F66B59B6E2C1936E-001/shard-3-001/cores/collection1], dataDir=[/export/home/jenkins/workspace/Lucene-Solr-6.x-Solaris/solr/build/solr-core/test/J1/temp/solr.cloud.ShardSplitTest_F66B59B6E2C1936E-001/shard-3-001/cores/collection1/data/]
[junit4] 2> 167546 INFO (coreLoadExecutor-1398-thread-1-processing-n:127.0.0.1:37636_) [n:127.0.0.1:37636_ c:collection1 x:collection1] o.a.s.c.JmxMonitoredMap JMX monitoring is enabled. Adding Solr mbeans to JMX Server: com.sun.jmx.mbeanserver.JmxMBeanServer@5298713f
[junit4] 2> 167556 INFO (coreLoadExecutor-1398-thread-1-processing-n:127.0.0.1:37636_) [n:127.0.0.1:37636_ c:collection1 x:collection1] o.a.s.u.RandomMergePolicy RandomMergePolicy wrapping class org.apache.lucene.index.LogByteSizeMergePolicy: [LogByteSizeMergePolicy: minMergeSize=1677721, mergeFactor=18, maxMergeSize=2147483648, maxMergeSizeForForcedMerge=9223372036854775807, calibrateSizeByDeletes=false, maxMergeDocs=2147483647, maxCFSSegmentSizeMB=8.796093022207999E12, noCFSRatio=0.1741569011706913]
[junit4] 2> 167578 WARN (coreLoadExecutor-1398-thread-1-processing-n:127.0.0.1:37636_) [n:127.0.0.1:37636_ c:collection1 x:collection1] o.a.s.c.RequestHandlers INVALID paramSet a in requestHandler {type = requestHandler,name = /dump,class = DumpRequestHandler,attributes = {initParams=a, name=/dump, class=DumpRequestHandler},args = {defaults={a=A,b=B}}}
[junit4] 2> 167753 INFO (coreLoadExecutor-1398-thread-1-processing-n:127.0.0.1:37636_) [n:127.0.0.1:37636_ c:collection1 x:collection1] o.a.s.u.UpdateHandler Using UpdateLog implementation: org.apache.solr.update.UpdateLog
[junit4] 2> 167753 INFO (coreLoadExecutor-1398-thread-1-processing-n:127.0.0.1:37636_) [n:127.0.0.1:37636_ c:collection1 x:collection1] o.a.s.u.UpdateLog Initializing UpdateLog: dataDir= defaultSyncLevel=FLUSH numRecordsToKeep=100 maxNumLogsToKeep=10 numVersionBuckets=65536
[junit4] 2> 167755 INFO (coreLoadExecutor-1398-thread-1-processing-n:127.0.0.1:37636_) [n:127.0.0.1:37636_ c:collection1 x:collection1] o.a.s.u.CommitTracker Hard AutoCommit: disabled
[junit4] 2> 167755 INFO (coreLoadExecutor-1398-thread-1-processing-n:127.0.0.1:37636_) [n:127.0.0.1:37636_ c:collection1 x:collection1] o.a.s.u.CommitTracker Soft AutoCommit: disabled
[junit4] 2> 167759 INFO (coreLoadExecutor-1398-thread-1-processing-n:127.0.0.1:37636_) [n:127.0.0.1:37636_ c:collection1 x:collection1] o.a.s.u.RandomMergePolicy RandomMergePolicy wrapping class org.apache.lucene.index.TieredMergePolicy: [TieredMergePolicy: maxMergeAtOnce=49, maxMergeAtOnceExplicit=47, maxMergedSegmentMB=66.2197265625, floorSegmentMB=1.6015625, forceMergeDeletesPctAllowed=21.08031223556061, segmentsPerTier=19.0, maxCFSSegmentSizeMB=8.796093022207999E12, noCFSRatio=0.6362546164532266
[junit4] 2> 167759 INFO (coreLoadExecutor-1398-thread-1-processing-n:127.0.0.1:37636_) [n:127.0.0.1:37636_ c:collection1 x:collection1] o.a.s.s.SolrIndexSearcher Opening [Searcher@42e451f1[collection1] main]
[junit4] 2> 167763 INFO (coreLoadExecutor-1398-thread-1-processing-n:127.0.0.1:37636_) [n:127.0.0.1:37636_ c:collection1 x:collection1] o.a.s.r.ManagedResourceStorage Configured ZooKeeperStorageIO with znodeBase: /configs/conf1
[junit4] 2> 167769 INFO (coreLoadExecutor-1398-thread-1-processing-n:127.0.0.1:37636_) [n:127.0.0.1:37636_ c:collection1 x:collection1] o.a.s.r.ManagedResourceStorage Loaded null at path _rest_managed.json using ZooKeeperStorageIO:path=/configs/conf1
[junit4] 2> 167769 INFO (coreLoadExecutor-1398-thread-1-processing-n:127.0.0.1:37636_) [n:127.0.0.1:37636_ c:collection1 x:collection1] o.a.s.h.ReplicationHandler Commits will be reserved for 10000
[junit4] 2> 167772 INFO (coreLoadExecutor-1398-thread-1-processing-n:127.0.0.1:37636_) [n:127.0.0.1:37636_ c:collection1 x:collection1] o.a.s.u.UpdateLog Could not find max version in index or recent updates, using new clock 1564524141073137664
[junit4] 2> 167775 INFO (searcherExecutor-1399-thread-1-processing-n:127.0.0.1:37636_ x:collection1 c:collection1) [n:127.0.0.1:37636_ c:collection1 x:collection1] o.a.s.c.SolrCore [collection1] Registered new searcher Searcher@42e451f1[collection1] main{ExitableDirectoryReader(UninvertingDirectoryReader())}
[junit4] 2> 167804 INFO (coreZkRegister-1393-thread-1-processing-n:127.0.0.1:37636_ x:collection1 c:collection1) [n:127.0.0.1:37636_ c:collection1 s:shard2 r:core_node3 x:collection1] o.a.s.c.ZkController Core needs to recover:collection1
[junit4] 2> 167804 INFO (updateExecutor-1343-thread-1-processing-n:127.0.0.1:37636_ x:collection1 s:shard2 c:collection1 r:core_node3) [n:127.0.0.1:37636_ c:collection1 s:shard2 r:core_node3 x:collection1] o.a.s.u.DefaultSolrCoreState Running recovery
[junit4] 2> 167805 INFO (recoveryExecutor-1344-thread-1-processing-n:127.0.0.1:37636_ x:collection1 s:shard2 c:collection1 r:core_node3) [n:127.0.0.1:37636_ c:collection1 s:shard2 r:core_node3 x:collection1] o.a.s.c.RecoveryStrategy Starting recovery process. recoveringAfterStartup=true
[junit4] 2> 167806 INFO (recoveryExecutor-1344-thread-1-processing-n:127.0.0.1:37636_ x:collection1 s:shard2 c:collection1 r:core_node3) [n:127.0.0.1:37636_ c:collection1 s:shard2 r:core_node3 x:collection1] o.a.s.c.RecoveryStrategy ###### startupVersions=[[]]
[junit4] 2> 167806 INFO (recoveryExecutor-1344-thread-1-processing-n:127.0.0.1:37636_ x:collection1 s:shard2 c:collection1 r:core_node3) [n:127.0.0.1:37636_ c:collection1 s:shard2 r:core_node3 x:collection1] o.a.s.c.RecoveryStrategy Begin buffering updates. core=[collection1]
[junit4] 2> 167806 INFO (recoveryExecutor-1344-thread-1-processing-n:127.0.0.1:37636_ x:collection1 s:shard2 c:collection1 r:core_node3) [n:127.0.0.1:37636_ c:collection1 s:shard2 r:core_node3 x:collection1] o.a.s.u.UpdateLog Starting to buffer updates. FSUpdateLog{state=ACTIVE, tlog=null}
[junit4] 2> 167806 INFO (recoveryExecutor-1344-thread-1-processing-n:127.0.0.1:37636_ x:collection1 s:shard2 c:collection1 r:core_node3) [n:127.0.0.1:37636_ c:collection1 s:shard2 r:core_node3 x:collection1] o.a.s.c.RecoveryStrategy Publishing state of core [collection1] as recovering, leader is [http://127.0.0.1:53486/collection1/] and I am [http://127.0.0.1:37636/collection1/]
[junit4] 2> 167810 INFO (recoveryExecutor-1344-thread-1-processing-n:127.0.0.1:37636_ x:collection1 s:shard2 c:collection1 r:core_node3) [n:127.0.0.1:37636_ c:collection1 s:shard2 r:core_node3 x:collection1] o.a.s.c.RecoveryStrategy Sending prep recovery command to [http://127.0.0.1:53486]; [WaitForState: action=PREPRECOVERY&core=collection1&nodeName=127.0.0.1:37636_&coreNodeName=core_node3&state=recovering&checkLive=true&onlyIfLeader=true&onlyIfLeaderActive=true]
[junit4] 2> 167822 INFO (zkCallback-1340-thread-1-processing-n:127.0.0.1:42302_) [n:127.0.0.1:42302_ ] o.a.s.c.c.ZkStateReader A cluster state change: [WatchedEvent state:SyncConnected type:NodeDataChanged path:/collections/collection1/state.json] for collection [collection1] has occurred - updating... (live nodes size: [4])
[junit4] 2> 167823 INFO (zkCallback-1346-thread-1-processing-n:127.0.0.1:37636_) [n:127.0.0.1:37636_ ] o.a.s.c.c.ZkStateReader A cluster state change: [WatchedEvent state:SyncConnected type:NodeDataChanged path:/collections/collection1/state.json] for collection [collection1] has occurred - updating... (live nodes size: [4])
[junit4] 2> 167823 INFO (zkCallback-1334-thread-1-processing-n:127.0.0.1:53486_) [n:127.0.0.1:53486_ ] o.a.s.c.c.ZkStateReader A cluster state change: [WatchedEvent state:SyncConnected type:NodeDataChanged path:/collections/collection1/state.json] for collection [collection1] has occurred - updating... (live nodes size: [4])
[junit4] 2> 167831 INFO (qtp1229021456-4009) [n:127.0.0.1:53486_ ] o.a.s.h.a.PrepRecoveryOp Going to wait for coreNodeName: core_node3, state: recovering, checkLive: true, onlyIfLeader: true, onlyIfLeaderActive: true
[junit4] 2> 167833 INFO (qtp1229021456-4009) [n:127.0.0.1:53486_ ] o.a.s.h.a.PrepRecoveryOp Will wait a max of 183 seconds to see collection1 (shard2 of collection1) have state: recovering
[junit4] 2> 167833 INFO (qtp1229021456-4009) [n:127.0.0.1:53486_ ] o.a.s.h.a.PrepRecoveryOp In WaitForState(recovering): collection=collection1, shard=shard2, thisCore=collection1, leaderDoesNotNeedRecovery=false, isLeader? true, live=true, checkLive=true, currentState=recovering, localState=active, nodeName=127.0.0.1:37636_, coreNodeName=core_node3, onlyIfActiveCheckResult=false, nodeProps: core_node3:{"core":"collection1","base_url":"http://127.0.0.1:37636","node_name":"127.0.0.1:37636_","state":"recovering"}
[junit4] 2> 167833 INFO (qtp1229021456-4009) [n:127.0.0.1:53486_ ] o.a.s.h.a.PrepRecoveryOp Waited coreNodeName: core_node3, state: recovering, checkLive: true, onlyIfLeader: true for: 0 seconds.
[junit4] 2> 167833 INFO (qtp1229021456-4009) [n:127.0.0.1:53486_ ] o.a.s.s.HttpSolrCall [admin] webapp=null path=/admin/cores params={nodeName=127.0.0.1:37636_&onlyIfLeaderActive=true&core=collection1&coreNodeName=core_node3&action=PREPRECOVERY&checkLive=true&state=recovering&onlyIfLeader=true&wt=javabin&version=2} status=0 QTime=2
[junit4] 2> 168151 INFO (TEST-ShardSplitTest.testSplitWithChaosMonkey-seed#[F66B59B6E2C1936E]) [ ] o.a.s.SolrTestCaseJ4 Writing core.properties file to /export/home/jenkins/workspace/Lucene-Solr-6.x-Solaris/solr/build/solr-core/test/J1/temp/solr.cloud.ShardSplitTest_F66B59B6E2C1936E-001/shard-4-001/cores/collection1
[junit4] 2> 168152 INFO (TEST-ShardSplitTest.testSplitWithChaosMonkey-seed#[F66B59B6E2C1936E]) [ ] o.a.s.c.AbstractFullDistribZkTestBase create jetty 4 in directory /export/home/jenkins/workspace/Lucene-Solr-6.x-Solaris/solr/build/solr-core/test/J1/temp/solr.cloud.ShardSplitTest_F66B59B6E2C1936E-001/shard-4-001
[junit4] 2> 168153 INFO (TEST-ShardSplitTest.testSplitWithChaosMonkey-seed#[F66B59B6E2C1936E]) [ ] o.e.j.s.Server jetty-9.3.14.v20161028
[junit4] 2> 168157 INFO (TEST-ShardSplitTest.testSplitWithChaosMonkey-seed#[F66B59B6E2C1936E]) [ ] o.e.j.s.h.ContextHandler Started o.e.j.s.ServletContextHandler@5fc32198{/,null,AVAILABLE}
[junit4] 2> 168158 INFO (TEST-ShardSplitTest.testSplitWithChaosMonkey-seed#[F66B59B6E2C1936E]) [ ] o.e.j.s.AbstractConnector Started ServerConnector@3868e9ce{HTTP/1.1,[http/1.1]}{127.0.0.1:46523}
[junit4] 2> 168158 INFO (TEST-ShardSplitTest.testSplitWithChaosMonkey-seed#[F66B59B6E2C1936E]) [ ] o.e.j.s.Server Started @170990ms
[junit4] 2> 168158 INFO (TEST-ShardSplitTest.testSplitWithChaosMonkey-seed#[F66B59B6E2C1936E]) [ ] o.a.s.c.s.e.JettySolrRunner Jetty properties: {solr.data.dir=/export/home/jenkins/workspace/Lucene-Solr-6.x-Solaris/solr/build/solr-core/test/J1/temp/solr.cloud.ShardSplitTest_F66B59B6E2C1936E-001/tempDir-001/jetty4, solrconfig=solrconfig.xml, hostContext=/, hostPort=46523, coreRootDirectory=/export/home/jenkins/workspace/Lucene-Solr-6.x-Solaris/solr/build/solr-core/test/J1/temp/solr.cloud.ShardSplitTest_F66B59B6E2C1936E-001/shard-4-001/cores}
[junit4] 2> 168158 ERROR (TEST-ShardSplitTest.testSplitWithChaosMonkey-seed#[F66B59B6E2C1936E]) [ ] o.a.s.s.StartupLoggingUtils Missing Java Option solr.log.dir. Logging may be missing or incomplete.
[junit4] 2> 168176 INFO (TEST-ShardSplitTest.testSplitWithChaosMonkey-seed#[F66B59B6E2C1936E]) [ ] o.a.s.s.SolrDispatchFilter ___ _ Welcome to Apache Solr™ version 6.6.0
[junit4] 2> 168176 INFO (TEST-ShardSplitTest.testSplitWithChaosMonkey-seed#[F66B59B6E2C1936E]) [ ] o.a.s.s.SolrDispatchFilter / __| ___| |_ _ Starting in cloud mode on port null
[junit4] 2> 168176 INFO (TEST-ShardSplitTest.testSplitWithChaosMonkey-seed#[F66B59B6E2C1936E]) [ ] o.a.s.s.SolrDispatchFilter \__ \/ _ \ | '_| Install dir: null
[junit4] 2> 168176 INFO (TEST-ShardSplitTest.testSplitWithChaosMonkey-seed#[F66B59B6E2C1936E]) [ ] o.a.s.s.SolrDispatchFilter |___/\___/_|_| Start time: 2017-04-13T01:21:31.143Z
[junit4] 2> 168230 INFO (TEST-ShardSplitTest.testSplitWithChaosMonkey-seed#[F66B59B6E2C1936E]) [ ] o.a.s.s.SolrDispatchFilter Loading solr.xml from SolrHome (not found in ZooKeeper)
[junit4] 2> 168230 INFO (TEST-ShardSplitTest.testSplitWithChaosMonkey-seed#[F66B59B6E2C1936E]) [ ] o.a.s.c.SolrXmlConfig Loading container configuration from /export/home/jenkins/workspace/Lucene-Solr-6.x-Solaris/solr/build/solr-core/test/J1/temp/solr.cloud.ShardSplitTest_F66B59B6E2C1936E-001/shard-4-001/solr.xml
[junit4] 2> 168241 INFO (TEST-ShardSplitTest.testSplitWithChaosMonkey-seed#[F66B59B6E2C1936E]) [ ] o.a.s.u.UpdateShardHandler Creating UpdateShardHandler HTTP client with params: socketTimeout=340000&connTimeout=45000&retry=true
[junit4] 2> 168242 INFO (TEST-ShardSplitTest.testSplitWithChaosMonkey-seed#[F66B59B6E2C1936E]) [ ] o.a.s.c.ZkContainer Zookeeper client=127.0.0.1:48321/solr
[junit4] 2> 168255 INFO (TEST-ShardSplitTest.testSplitWithChaosMonkey-seed#[F66B59B6E2C1936E]) [n:127.0.0.1:46523_ ] o.a.s.c.c.ZkStateReader Updated live nodes from ZooKeeper... (0) -> (4)
[junit4] 2> 168258 INFO (TEST-ShardSplitTest.testSplitWithChaosMonkey-seed#[F66B59B6E2C1936E]) [n:127.0.0.1:46523_ ] o.a.s.c.Overseer Overseer (id=null) closing
[junit4] 2> 168261 INFO (TEST-ShardSplitTest.testSplitWithChaosMonkey-seed#[F66B59B6E2C1936E]) [n:127.0.0.1:46523_ ] o.a.s.c.ZkController Register node as live in ZooKeeper:/live_nodes/127.0.0.1:46523_
[junit4] 2> 168264 INFO (zkCallback-1324-thread-2-processing-n:127.0.0.1:65139_) [n:127.0.0.1:65139_ ] o.a.s.c.c.ZkStateReader Updated live nodes from ZooKeeper... (4) -> (5)
[junit4] 2> 168265 INFO (zkCallback-1340-thread-1-processing-n:127.0.0.1:42302_) [n:127.0.0.1:42302_ ] o.a.s.c.c.ZkStateReader Updated live nodes from ZooKeeper... (4) -> (5)
[junit4] 2> 168266 INFO (zkCallback-1328-thread-1) [ ] o.a.s.c.c.ZkStateReader Updated live nodes from ZooKeeper... (4) -> (5)
[junit4] 2> 168266 INFO (zkCallback-1346-thread-1-processing-n:127.0.0.1:37636_) [n:127.0.0.1:37636_ ] o.a.s.c.c.ZkStateReader Updated live nodes from ZooKeeper... (4) -> (5)
[junit4] 2> 168266 INFO (zkCallback-1334-thread-1-processing-n:127.0.0.1:53486_) [n:127.0.0.1:53486_ ] o.a.s.c.c.ZkStateReader Updated live nodes from ZooKeeper... (4) -> (5)
[junit4] 2> 168279 INFO (zkCallback-1353-thread-1-processing-n:127.0.0.1:46523_) [n:127.0.0.1:46523_ ] o.a.s.c.c.ZkStateReader Updated live nodes from ZooKeeper... (4) -> (5)
[junit4] 2> 168342 INFO (recoveryExecutor-1344-thread-1-processing-n:127.0.0.1:37636_ x:collection1 s:shard2 c:collection1 r:core_node3) [n:127.0.0.1:37636_ c:collection1 s:shard2 r:core_node3 x:collection1] o.a.s.c.RecoveryStrategy Attempting to PeerSync from [http://127.0.0.1:53486/collection1/] - recoveringAfterStartup=[true]
[junit4] 2> 168343 INFO (recoveryExecutor-1344-thread-1-processing-n:127.0.0.1:37636_ x:collection1 s:shard2 c:collection1 r:core_node3) [n:127.0.0.1:37636_ c:collection1 s:shard2 r:core_node3 x:collection1] o.a.s.u.PeerSync PeerSync: core=collection1 url=http://127.0.0.1:37636 START replicas=[http://127.0.0.1:53486/collection1/] nUpdates=100
[junit4] 2> 168349 INFO (qtp1229021456-4012) [n:127.0.0.1:53486_ c:collection1 s:shard2 r:core_node1 x:collection1] o.a.s.u.IndexFingerprint IndexFingerprint millis:1.0 result:{maxVersionSpecified=9223372036854775807, maxVersionEncountered=0, maxInHash=0, versionsHash=0, numVersions=0, numDocs=0, maxDoc=0}
[junit4] 2> 168349 INFO (qtp1229021456-4012) [n:127.0.0.1:53486_ c:collection1 s:shard2 r:core_node1 x:collection1] o.a.s.c.S.Request [collection1] webapp= path=/get params={distrib=false&qt=/get&getFingerprint=9223372036854775807&wt=javabin&version=2} status=0 QTime=1
[junit4] 2> 168354 INFO (recoveryExecutor-1344-thread-1-processing-n:127.0.0.1:37636_ x:collection1 s:shard2 c:collection1 r:core_node3) [n:127.0.0.1:37636_ c:collection1 s:shard2 r:core_node3 x:collection1] o.a.s.u.IndexFingerprint IndexFingerprint millis:2.0 result:{maxVersionSpecified=9223372036854775807, maxVersionEncountered=0, maxInHash=0, versionsHash=0, numVersions=0, numDocs=0, maxDoc=0}
[junit4] 2> 168354 INFO (recoveryExecutor-1344-thread-1-processing-n:127.0.0.1:37636_ x:collection1 s:shard2 c:collection1 r:core_node3) [n:127.0.0.1:37636_ c:collection1 s:shard2 r:core_node3 x:collection1] o.a.s.u.PeerSync We are already in sync. No need to do a PeerSync
[junit4] 2> 168354 INFO (recoveryExecutor-1344-thread-1-processing-n:127.0.0.1:37636_ x:collection1 s:shard2 c:collection1 r:core_node3) [n:127.0.0.1:37636_ c:collection1 s:shard2 r:core_node3 x:collection1] o.a.s.u.DirectUpdateHandler2 start commit{,optimize=false,openSearcher=true,waitSearcher=true,expungeDeletes=false,softCommit=false,prepareCommit=false}
[junit4] 2> 168354 INFO (recoveryExecutor-1344-thread-1-processing-n:127.0.0.1:37636_ x:collection1 s:shard2 c:collection1 r:core_node3) [n:127.0.0.1:37636_ c:collection1 s:shard2 r:core_node3 x:collection1] o.a.s.u.DirectUpdateHandler2 No uncommitted changes. Skipping IW.commit.
[junit4] 2> 168355 INFO (recoveryExecutor-1344-thread-1-processing-n:127.0.0.1:37636_ x:collection1 s:shard2 c:collection1 r:core_node3) [n:127.0.0.1:37636_ c:collection1 s:shard2 r:core_node3 x:collection1] o.a.s.u.DirectUpdateHandler2 end_commit_flush
[junit4] 2> 168356 INFO (recoveryExecutor-1344-thread-1-processing-n:127.0.0.1:37636_ x:collection1 s:shard2 c:collection1 r:core_node3) [n:127.0.0.1:37636_ c:collection1 s:shard2 r:core_node3 x:collection1] o.a.s.c.RecoveryStrategy PeerSync stage of recovery was successful.
[junit4] 2> 168357 INFO (recoveryExecutor-1344-thread-1-processing-n:127.0.0.1:37636_ x:collection1 s:shard2 c:collection1 r:core_node3) [n:127.0.0.1:37636_ c:collection1 s:shard2 r:core_node3 x:collection1] o.a.s.c.RecoveryStrategy Replaying updates buffered during PeerSync.
[junit4] 2> 168357 INFO (recoveryExecutor-1344-thread-1-processing-n:127.0.0.1:37636_ x:collection1 s:shard2 c:collection1 r:core_node3) [n:127.0.0.1:37636_ c:collection1 s:shard2 r:core_node3 x:collection1] o.a.s.c.RecoveryStrategy No replay needed.
[junit4] 2> 168357 INFO (recoveryExecutor-1344-thread-1-processing-n:127.0.0.1:37636_ x:collection1 s:shard2 c:collection1 r:core_node3) [n:127.0.0.1:37636_ c:collection1 s:shard2 r:core_node3 x:collection1] o.a.s.c.RecoveryStrategy Registering as Active after recovery.
[junit4] 2> 168471 INFO (zkCallback-1346-thread-1-processing-n:127.0.0.1:37636_) [n:127.0.0.1:37636_ ] o.a.s.c.c.ZkStateReader A cluster state change: [WatchedEvent state:SyncConnected type:NodeDataChanged path:/collections/collection1/state.json] for collection [collection1] has occurred - updating... (live nodes size: [5])
[junit4] 2> 168471 INFO (zkCallback-1334-thread-1-processing-n:127.0.0.1:53486_) [n:127.0.0.1:53486_ ] o.a.s.c.c.ZkStateReader A cluster state change: [WatchedEvent state:SyncConnected type:NodeDataChanged path:/collections/collection1/state.json] for collection [collection1] has occurred - updating... (live nodes size: [5])
[junit4] 2> 168472 INFO (zkCallback-1340-thread-1-processing-n:127.0.0.1:42302_) [n:127.0.0.1:42302_ ] o.a.s.c.c.ZkStateReader A cluster state change: [WatchedEvent state:SyncConnected type:NodeDataChanged path:/collections/collection1/state.json] for collection [collection1] has occurred - updating... (live nodes size: [5])
[junit4] 2> 168507 INFO (TEST-ShardSplitTest.testSplitWithChaosMonkey-seed#[F66B59B6E2C1936E]) [n:127.0.0.1:46523_ ] o.a.s.c.CorePropertiesLocator Found 1 core definitions underneath /export/home/jenkins/workspace/Lucene-Solr-6.x-Solaris/solr/build/solr-core/test/J1/temp/solr.cloud.ShardSplitTest_F66B59B6E2C1936E-001/shard-4-001/cores
[junit4] 2> 168507 INFO (TEST-ShardSplitTest.testSplitWithChaosMonkey-seed#[F66B59B6E2C1936E]) [n:127.0.0.1:46523_ ] o.a.s.c.CorePropertiesLocator Cores are: [collection1]
[junit4] 2> 168510 INFO (coreLoadExecutor-1409-thread-1-processing-n:127.0.0.1:46523_) [n:127.0.0.1:46523_ c:collection1 x:collection1] o.a.s.c.TransientSolrCoreCacheDefault Allocating transient cache for 4 transient cores
[junit4] 2> 168522 INFO (OverseerStateUpdate-97782758270369796-127.0.0.1:65139_-n_0000000000) [n:127.0.0.1:65139_ ] o.a.s.c.o.ReplicaMutator Assigning new node to shard shard=shard1
[junit4] 2> 168634 INFO (zkCallback-1346-thread-1-processing-n:127.0.0.1:37636_) [n:127.0.0.1:37636_ ] o.a.s.c.c.ZkStateReader A cluster state change: [WatchedEvent state:SyncConnected type:NodeDataChanged path:/collections/collection1/state.json] for collection [collection1] has occurred - updating... (live nodes size: [5])
[junit4] 2> 168635 INFO (zkCallback-1340-thread-1-processing-n:127.0.0.1:42302_) [n:127.0.0.1:42302_ ] o.a.s.c.c.ZkStateReader A cluster state change: [WatchedEvent state:SyncConnected type:NodeDataChanged path:/collections/collection1/state.json] for collection [collection1] has occurred - updating... (live nodes size: [5])
[junit4] 2> 168636 INFO (zkCallback-1334-thread-1-processing-n:127.0.0.1:53486_) [n:127.0.0.1:53486_ ] o.a.s.c.c.ZkStateReader A cluster state change: [WatchedEvent state:SyncConnected type:NodeDataChanged path:/collections/collection1/state.json] for collection [collection1] has occurred - updating... (live nodes size: [5])
[junit4] 2> 168636 INFO (zkCallback-1353-thread-1-processing-n:127.0.0.1:46523_) [n:127.0.0.1:46523_ ] o.a.s.c.c.ZkStateReader A cluster state change: [WatchedEvent state:SyncConnected type:NodeDataChanged path:/collections/collection1/state.json] for collection [collection1] has occurred - updating... (live nodes size: [5])
[junit4] 2> 169539 WARN (coreLoadExecutor-1409-thread-1-processing-n:127.0.0.1:46523_) [n:127.0.0.1:46523_ c:collection1 x:collection1] o.a.s.c.Config Beginning with Solr 5.5, <mergePolicy> is deprecated, use <mergePolicyFactory> instead.
[junit4] 2> 169539 INFO (coreLoadExecutor-1409-thread-1-processing-n:127.0.0.1:46523_) [n:127.0.0.1:46523_ c:collection1 x:collection1] o.a.s.c.SolrConfig Using Lucene MatchVersion: 6.6.0
[junit4] 2> 169567 INFO (coreLoadExecutor-1409-thread-1-processing-n:127.0.0.1:46523_) [n:127.0.0.1:46523_ c:collection1 x:collection1] o.a.s.s.IndexSchema [collection1] Schema name=test
[junit4] 2> 169641 WARN (coreLoadExecutor-1409-thread-1-processing-n:127.0.0.1:46523_) [n:127.0.0.1:46523_ c:collection1 x:collection1] o.a.s.s.IndexSchema [collection1] default search field in schema is text. WARNING: Deprecated, please use 'df' on request instead.
[junit4] 2> 169642 INFO (coreLoadExecutor-1409-thread-1-processing-n:127.0.0.1:46523_) [n:127.0.0.1:46523_ c:collection1 x:collection1] o.a.s.s.IndexSchema Loaded schema test/1.6 with uniqueid field id
[junit4] 2> 169668 INFO (coreLoadExecutor-1409-thread-1-processing-n:127.0.0.1:46523_) [n:127.0.0.1:46523_ c:collection1 x:collection1] o.a.s.c.CoreContainer Creating SolrCore 'collection1' using configuration from collection collection1, trusted=true
[junit4] 2> 169668 INFO (coreLoadExecutor-1409-thread-1-processing-n:127.0.0.1:46523_) [n:127.0.0.1:46523_ c:collection1 x:collection1] o.a.s.c.SolrCore solr.RecoveryStrategy.Builder
[junit4] 2> 169668 INFO (coreLoadExecutor-1409-thread-1-processing-n:127.0.0.1:46523_) [n:127.0.0.1:46523_ c:collection1 x:collection1] o.a.s.c.SolrCore [[collection1] ] Opening new SolrCore at [/export/home/jenkins/workspace/Lucene-Solr-6.x-Solaris/solr/build/solr-core/test/J1/temp/solr.cloud.ShardSplitTest_F66B59B6E2C1936E-001/shard-4-001/cores/collection1], dataDir=[/export/home/jenkins/workspace/Lucene-Solr-6.x-Solaris/solr/build/solr-core/test/J1/temp/solr.cloud.ShardSplitTest_F66B59B6E2C1936E-001/shard-4-001/cores/collection1/data/]
[junit4] 2> 169669 INFO (coreLoadExecutor-1409-thread-1-processing-n:127.0.0.1:46523_) [n:127.0.0.1:46523_ c:collection1 x:collection1] o.a.s.c.JmxMonitoredMap JMX monitoring is enabled. Adding Solr mbeans to JMX Server: com.sun.jmx.mbeanserver.JmxMBeanServer@5298713f
[junit4] 2> 169671 INFO (coreLoadExecutor-1409-thread-1-processing-n:127.0.0.1:46523_) [n:127.0.0.1:46523_ c:collection1 x:collection1] o.a.s.u.RandomMergePolicy RandomMergePolicy wrapping class org.apache.lucene.inde
[...truncated too long message...]
r:core_node3 x:collection1] o.a.s.c.SyncStrategy Sync Success - now sync replicas to me
[junit4] 2> 819258 INFO (zkCallback-1535-thread-2-processing-n:127.0.0.1:50252_) [n:127.0.0.1:50252_ c:collection1 s:shard2 r:core_node3 x:collection1] o.a.s.c.SyncStrategy http://127.0.0.1:50252/collection1/ has no replicas
[junit4] 2> 819275 INFO (zkCallback-1535-thread-2-processing-n:127.0.0.1:50252_) [n:127.0.0.1:50252_ c:collection1 s:shard2 r:core_node3 x:collection1] o.a.s.c.ShardLeaderElectionContext I am the new leader: http://127.0.0.1:50252/collection1/ shard2
[junit4] 2> 819393 INFO (zkCallback-1542-thread-2-processing-n:127.0.0.1:41432_) [n:127.0.0.1:41432_ ] o.a.s.c.c.ZkStateReader A cluster state change: [WatchedEvent state:SyncConnected type:NodeDataChanged path:/collections/collection1/state.json] for collection [collection1] has occurred - updating... (live nodes size: [2])
[junit4] 2> 819393 INFO (zkCallback-1535-thread-4-processing-n:127.0.0.1:50252_) [n:127.0.0.1:50252_ ] o.a.s.c.c.ZkStateReader A cluster state change: [WatchedEvent state:SyncConnected type:NodeDataChanged path:/collections/collection1/state.json] for collection [collection1] has occurred - updating... (live nodes size: [2])
[junit4] 2> 819985 WARN (zkCallback-1529-thread-1-processing-n:127.0.0.1:33930_) [n:127.0.0.1:33930_ ] o.a.s.c.c.ZkStateReader ZooKeeper watch triggered, but Solr cannot talk to ZK: [KeeperErrorCode = Session expired for /live_nodes]
[junit4] 2> 819986 INFO (TEST-ShardSplitTest.testSplitAfterFailedSplit-seed#[F66B59B6E2C1936E]) [ ] o.a.s.m.SolrMetricManager Closing metric reporters for: solr.node
[junit4] 2> 819988 INFO (TEST-ShardSplitTest.testSplitAfterFailedSplit-seed#[F66B59B6E2C1936E]) [ ] o.e.j.s.AbstractConnector Stopped ServerConnector@170e676a{HTTP/1.1,[http/1.1]}{127.0.0.1:0}
[junit4] 2> 819988 INFO (TEST-ShardSplitTest.testSplitAfterFailedSplit-seed#[F66B59B6E2C1936E]) [ ] o.e.j.s.h.ContextHandler Stopped o.e.j.s.ServletContextHandler@15974d1e{/,null,UNAVAILABLE}
[junit4] 2> 819989 INFO (TEST-ShardSplitTest.testSplitAfterFailedSplit-seed#[F66B59B6E2C1936E]) [ ] o.a.s.c.ChaosMonkey monkey: stop shard! 50252
[junit4] 2> 819989 INFO (TEST-ShardSplitTest.testSplitAfterFailedSplit-seed#[F66B59B6E2C1936E]) [ ] o.a.s.c.CoreContainer Shutting down CoreContainer instance=1078918684
[junit4] 2> 819997 INFO (coreCloseExecutor-2025-thread-1) [n:127.0.0.1:50252_ c:collection1 s:shard2 r:core_node3 x:collection1] o.a.s.c.SolrCore [collection1] CLOSING SolrCore org.apache.solr.core.SolrCore@4c8aa8a0
[junit4] 2> 820029 INFO (coreCloseExecutor-2025-thread-1) [n:127.0.0.1:50252_ c:collection1 s:shard2 r:core_node3 x:collection1] o.a.s.m.SolrMetricManager Closing metric reporters for: solr.core.collection1
[junit4] 2> 820032 INFO (TEST-ShardSplitTest.testSplitAfterFailedSplit-seed#[F66B59B6E2C1936E]) [ ] o.a.s.c.Overseer Overseer (id=97782798834139151-127.0.0.1:50252_-n_0000000003) closing
[junit4] 2> 820032 INFO (OverseerStateUpdate-97782798834139151-127.0.0.1:50252_-n_0000000003) [n:127.0.0.1:50252_ ] o.a.s.c.Overseer Overseer Loop exiting : 127.0.0.1:50252_
[junit4] 2> 820040 INFO (zkCallback-1517-thread-1) [ ] o.a.s.c.c.ZkStateReader Updated live nodes from ZooKeeper... (2) -> (1)
[junit4] 2> 820041 INFO (TEST-ShardSplitTest.testSplitAfterFailedSplit-seed#[F66B59B6E2C1936E]) [ ] o.a.s.m.SolrMetricManager Closing metric reporters for: solr.node
[junit4] 2> 820046 INFO (TEST-ShardSplitTest.testSplitAfterFailedSplit-seed#[F66B59B6E2C1936E]) [ ] o.e.j.s.AbstractConnector Stopped ServerConnector@366d6e59{HTTP/1.1,[http/1.1]}{127.0.0.1:0}
[junit4] 2> 820047 INFO (TEST-ShardSplitTest.testSplitAfterFailedSplit-seed#[F66B59B6E2C1936E]) [ ] o.e.j.s.h.ContextHandler Stopped o.e.j.s.ServletContextHandler@317ea5bf{/,null,UNAVAILABLE}
[junit4] 2> 820046 INFO (zkCallback-1542-thread-2-processing-n:127.0.0.1:41432_) [n:127.0.0.1:41432_ ] o.a.s.c.c.ZkStateReader Updated live nodes from ZooKeeper... (2) -> (1)
[junit4] 2> 820046 INFO (zkCallback-1542-thread-3-processing-n:127.0.0.1:41432_) [n:127.0.0.1:41432_ ] o.a.s.c.OverseerElectionContext I am going to be the leader 127.0.0.1:41432_
[junit4] 2> 820049 INFO (TEST-ShardSplitTest.testSplitAfterFailedSplit-seed#[F66B59B6E2C1936E]) [ ] o.a.s.c.ChaosMonkey monkey: stop shard! 41432
[junit4] 2> 820049 INFO (TEST-ShardSplitTest.testSplitAfterFailedSplit-seed#[F66B59B6E2C1936E]) [ ] o.a.s.c.CoreContainer Shutting down CoreContainer instance=203999233
[junit4] 2> 820062 INFO (zkCallback-1517-thread-1) [ ] o.a.s.c.c.ZkStateReader Updated live nodes from ZooKeeper... (1) -> (0)
[junit4] 2> 820989 WARN (zkCallback-1542-thread-1-processing-n:127.0.0.1:41432_) [n:127.0.0.1:41432_ c:collection1 s:shard1 r:core_node4 x:collection1] o.a.s.c.SyncStrategy Closed, skipping sync up.
[junit4] 2> 820990 INFO (zkCallback-1542-thread-1-processing-n:127.0.0.1:41432_) [n:127.0.0.1:41432_ c:collection1 s:shard1 r:core_node4 x:collection1] o.a.s.c.ShardLeaderElectionContext We failed sync, but we have no versions - we can't sync in that case - we were active before, so become leader anyway
[junit4] 2> 820990 INFO (zkCallback-1542-thread-1-processing-n:127.0.0.1:41432_) [n:127.0.0.1:41432_ c:collection1 s:shard1 r:core_node4 x:collection1] o.a.s.c.SolrCore [collection1] CLOSING SolrCore org.apache.solr.core.SolrCore@307114b4
[junit4] 2> 821032 INFO (zkCallback-1542-thread-1-processing-n:127.0.0.1:41432_) [n:127.0.0.1:41432_ c:collection1 s:shard1 r:core_node4 x:collection1] o.a.s.m.SolrMetricManager Closing metric reporters for: solr.core.collection1
[junit4] 2> 821562 WARN (zkCallback-1542-thread-3-processing-n:127.0.0.1:41432_) [n:127.0.0.1:41432_ ] o.a.s.c.c.ZkStateReader ZooKeeper watch triggered, but Solr cannot talk to ZK: [KeeperErrorCode = Session expired for /live_nodes]
[junit4] 2> 821563 INFO (TEST-ShardSplitTest.testSplitAfterFailedSplit-seed#[F66B59B6E2C1936E]) [ ] o.a.s.m.SolrMetricManager Closing metric reporters for: solr.node
[junit4] 2> 821564 INFO (TEST-ShardSplitTest.testSplitAfterFailedSplit-seed#[F66B59B6E2C1936E]) [ ] o.e.j.s.AbstractConnector Stopped ServerConnector@6c3bc602{HTTP/1.1,[http/1.1]}{127.0.0.1:0}
[junit4] 2> 821565 INFO (TEST-ShardSplitTest.testSplitAfterFailedSplit-seed#[F66B59B6E2C1936E]) [ ] o.e.j.s.h.ContextHandler Stopped o.e.j.s.ServletContextHandler@5d075aaf{/,null,UNAVAILABLE}
[junit4] 2> 821569 INFO (TEST-ShardSplitTest.testSplitAfterFailedSplit-seed#[F66B59B6E2C1936E]) [ ] o.a.s.c.ChaosMonkey monkey: stop shard! 54390
[junit4] 2> 821571 INFO (TEST-ShardSplitTest.testSplitAfterFailedSplit-seed#[F66B59B6E2C1936E]) [ ] o.a.s.c.ZkTestServer connecting to 127.0.0.1:53608 53608
[junit4] 2> 821618 INFO (Thread-698) [ ] o.a.s.c.ZkTestServer connecting to 127.0.0.1:53608 53608
[junit4] 2> 821620 WARN (Thread-698) [ ] o.a.s.c.ZkTestServer Watch limit violations:
[junit4] 2> Maximum concurrent create/delete watches above limit:
[junit4] 2>
[junit4] 2> 6 /solr/aliases.json
[junit4] 2> 6 /solr/clusterprops.json
[junit4] 2> 5 /solr/security.json
[junit4] 2> 5 /solr/configs/conf1
[junit4] 2>
[junit4] 2> Maximum concurrent data watches above limit:
[junit4] 2>
[junit4] 2> 6 /solr/clusterstate.json
[junit4] 2> 4 /solr/collections/collection1/state.json
[junit4] 2>
[junit4] 2> Maximum concurrent children watches above limit:
[junit4] 2>
[junit4] 2> 86 /solr/overseer/queue
[junit4] 2> 18 /solr/overseer/collection-queue-work
[junit4] 2> 13 /solr/overseer/queue-work
[junit4] 2> 6 /solr/live_nodes
[junit4] 2> 6 /solr/collections
[junit4] 2>
[junit4] 2> 821623 INFO (SUITE-ShardSplitTest-seed#[F66B59B6E2C1936E]-worker) [ ] o.a.s.SolrTestCaseJ4 ###deleteCore
[junit4] 2> NOTE: leaving temporary files on disk at: /export/home/jenkins/workspace/Lucene-Solr-6.x-Solaris/solr/build/solr-core/test/J1/temp/solr.cloud.ShardSplitTest_F66B59B6E2C1936E-001
[junit4] 2> Apr 13, 2017 1:32:24 AM com.carrotsearch.randomizedtesting.ThreadLeakControl checkThreadLeaks
[junit4] 2> WARNING: Will linger awaiting termination of 2 leaked thread(s).
[junit4] 2> NOTE: test params are: codec=Asserting(Lucene62): {rnd_b=FSTOrd50, shard_s=PostingsFormat(name=MockRandom), n_ti=PostingsFormat(name=MockRandom), a_t=PostingsFormat(name=MockRandom), a_i=FSTOrd50, id=FSTOrd50}, docValues:{rnd_b=DocValuesFormat(name=Lucene54), shard_s=DocValuesFormat(name=Direct), _version_=DocValuesFormat(name=Direct), n_ti=DocValuesFormat(name=Direct), a_t=DocValuesFormat(name=Direct), a_i=DocValuesFormat(name=Lucene54), id=DocValuesFormat(name=Lucene54)}, maxPointsInLeafNode=1135, maxMBSortInHeap=5.974810752667163, sim=RandomSimilarity(queryNorm=true,coord=crazy): {}, locale=ko, timezone=Etc/Zulu
[junit4] 2> NOTE: SunOS 5.11 amd64/Oracle Corporation 1.8.0_121 (64-bit)/cpus=3,threads=1,free=151442912,total=536870912
[junit4] 2> NOTE: All tests run in this JVM: [SecurityConfHandlerTest, StatsReloadRaceTest, URLClassifyProcessorTest, TestBulkSchemaAPI, SpellingQueryConverterTest, TestStressCloudBlindAtomicUpdates, UUIDUpdateProcessorFallbackTest, LukeRequestHandlerTest, SSLMigrationTest, ZkStateReaderTest, TestCollectionAPI, BigEndianAscendingWordDeserializerTest, TestSolrXml, TestCoreAdminApis, TestComplexPhraseQParserPlugin, TestSearcherReuse, TestTrackingShardHandlerFactory, HLLUtilTest, ClusterStateTest, TestNoOpRegenerator, MBeansHandlerTest, TestLuceneMatchVersion, FileBasedSpellCheckerTest, TestSolrConfigHandlerCloud, TestJavabinTupleStreamParser, TestInitParams, ShardSplitTest]
[junit4] Completed [142/704 (1!)] on J1 in 662.74s, 5 tests, 1 failure <<< FAILURES!
[...truncated 45231 lines...]