You are viewing a plain text version of this content. The canonical link for it is here.
Posted to builds@beam.apache.org by Apache Jenkins Server <je...@builds.apache.org> on 2020/08/24 12:08:54 UTC

Build failed in Jenkins: beam_PostCommit_Website_Publish #6659

See <https://ci-beam.apache.org/job/beam_PostCommit_Website_Publish/6659/display/redirect>

Changes:


------------------------------------------
Started by timer
Running as SYSTEM
[EnvInject] - Loading node environment variables.
Building remotely on websites1 (git-websites svn-websites) in workspace <https://ci-beam.apache.org/job/beam_PostCommit_Website_Publish/ws/>
No credentials specified
Wiping out workspace first.
Cloning the remote Git repository
Cloning repository https://github.com/apache/beam.git
 > git init <https://ci-beam.apache.org/job/beam_PostCommit_Website_Publish/ws/src> # timeout=10
Fetching upstream changes from https://github.com/apache/beam.git
 > git --version # timeout=10
 > git fetch --tags --progress -- https://github.com/apache/beam.git +refs/heads/*:refs/remotes/origin/* # timeout=10
 > git config remote.origin.url https://github.com/apache/beam.git # timeout=10
 > git config --add remote.origin.fetch +refs/heads/*:refs/remotes/origin/* # timeout=10
 > git config remote.origin.url https://github.com/apache/beam.git # timeout=10
Fetching upstream changes from https://github.com/apache/beam.git
 > git fetch --tags --progress -- https://github.com/apache/beam.git +refs/heads/*:refs/remotes/origin/* +refs/pull/${ghprbPullId}/*:refs/remotes/origin/pr/${ghprbPullId}/* # timeout=10
 > git rev-parse origin/master^{commit} # timeout=10
Checking out Revision 4172ce2eac2c603e8fe6b352857285293df0985c (origin/master)
 > git config core.sparsecheckout # timeout=10
 > git checkout -f 4172ce2eac2c603e8fe6b352857285293df0985c # timeout=10
Commit message: "Merge pull request #12653 from [BEAM-10758] Centralized Glob Translation Method"
 > git rev-list --no-walk 4172ce2eac2c603e8fe6b352857285293df0985c # timeout=10
No emails were triggered.
[EnvInject] - Executing scripts and injecting environment variables after the SCM step.
[EnvInject] - Injecting as environment variables the properties content 
SPARK_LOCAL_IP=127.0.0.1

[EnvInject] - Variables injected successfully.
[Gradle] - Launching build.
[src] $ <https://ci-beam.apache.org/job/beam_PostCommit_Website_Publish/ws/src/gradlew> --continue --max-workers=12 -Dorg.gradle.jvmargs=-Xms2g -Dorg.gradle.jvmargs=-Xmx4g -Pdocker-pull-licenses :website:clean :website:publishWebsite
To honour the JVM settings for this build a new JVM will be forked. Please consider using the daemon: https://docs.gradle.org/5.2.1/userguide/gradle_daemon.html.
Daemon will be stopped at the end of the build stopping after processing
> Task :buildSrc:compileJava NO-SOURCE
> Task :buildSrc:compileGroovy FROM-CACHE
> Task :buildSrc:pluginDescriptors
> Task :buildSrc:processResources
> Task :buildSrc:classes
> Task :buildSrc:jar
> Task :buildSrc:assemble
> Task :buildSrc:spotlessGroovy
> Task :buildSrc:spotlessGroovyCheck
> Task :buildSrc:spotlessGroovyGradle
> Task :buildSrc:spotlessGroovyGradleCheck
> Task :buildSrc:spotlessCheck
> Task :buildSrc:pluginUnderTestMetadata
> Task :buildSrc:compileTestJava NO-SOURCE
> Task :buildSrc:compileTestGroovy NO-SOURCE
> Task :buildSrc:processTestResources NO-SOURCE
> Task :buildSrc:testClasses UP-TO-DATE
> Task :buildSrc:test NO-SOURCE
> Task :buildSrc:validateTaskProperties FROM-CACHE
> Task :buildSrc:check
> Task :buildSrc:build
Configuration on demand is an incubating feature.
> Task :website:cleanWebsite UP-TO-DATE
> Task :website:clean UP-TO-DATE

> Task :website:buildDockerImage
Sending build context to Docker daemon  48.35MB
Step 1/8 : FROM debian:stretch-slim
 ---> 8ff748cdd6b1
Step 2/8 : SHELL ["/bin/bash", "-o", "pipefail", "-e", "-u", "-x", "-c"]
 ---> Using cache
 ---> d133e66c9c57
Step 3/8 : ENV DEBIAN_FRONTEND=noninteractive     LANGUAGE=C.UTF-8     LANG=C.UTF-8     LC_ALL=C.UTF-8     LC_CTYPE=C.UTF-8     LC_MESSAGES=C.UTF-8
 ---> Using cache
 ---> a2b4c1866e24
Step 4/8 : RUN apt-get update     && apt-get install -y --no-install-recommends         ca-certificates         curl         git         gnupg2         gosu         lynx     && apt-get autoremove -yqq --purge     && apt-get clean     && rm -rf /var/lib/apt/lists/*
 ---> Using cache
 ---> 31bea9d298b5
Step 5/8 : RUN curl -sL https://deb.nodesource.com/setup_10.x | bash -     && apt-get update     && apt-get install -y --no-install-recommends         nodejs     && apt-get autoremove -yqq --purge     && apt-get clean     && rm -rf /var/lib/apt/lists/*
 ---> Using cache
 ---> 65e26af631fe
Step 6/8 : RUN curl -sS https://dl.yarnpkg.com/debian/pubkey.gpg | apt-key add -     && echo "deb https://dl.yarnpkg.com/debian/ stable main" | tee /etc/apt/sources.list.d/yarn.list     && apt-get update     && apt-get install -y --no-install-recommends yarn     && apt-get autoremove -yqq --purge     && apt-get clean     && rm -rf /var/lib/apt/lists/*
 ---> Using cache
 ---> 026dac6d2d34
Step 7/8 : RUN HUGOHOME="$(mktemp -d)"     && export HUGOHOME     && curl -sL https://github.com/gohugoio/hugo/releases/download/v0.68.3/hugo_extended_0.68.3_Linux-64bit.tar.gz > "${HUGOHOME}/hugo.tar.gz"     && tar -xzvf "${HUGOHOME}/hugo.tar.gz" hugo     && mv hugo /usr/local/bin/hugo     && chmod +x /usr/local/bin/hugo     && rm -r "${HUGOHOME}"
 ---> Using cache
 ---> d1b8f6f7124a
Step 8/8 : WORKDIR /opt/
 ---> Using cache
 ---> 04d1500c7140
Successfully built 04d1500c7140
Successfully tagged beam-website:latest

> Task :website:createDockerContainer

> Task :website:startDockerContainer
34e0a3421cc4b78905c77ddebc8752e81dbd48df173e0f297b8eb2b52e0fa8a7

> Task :website:setupDockerContainer

> Task :website:installDependencies
yarn install v1.22.4
warning Skipping preferred cache folder "/.cache/yarn" because it is not writable.
warning Selected the next writable cache folder in the list, will be "/tmp/.yarn-cache-910".
[1/4] Resolving packages...
[2/4] Fetching packages...
info fsevents@2.1.3: The platform "linux" is incompatible with this module.
info "fsevents@2.1.3" is an optional dependency and failed compatibility check. Excluding it from installation.
[3/4] Linking dependencies...
info Visit https://yarnpkg.com/en/docs/cli/install for documentation about this command.
error Could not write file "/opt/website/www/yarn-error.log": "EACCES: permission denied, open '/opt/website/www/yarn-error.log'"
error An unexpected error occurred: "EACCES: permission denied, mkdir '/opt/website/www/node_modules'".

> Task :website:installDependencies FAILED

> Task :website:initGitSubmodules FAILED
error: could not lock config file .git/config: Permission denied
fatal: Failed to register url for submodule path 'website/www/site/themes/docsy'

> Task :website:buildCodeSamples FAILED
yarn run v1.22.4
warning Skipping preferred cache folder "/.cache/yarn" because it is not writable.
warning Selected the next writable cache folder in the list, will be "/tmp/.yarn-cache-910".
$ ./build_code_samples.sh
warning Cannot find a suitable global folder. Tried these: "/usr/local, /.yarn"
Working directory: /opt/website/www
Dist directory: ./site/code_samples
mkdir: cannot create directory ‘./site/code_samples’: Permission denied
error Command failed with exit code 1.
info Visit https://yarnpkg.com/en/docs/cli/run for documentation about this command.

> Task :website:buildApacheWebsite FAILED
yarn run v1.22.4
warning Skipping preferred cache folder "/.cache/yarn" because it is not writable.
warning Selected the next writable cache folder in the list, will be "/tmp/.yarn-cache-910".
$ cross-env HUGO_ENV=production hugo --minify -d ../dist -s site -v -d /opt/build/website/generated-apache-content --config /opt/website/www/site/config.toml
warning Cannot find a suitable global folder. Tried these: "/usr/local, /.yarn"
/bin/sh: 1: cross-env: not found
error Command failed with exit code 127.
info Visit https://yarnpkg.com/en/docs/cli/run for documentation about this command.

> Task :website:stopAndRemoveDockerContainer
34e0a3421cc4b78905c77ddebc8752e81dbd48df173e0f297b8eb2b52e0fa8a7

FAILURE: Build completed with 4 failures.

1: Task failed with an exception.
-----------
* What went wrong:
Execution failed for task ':website:installDependencies'.
> Process 'command 'docker'' finished with non-zero exit value 1

* Try:
Run with --stacktrace option to get the stack trace. Run with --info or --debug option to get more log output. Run with --scan to get full insights.
==============================================================================

2: Task failed with an exception.
-----------
* What went wrong:
Execution failed for task ':website:initGitSubmodules'.
> Process 'command 'docker'' finished with non-zero exit value 128

* Try:
Run with --stacktrace option to get the stack trace. Run with --info or --debug option to get more log output. Run with --scan to get full insights.
==============================================================================

3: Task failed with an exception.
-----------
* What went wrong:
Execution failed for task ':website:buildCodeSamples'.
> Process 'command 'docker'' finished with non-zero exit value 1

* Try:
Run with --stacktrace option to get the stack trace. Run with --info or --debug option to get more log output. Run with --scan to get full insights.
==============================================================================

4: Task failed with an exception.
-----------
* What went wrong:
Execution failed for task ':website:buildApacheWebsite'.
> Process 'command 'docker'' finished with non-zero exit value 127

* Try:
Run with --stacktrace option to get the stack trace. Run with --info or --debug option to get more log output. Run with --scan to get full insights.
==============================================================================

* Get more help at https://help.gradle.org

Deprecated Gradle features were used in this build, making it incompatible with Gradle 6.0.
Use '--warning-mode all' to show the individual deprecation warnings.
See https://docs.gradle.org/5.2.1/userguide/command_line_interface.html#sec:command_line_warnings

BUILD FAILED in 44s
11 actionable tasks: 9 executed, 2 up-to-date

Publishing build scan...
https://gradle.com/s/4fwr7f2zp3u4m

Build step 'Invoke Gradle script' changed build result to FAILURE
Build step 'Invoke Gradle script' marked build as failure

---------------------------------------------------------------------
To unsubscribe, e-mail: builds-unsubscribe@beam.apache.org
For additional commands, e-mail: builds-help@beam.apache.org


Jenkins build is back to normal : beam_PostCommit_Website_Publish #6678

Posted by Apache Jenkins Server <je...@builds.apache.org>.
See <https://ci-beam.apache.org/job/beam_PostCommit_Website_Publish/6678/display/redirect?page=changes>


---------------------------------------------------------------------
To unsubscribe, e-mail: builds-unsubscribe@beam.apache.org
For additional commands, e-mail: builds-help@beam.apache.org


Build failed in Jenkins: beam_PostCommit_Website_Publish #6677

Posted by Apache Jenkins Server <je...@builds.apache.org>.
See <https://ci-beam.apache.org/job/beam_PostCommit_Website_Publish/6677/display/redirect>

Changes:


------------------------------------------
Started by user Udi Meiri
Running as SYSTEM
[EnvInject] - Loading node environment variables.
Building remotely on websites1 (git-websites svn-websites) in workspace <https://ci-beam.apache.org/job/beam_PostCommit_Website_Publish/ws/>
No credentials specified
Wiping out workspace first.
Cloning the remote Git repository
Cloning repository https://github.com/apache/beam.git
 > git init <https://ci-beam.apache.org/job/beam_PostCommit_Website_Publish/ws/src> # timeout=10
Fetching upstream changes from https://github.com/apache/beam.git
 > git --version # timeout=10
 > git fetch --tags --progress -- https://github.com/apache/beam.git +refs/heads/*:refs/remotes/origin/* # timeout=10
 > git config remote.origin.url https://github.com/apache/beam.git # timeout=10
 > git config --add remote.origin.fetch +refs/heads/*:refs/remotes/origin/* # timeout=10
 > git config remote.origin.url https://github.com/apache/beam.git # timeout=10
Fetching upstream changes from https://github.com/apache/beam.git
 > git fetch --tags --progress -- https://github.com/apache/beam.git +refs/heads/*:refs/remotes/origin/* +refs/pull/${ghprbPullId}/*:refs/remotes/origin/pr/${ghprbPullId}/* # timeout=10
 > git rev-parse cedea5e61cd448b50f6791bdece7dfc94f127da6^{commit} # timeout=10
 > git rev-parse origin/cedea5e61cd448b50f6791bdece7dfc94f127da6^{commit} # timeout=10
 > git rev-parse cedea5e61cd448b50f6791bdece7dfc94f127da6^{commit} # timeout=10
ERROR: Couldn't find any revision to build. Verify the repository and branch configuration for this job.

---------------------------------------------------------------------
To unsubscribe, e-mail: builds-unsubscribe@beam.apache.org
For additional commands, e-mail: builds-help@beam.apache.org


Build failed in Jenkins: beam_PostCommit_Website_Publish #6676

Posted by Apache Jenkins Server <je...@builds.apache.org>.
See <https://ci-beam.apache.org/job/beam_PostCommit_Website_Publish/6676/display/redirect?page=changes>

Changes:

[noreply] [BEAM-10409] Add combiner packing to graph optimizer phases (#12185)


------------------------------------------
Started by timer
Running as SYSTEM
[EnvInject] - Loading node environment variables.
Building remotely on websites1 (git-websites svn-websites) in workspace <https://ci-beam.apache.org/job/beam_PostCommit_Website_Publish/ws/>
No credentials specified
Wiping out workspace first.
Cloning the remote Git repository
Cloning repository https://github.com/apache/beam.git
 > git init <https://ci-beam.apache.org/job/beam_PostCommit_Website_Publish/ws/src> # timeout=10
Fetching upstream changes from https://github.com/apache/beam.git
 > git --version # timeout=10
 > git fetch --tags --progress -- https://github.com/apache/beam.git +refs/heads/*:refs/remotes/origin/* # timeout=10
 > git config remote.origin.url https://github.com/apache/beam.git # timeout=10
 > git config --add remote.origin.fetch +refs/heads/*:refs/remotes/origin/* # timeout=10
 > git config remote.origin.url https://github.com/apache/beam.git # timeout=10
Fetching upstream changes from https://github.com/apache/beam.git
 > git fetch --tags --progress -- https://github.com/apache/beam.git +refs/heads/*:refs/remotes/origin/* +refs/pull/${ghprbPullId}/*:refs/remotes/origin/pr/${ghprbPullId}/* # timeout=10
 > git rev-parse origin/master^{commit} # timeout=10
Checking out Revision 2e77e46d35e4e37cc3953cc3a725fe94b12cde08 (origin/master)
 > git config core.sparsecheckout # timeout=10
 > git checkout -f 2e77e46d35e4e37cc3953cc3a725fe94b12cde08 # timeout=10
Commit message: "[BEAM-10409] Add combiner packing to graph optimizer phases (#12185)"
 > git rev-list --no-walk 78d7636cac9234dbcc7145bb0330275c557c0010 # timeout=10
No emails were triggered.
[EnvInject] - Executing scripts and injecting environment variables after the SCM step.
[EnvInject] - Injecting as environment variables the properties content 
SPARK_LOCAL_IP=127.0.0.1

[EnvInject] - Variables injected successfully.
[Gradle] - Launching build.
[src] $ <https://ci-beam.apache.org/job/beam_PostCommit_Website_Publish/ws/src/gradlew> --continue --max-workers=12 -Dorg.gradle.jvmargs=-Xms2g -Dorg.gradle.jvmargs=-Xmx4g -Pdocker-pull-licenses :website:clean :website:publishWebsite
To honour the JVM settings for this build a new JVM will be forked. Please consider using the daemon: https://docs.gradle.org/5.2.1/userguide/gradle_daemon.html.
Daemon will be stopped at the end of the build stopping after processing
> Task :buildSrc:compileJava NO-SOURCE
> Task :buildSrc:compileGroovy FROM-CACHE
> Task :buildSrc:pluginDescriptors
> Task :buildSrc:processResources
> Task :buildSrc:classes
> Task :buildSrc:jar
> Task :buildSrc:assemble
> Task :buildSrc:spotlessGroovy
> Task :buildSrc:spotlessGroovyCheck
> Task :buildSrc:spotlessGroovyGradle
> Task :buildSrc:spotlessGroovyGradleCheck
> Task :buildSrc:spotlessCheck
> Task :buildSrc:pluginUnderTestMetadata
> Task :buildSrc:compileTestJava NO-SOURCE
> Task :buildSrc:compileTestGroovy NO-SOURCE
> Task :buildSrc:processTestResources NO-SOURCE
> Task :buildSrc:testClasses UP-TO-DATE
> Task :buildSrc:test NO-SOURCE
> Task :buildSrc:validateTaskProperties FROM-CACHE
> Task :buildSrc:check
> Task :buildSrc:build
Configuration on demand is an incubating feature.
> Task :website:cleanWebsite UP-TO-DATE
> Task :website:clean UP-TO-DATE

> Task :website:buildDockerImage
Sending build context to Docker daemon  48.37MB
Step 1/8 : FROM debian:stretch-slim
 ---> 8ff748cdd6b1
Step 2/8 : SHELL ["/bin/bash", "-o", "pipefail", "-e", "-u", "-x", "-c"]
 ---> Using cache
 ---> e34c4df1e02e
Step 3/8 : ENV DEBIAN_FRONTEND=noninteractive     LANGUAGE=C.UTF-8     LANG=C.UTF-8     LC_ALL=C.UTF-8     LC_CTYPE=C.UTF-8     LC_MESSAGES=C.UTF-8
 ---> Using cache
 ---> 757069dfbc50
Step 4/8 : RUN apt-get update     && apt-get install -y --no-install-recommends         ca-certificates         curl         git         gnupg2         gosu         lynx     && apt-get autoremove -yqq --purge     && apt-get clean     && rm -rf /var/lib/apt/lists/*
 ---> Using cache
 ---> 296e1e0d5cf8
Step 5/8 : RUN curl -sL https://deb.nodesource.com/setup_10.x | bash -     && apt-get update     && apt-get install -y --no-install-recommends         nodejs     && apt-get autoremove -yqq --purge     && apt-get clean     && rm -rf /var/lib/apt/lists/*
 ---> Using cache
 ---> 8e22d2bec517
Step 6/8 : RUN curl -sS https://dl.yarnpkg.com/debian/pubkey.gpg | apt-key add -     && echo "deb https://dl.yarnpkg.com/debian/ stable main" | tee /etc/apt/sources.list.d/yarn.list     && apt-get update     && apt-get install -y --no-install-recommends yarn     && apt-get autoremove -yqq --purge     && apt-get clean     && rm -rf /var/lib/apt/lists/*
 ---> Using cache
 ---> 5a2a0e98de69
Step 7/8 : RUN HUGOHOME="$(mktemp -d)"     && export HUGOHOME     && curl -sL https://github.com/gohugoio/hugo/releases/download/v0.68.3/hugo_extended_0.68.3_Linux-64bit.tar.gz > "${HUGOHOME}/hugo.tar.gz"     && tar -xzvf "${HUGOHOME}/hugo.tar.gz" hugo     && mv hugo /usr/local/bin/hugo     && chmod +x /usr/local/bin/hugo     && rm -r "${HUGOHOME}"
 ---> Using cache
 ---> 4383f962e28a
Step 8/8 : WORKDIR /opt/
 ---> Using cache
 ---> 47a979744ea8
Successfully built 47a979744ea8
Successfully tagged beam-website:latest

> Task :website:createDockerContainer

> Task :website:startDockerContainer
a83d16f5e9852b2eb11a2985f2f54eb08e967ebdc44967336f8027c0e078c4dc

> Task :website:setupDockerContainer

> Task :website:installDependencies
yarn install v1.22.4
warning Skipping preferred cache folder "/.cache/yarn" because it is not writable.
warning Selected the next writable cache folder in the list, will be "/tmp/.yarn-cache-910".
[1/4] Resolving packages...
[2/4] Fetching packages...
info fsevents@2.1.3: The platform "linux" is incompatible with this module.
info "fsevents@2.1.3" is an optional dependency and failed compatibility check. Excluding it from installation.
[3/4] Linking dependencies...
info Visit https://yarnpkg.com/en/docs/cli/install for documentation about this command.
error Could not write file "/opt/website/www/yarn-error.log": "EACCES: permission denied, open '/opt/website/www/yarn-error.log'"
error An unexpected error occurred: "EACCES: permission denied, mkdir '/opt/website/www/node_modules'".

> Task :website:installDependencies FAILED

> Task :website:initGitSubmodules FAILED
error: could not lock config file .git/config: Permission denied
fatal: Failed to register url for submodule path 'website/www/site/themes/docsy'

> Task :website:buildCodeSamples FAILED
yarn run v1.22.4
warning Skipping preferred cache folder "/.cache/yarn" because it is not writable.
warning Selected the next writable cache folder in the list, will be "/tmp/.yarn-cache-910".
$ ./build_code_samples.sh
warning Cannot find a suitable global folder. Tried these: "/usr/local, /.yarn"
Working directory: /opt/website/www
Dist directory: ./site/code_samples
mkdir: cannot create directory ‘./site/code_samples’: Permission denied
info Visit https://yarnpkg.com/en/docs/cli/run for documentation about this command.
error Command failed with exit code 1.

> Task :website:buildApacheWebsite FAILED
yarn run v1.22.4
warning Skipping preferred cache folder "/.cache/yarn" because it is not writable.
warning Selected the next writable cache folder in the list, will be "/tmp/.yarn-cache-910".
$ cross-env HUGO_ENV=production hugo --minify -d ../dist -s site -v -d /opt/build/website/generated-apache-content --config /opt/website/www/site/config.toml
warning Cannot find a suitable global folder. Tried these: "/usr/local, /.yarn"
/bin/sh: 1: cross-env: not found
error Command failed with exit code 127.
info Visit https://yarnpkg.com/en/docs/cli/run for documentation about this command.

> Task :website:stopAndRemoveDockerContainer
a83d16f5e9852b2eb11a2985f2f54eb08e967ebdc44967336f8027c0e078c4dc

FAILURE: Build completed with 4 failures.

1: Task failed with an exception.
-----------
* What went wrong:
Execution failed for task ':website:installDependencies'.
> Process 'command 'docker'' finished with non-zero exit value 1

* Try:
Run with --stacktrace option to get the stack trace. Run with --info or --debug option to get more log output. Run with --scan to get full insights.
==============================================================================

2: Task failed with an exception.
-----------
* What went wrong:
Execution failed for task ':website:initGitSubmodules'.
> Process 'command 'docker'' finished with non-zero exit value 128

* Try:
Run with --stacktrace option to get the stack trace. Run with --info or --debug option to get more log output. Run with --scan to get full insights.
==============================================================================

3: Task failed with an exception.
-----------
* What went wrong:
Execution failed for task ':website:buildCodeSamples'.
> Process 'command 'docker'' finished with non-zero exit value 1

* Try:
Run with --stacktrace option to get the stack trace. Run with --info or --debug option to get more log output. Run with --scan to get full insights.
==============================================================================

4: Task failed with an exception.
-----------
* What went wrong:
Execution failed for task ':website:buildApacheWebsite'.
> Process 'command 'docker'' finished with non-zero exit value 127

* Try:
Run with --stacktrace option to get the stack trace. Run with --info or --debug option to get more log output. Run with --scan to get full insights.
==============================================================================

* Get more help at https://help.gradle.org

Deprecated Gradle features were used in this build, making it incompatible with Gradle 6.0.
Use '--warning-mode all' to show the individual deprecation warnings.
See https://docs.gradle.org/5.2.1/userguide/command_line_interface.html#sec:command_line_warnings

BUILD FAILED in 1m 4s
11 actionable tasks: 9 executed, 2 up-to-date

Publishing build scan...
https://gradle.com/s/jtgtghdjq6qnw

Build step 'Invoke Gradle script' changed build result to FAILURE
Build step 'Invoke Gradle script' marked build as failure

---------------------------------------------------------------------
To unsubscribe, e-mail: builds-unsubscribe@beam.apache.org
For additional commands, e-mail: builds-help@beam.apache.org


Build failed in Jenkins: beam_PostCommit_Website_Publish #6675

Posted by Apache Jenkins Server <je...@builds.apache.org>.
See <https://ci-beam.apache.org/job/beam_PostCommit_Website_Publish/6675/display/redirect?page=changes>

Changes:

[noreply] [BEAM-9898][BEAM-9899] SnowflakeIO.Write for cross-language with python


------------------------------------------
Started by timer
Running as SYSTEM
[EnvInject] - Loading node environment variables.
Building remotely on websites1 (git-websites svn-websites) in workspace <https://ci-beam.apache.org/job/beam_PostCommit_Website_Publish/ws/>
No credentials specified
Wiping out workspace first.
Cloning the remote Git repository
Cloning repository https://github.com/apache/beam.git
 > git init <https://ci-beam.apache.org/job/beam_PostCommit_Website_Publish/ws/src> # timeout=10
Fetching upstream changes from https://github.com/apache/beam.git
 > git --version # timeout=10
 > git fetch --tags --progress -- https://github.com/apache/beam.git +refs/heads/*:refs/remotes/origin/* # timeout=10
 > git config remote.origin.url https://github.com/apache/beam.git # timeout=10
 > git config --add remote.origin.fetch +refs/heads/*:refs/remotes/origin/* # timeout=10
 > git config remote.origin.url https://github.com/apache/beam.git # timeout=10
Fetching upstream changes from https://github.com/apache/beam.git
 > git fetch --tags --progress -- https://github.com/apache/beam.git +refs/heads/*:refs/remotes/origin/* +refs/pull/${ghprbPullId}/*:refs/remotes/origin/pr/${ghprbPullId}/* # timeout=10
 > git rev-parse origin/master^{commit} # timeout=10
Checking out Revision 78d7636cac9234dbcc7145bb0330275c557c0010 (origin/master)
 > git config core.sparsecheckout # timeout=10
 > git checkout -f 78d7636cac9234dbcc7145bb0330275c557c0010 # timeout=10
Commit message: "[BEAM-9898][BEAM-9899] SnowflakeIO.Write for cross-language with python wrapper and integration test (#12509)"
 > git rev-list --no-walk d80b4bc50ebc6ec7706450c82a714315a61dcc1b # timeout=10
No emails were triggered.
[EnvInject] - Executing scripts and injecting environment variables after the SCM step.
[EnvInject] - Injecting as environment variables the properties content 
SPARK_LOCAL_IP=127.0.0.1

[EnvInject] - Variables injected successfully.
[Gradle] - Launching build.
[src] $ <https://ci-beam.apache.org/job/beam_PostCommit_Website_Publish/ws/src/gradlew> --continue --max-workers=12 -Dorg.gradle.jvmargs=-Xms2g -Dorg.gradle.jvmargs=-Xmx4g -Pdocker-pull-licenses :website:clean :website:publishWebsite
To honour the JVM settings for this build a new JVM will be forked. Please consider using the daemon: https://docs.gradle.org/5.2.1/userguide/gradle_daemon.html.
Daemon will be stopped at the end of the build stopping after processing
> Task :buildSrc:compileJava NO-SOURCE
> Task :buildSrc:compileGroovy FROM-CACHE
> Task :buildSrc:pluginDescriptors
> Task :buildSrc:processResources
> Task :buildSrc:classes
> Task :buildSrc:jar
> Task :buildSrc:assemble
> Task :buildSrc:spotlessGroovy
> Task :buildSrc:spotlessGroovyCheck
> Task :buildSrc:spotlessGroovyGradle
> Task :buildSrc:spotlessGroovyGradleCheck
> Task :buildSrc:spotlessCheck
> Task :buildSrc:pluginUnderTestMetadata
> Task :buildSrc:compileTestJava NO-SOURCE
> Task :buildSrc:compileTestGroovy NO-SOURCE
> Task :buildSrc:processTestResources NO-SOURCE
> Task :buildSrc:testClasses UP-TO-DATE
> Task :buildSrc:test NO-SOURCE
> Task :buildSrc:validateTaskProperties FROM-CACHE
> Task :buildSrc:check
> Task :buildSrc:build
Configuration on demand is an incubating feature.
> Task :website:cleanWebsite UP-TO-DATE
> Task :website:clean UP-TO-DATE

> Task :website:buildDockerImage
Sending build context to Docker daemon  48.37MB
Step 1/8 : FROM debian:stretch-slim
 ---> 8ff748cdd6b1
Step 2/8 : SHELL ["/bin/bash", "-o", "pipefail", "-e", "-u", "-x", "-c"]
 ---> Using cache
 ---> e34c4df1e02e
Step 3/8 : ENV DEBIAN_FRONTEND=noninteractive     LANGUAGE=C.UTF-8     LANG=C.UTF-8     LC_ALL=C.UTF-8     LC_CTYPE=C.UTF-8     LC_MESSAGES=C.UTF-8
 ---> Using cache
 ---> 757069dfbc50
Step 4/8 : RUN apt-get update     && apt-get install -y --no-install-recommends         ca-certificates         curl         git         gnupg2         gosu         lynx     && apt-get autoremove -yqq --purge     && apt-get clean     && rm -rf /var/lib/apt/lists/*
 ---> Using cache
 ---> 296e1e0d5cf8
Step 5/8 : RUN curl -sL https://deb.nodesource.com/setup_10.x | bash -     && apt-get update     && apt-get install -y --no-install-recommends         nodejs     && apt-get autoremove -yqq --purge     && apt-get clean     && rm -rf /var/lib/apt/lists/*
 ---> Using cache
 ---> 8e22d2bec517
Step 6/8 : RUN curl -sS https://dl.yarnpkg.com/debian/pubkey.gpg | apt-key add -     && echo "deb https://dl.yarnpkg.com/debian/ stable main" | tee /etc/apt/sources.list.d/yarn.list     && apt-get update     && apt-get install -y --no-install-recommends yarn     && apt-get autoremove -yqq --purge     && apt-get clean     && rm -rf /var/lib/apt/lists/*
 ---> Using cache
 ---> 5a2a0e98de69
Step 7/8 : RUN HUGOHOME="$(mktemp -d)"     && export HUGOHOME     && curl -sL https://github.com/gohugoio/hugo/releases/download/v0.68.3/hugo_extended_0.68.3_Linux-64bit.tar.gz > "${HUGOHOME}/hugo.tar.gz"     && tar -xzvf "${HUGOHOME}/hugo.tar.gz" hugo     && mv hugo /usr/local/bin/hugo     && chmod +x /usr/local/bin/hugo     && rm -r "${HUGOHOME}"
 ---> Using cache
 ---> 4383f962e28a
Step 8/8 : WORKDIR /opt/
 ---> Using cache
 ---> 47a979744ea8
Successfully built 47a979744ea8
Successfully tagged beam-website:latest

> Task :website:createDockerContainer

> Task :website:startDockerContainer
ea9bbbee28c1438e9b3e0eb98043028566231f4bd1b3e0652cb1234c1e790011

> Task :website:setupDockerContainer

> Task :website:installDependencies
yarn install v1.22.4
warning Skipping preferred cache folder "/.cache/yarn" because it is not writable.
warning Selected the next writable cache folder in the list, will be "/tmp/.yarn-cache-910".
[1/4] Resolving packages...
[2/4] Fetching packages...
info fsevents@2.1.3: The platform "linux" is incompatible with this module.
info "fsevents@2.1.3" is an optional dependency and failed compatibility check. Excluding it from installation.
[3/4] Linking dependencies...
error Could not write file "/opt/website/www/yarn-error.log": "EACCES: permission denied, open '/opt/website/www/yarn-error.log'"
info Visit https://yarnpkg.com/en/docs/cli/install for documentation about this command.
error An unexpected error occurred: "EACCES: permission denied, mkdir '/opt/website/www/node_modules'".

> Task :website:installDependencies FAILED

> Task :website:initGitSubmodules FAILED
error: could not lock config file .git/config: Permission denied
fatal: Failed to register url for submodule path 'website/www/site/themes/docsy'

> Task :website:buildCodeSamples FAILED
yarn run v1.22.4
warning Skipping preferred cache folder "/.cache/yarn" because it is not writable.
warning Selected the next writable cache folder in the list, will be "/tmp/.yarn-cache-910".
$ ./build_code_samples.sh
warning Cannot find a suitable global folder. Tried these: "/usr/local, /.yarn"
Working directory: /opt/website/www
Dist directory: ./site/code_samples
mkdir: cannot create directory ‘./site/code_samples’: Permission denied
error Command failed with exit code 1.
info Visit https://yarnpkg.com/en/docs/cli/run for documentation about this command.

> Task :website:buildApacheWebsite FAILED
yarn run v1.22.4
warning Skipping preferred cache folder "/.cache/yarn" because it is not writable.
warning Selected the next writable cache folder in the list, will be "/tmp/.yarn-cache-910".
$ cross-env HUGO_ENV=production hugo --minify -d ../dist -s site -v -d /opt/build/website/generated-apache-content --config /opt/website/www/site/config.toml
warning Cannot find a suitable global folder. Tried these: "/usr/local, /.yarn"
/bin/sh: 1: cross-env: not found
error Command failed with exit code 127.
info Visit https://yarnpkg.com/en/docs/cli/run for documentation about this command.

> Task :website:stopAndRemoveDockerContainer
ea9bbbee28c1438e9b3e0eb98043028566231f4bd1b3e0652cb1234c1e790011

FAILURE: Build completed with 4 failures.

1: Task failed with an exception.
-----------
* What went wrong:
Execution failed for task ':website:installDependencies'.
> Process 'command 'docker'' finished with non-zero exit value 1

* Try:
Run with --stacktrace option to get the stack trace. Run with --info or --debug option to get more log output. Run with --scan to get full insights.
==============================================================================

2: Task failed with an exception.
-----------
* What went wrong:
Execution failed for task ':website:initGitSubmodules'.
> Process 'command 'docker'' finished with non-zero exit value 128

* Try:
Run with --stacktrace option to get the stack trace. Run with --info or --debug option to get more log output. Run with --scan to get full insights.
==============================================================================

3: Task failed with an exception.
-----------
* What went wrong:
Execution failed for task ':website:buildCodeSamples'.
> Process 'command 'docker'' finished with non-zero exit value 1

* Try:
Run with --stacktrace option to get the stack trace. Run with --info or --debug option to get more log output. Run with --scan to get full insights.
==============================================================================

4: Task failed with an exception.
-----------
* What went wrong:
Execution failed for task ':website:buildApacheWebsite'.
> Process 'command 'docker'' finished with non-zero exit value 127

* Try:
Run with --stacktrace option to get the stack trace. Run with --info or --debug option to get more log output. Run with --scan to get full insights.
==============================================================================

* Get more help at https://help.gradle.org

Deprecated Gradle features were used in this build, making it incompatible with Gradle 6.0.
Use '--warning-mode all' to show the individual deprecation warnings.
See https://docs.gradle.org/5.2.1/userguide/command_line_interface.html#sec:command_line_warnings

BUILD FAILED in 1m 4s
11 actionable tasks: 9 executed, 2 up-to-date

Publishing build scan...
https://gradle.com/s/hu6rx3jcbxg2k

Build step 'Invoke Gradle script' changed build result to FAILURE
Build step 'Invoke Gradle script' marked build as failure

---------------------------------------------------------------------
To unsubscribe, e-mail: builds-unsubscribe@beam.apache.org
For additional commands, e-mail: builds-help@beam.apache.org


Build failed in Jenkins: beam_PostCommit_Website_Publish #6674

Posted by Apache Jenkins Server <je...@builds.apache.org>.
See <https://ci-beam.apache.org/job/beam_PostCommit_Website_Publish/6674/display/redirect?page=changes>

Changes:

[ningk] [BEAM-10827] Fix forward the google-cloud-core version

[Valentyn Tymofieiev] [BEAM-8551] Verify that installed python packages don't have conflicting

[Valentyn Tymofieiev] Upgrade TF to 2.3.0.

[noreply] Merge pull request #12492 from [BEAM-6807] Implement an Azure blobstore

[noreply] Merge pull request #12661 from Add export FHIR resources to GCS IO


------------------------------------------
Started by timer
Running as SYSTEM
[EnvInject] - Loading node environment variables.
Building remotely on websites1 (git-websites svn-websites) in workspace <https://ci-beam.apache.org/job/beam_PostCommit_Website_Publish/ws/>
No credentials specified
Wiping out workspace first.
Cloning the remote Git repository
Cloning repository https://github.com/apache/beam.git
 > git init <https://ci-beam.apache.org/job/beam_PostCommit_Website_Publish/ws/src> # timeout=10
Fetching upstream changes from https://github.com/apache/beam.git
 > git --version # timeout=10
 > git fetch --tags --progress -- https://github.com/apache/beam.git +refs/heads/*:refs/remotes/origin/* # timeout=10
 > git config remote.origin.url https://github.com/apache/beam.git # timeout=10
 > git config --add remote.origin.fetch +refs/heads/*:refs/remotes/origin/* # timeout=10
 > git config remote.origin.url https://github.com/apache/beam.git # timeout=10
Fetching upstream changes from https://github.com/apache/beam.git
 > git fetch --tags --progress -- https://github.com/apache/beam.git +refs/heads/*:refs/remotes/origin/* +refs/pull/${ghprbPullId}/*:refs/remotes/origin/pr/${ghprbPullId}/* # timeout=10
 > git rev-parse origin/master^{commit} # timeout=10
Checking out Revision d80b4bc50ebc6ec7706450c82a714315a61dcc1b (origin/master)
 > git config core.sparsecheckout # timeout=10
 > git checkout -f d80b4bc50ebc6ec7706450c82a714315a61dcc1b # timeout=10
Commit message: "[BEAM-8551] Verify that installed python packages don't have conflicting requirements. (#12714)"
 > git rev-list --no-walk d89bbfa5ad7e392371c85586fae94334e8ca9a87 # timeout=10
No emails were triggered.
[EnvInject] - Executing scripts and injecting environment variables after the SCM step.
[EnvInject] - Injecting as environment variables the properties content 
SPARK_LOCAL_IP=127.0.0.1

[EnvInject] - Variables injected successfully.
[Gradle] - Launching build.
[src] $ <https://ci-beam.apache.org/job/beam_PostCommit_Website_Publish/ws/src/gradlew> --continue --max-workers=12 -Dorg.gradle.jvmargs=-Xms2g -Dorg.gradle.jvmargs=-Xmx4g -Pdocker-pull-licenses :website:clean :website:publishWebsite
To honour the JVM settings for this build a new JVM will be forked. Please consider using the daemon: https://docs.gradle.org/5.2.1/userguide/gradle_daemon.html.
Daemon will be stopped at the end of the build stopping after processing
> Task :buildSrc:compileJava NO-SOURCE
> Task :buildSrc:compileGroovy
> Task :buildSrc:pluginDescriptors
> Task :buildSrc:processResources
> Task :buildSrc:classes
> Task :buildSrc:jar
> Task :buildSrc:assemble
> Task :buildSrc:spotlessGroovy
> Task :buildSrc:spotlessGroovyCheck
> Task :buildSrc:spotlessGroovyGradle
> Task :buildSrc:spotlessGroovyGradleCheck
> Task :buildSrc:spotlessCheck
> Task :buildSrc:pluginUnderTestMetadata
> Task :buildSrc:compileTestJava NO-SOURCE
> Task :buildSrc:compileTestGroovy NO-SOURCE
> Task :buildSrc:processTestResources NO-SOURCE
> Task :buildSrc:testClasses UP-TO-DATE
> Task :buildSrc:test NO-SOURCE
> Task :buildSrc:validateTaskProperties
> Task :buildSrc:check
> Task :buildSrc:build
Configuration on demand is an incubating feature.
> Task :website:cleanWebsite UP-TO-DATE
> Task :website:clean UP-TO-DATE

> Task :website:buildDockerImage
Sending build context to Docker daemon  48.37MB
Step 1/8 : FROM debian:stretch-slim
 ---> 8ff748cdd6b1
Step 2/8 : SHELL ["/bin/bash", "-o", "pipefail", "-e", "-u", "-x", "-c"]
 ---> Using cache
 ---> e34c4df1e02e
Step 3/8 : ENV DEBIAN_FRONTEND=noninteractive     LANGUAGE=C.UTF-8     LANG=C.UTF-8     LC_ALL=C.UTF-8     LC_CTYPE=C.UTF-8     LC_MESSAGES=C.UTF-8
 ---> Using cache
 ---> 757069dfbc50
Step 4/8 : RUN apt-get update     && apt-get install -y --no-install-recommends         ca-certificates         curl         git         gnupg2         gosu         lynx     && apt-get autoremove -yqq --purge     && apt-get clean     && rm -rf /var/lib/apt/lists/*
 ---> Using cache
 ---> 296e1e0d5cf8
Step 5/8 : RUN curl -sL https://deb.nodesource.com/setup_10.x | bash -     && apt-get update     && apt-get install -y --no-install-recommends         nodejs     && apt-get autoremove -yqq --purge     && apt-get clean     && rm -rf /var/lib/apt/lists/*
 ---> Using cache
 ---> 8e22d2bec517
Step 6/8 : RUN curl -sS https://dl.yarnpkg.com/debian/pubkey.gpg | apt-key add -     && echo "deb https://dl.yarnpkg.com/debian/ stable main" | tee /etc/apt/sources.list.d/yarn.list     && apt-get update     && apt-get install -y --no-install-recommends yarn     && apt-get autoremove -yqq --purge     && apt-get clean     && rm -rf /var/lib/apt/lists/*
 ---> Using cache
 ---> 5a2a0e98de69
Step 7/8 : RUN HUGOHOME="$(mktemp -d)"     && export HUGOHOME     && curl -sL https://github.com/gohugoio/hugo/releases/download/v0.68.3/hugo_extended_0.68.3_Linux-64bit.tar.gz > "${HUGOHOME}/hugo.tar.gz"     && tar -xzvf "${HUGOHOME}/hugo.tar.gz" hugo     && mv hugo /usr/local/bin/hugo     && chmod +x /usr/local/bin/hugo     && rm -r "${HUGOHOME}"
 ---> Using cache
 ---> 4383f962e28a
Step 8/8 : WORKDIR /opt/
 ---> Using cache
 ---> 47a979744ea8
Successfully built 47a979744ea8
Successfully tagged beam-website:latest

> Task :website:createDockerContainer

> Task :website:startDockerContainer
a7227b323797a58040580190ff0997d5fe284974f61c7d97ba1af67f7f673e63

> Task :website:setupDockerContainer

> Task :website:installDependencies
yarn install v1.22.4
warning Skipping preferred cache folder "/.cache/yarn" because it is not writable.
warning Selected the next writable cache folder in the list, will be "/tmp/.yarn-cache-910".
[1/4] Resolving packages...
[2/4] Fetching packages...
info fsevents@2.1.3: The platform "linux" is incompatible with this module.
info "fsevents@2.1.3" is an optional dependency and failed compatibility check. Excluding it from installation.
[3/4] Linking dependencies...
error Could not write file "/opt/website/www/yarn-error.log": "EACCES: permission denied, open '/opt/website/www/yarn-error.log'"
info Visit https://yarnpkg.com/en/docs/cli/install for documentation about this command.
error An unexpected error occurred: "EACCES: permission denied, mkdir '/opt/website/www/node_modules'".

> Task :website:installDependencies FAILED

> Task :website:initGitSubmodules FAILED
error: could not lock config file .git/config: Permission denied
fatal: Failed to register url for submodule path 'website/www/site/themes/docsy'

> Task :website:buildCodeSamples FAILED
yarn run v1.22.4
warning Skipping preferred cache folder "/.cache/yarn" because it is not writable.
warning Selected the next writable cache folder in the list, will be "/tmp/.yarn-cache-910".
$ ./build_code_samples.sh
warning Cannot find a suitable global folder. Tried these: "/usr/local, /.yarn"
Working directory: /opt/website/www
Dist directory: ./site/code_samples
mkdir: cannot create directory ‘./site/code_samples’: Permission denied
error Command failed with exit code 1.
info Visit https://yarnpkg.com/en/docs/cli/run for documentation about this command.

> Task :website:buildApacheWebsite FAILED
yarn run v1.22.4
warning Skipping preferred cache folder "/.cache/yarn" because it is not writable.
warning Selected the next writable cache folder in the list, will be "/tmp/.yarn-cache-910".
$ cross-env HUGO_ENV=production hugo --minify -d ../dist -s site -v -d /opt/build/website/generated-apache-content --config /opt/website/www/site/config.toml
warning Cannot find a suitable global folder. Tried these: "/usr/local, /.yarn"
/bin/sh: 1: cross-env: not found
info Visit https://yarnpkg.com/en/docs/cli/run for documentation about this command.
error Command failed with exit code 127.

> Task :website:stopAndRemoveDockerContainer
a7227b323797a58040580190ff0997d5fe284974f61c7d97ba1af67f7f673e63

FAILURE: Build completed with 4 failures.

1: Task failed with an exception.
-----------
* What went wrong:
Execution failed for task ':website:installDependencies'.
> Process 'command 'docker'' finished with non-zero exit value 1

* Try:
Run with --stacktrace option to get the stack trace. Run with --info or --debug option to get more log output. Run with --scan to get full insights.
==============================================================================

2: Task failed with an exception.
-----------
* What went wrong:
Execution failed for task ':website:initGitSubmodules'.
> Process 'command 'docker'' finished with non-zero exit value 128

* Try:
Run with --stacktrace option to get the stack trace. Run with --info or --debug option to get more log output. Run with --scan to get full insights.
==============================================================================

3: Task failed with an exception.
-----------
* What went wrong:
Execution failed for task ':website:buildCodeSamples'.
> Process 'command 'docker'' finished with non-zero exit value 1

* Try:
Run with --stacktrace option to get the stack trace. Run with --info or --debug option to get more log output. Run with --scan to get full insights.
==============================================================================

4: Task failed with an exception.
-----------
* What went wrong:
Execution failed for task ':website:buildApacheWebsite'.
> Process 'command 'docker'' finished with non-zero exit value 127

* Try:
Run with --stacktrace option to get the stack trace. Run with --info or --debug option to get more log output. Run with --scan to get full insights.
==============================================================================

* Get more help at https://help.gradle.org

Deprecated Gradle features were used in this build, making it incompatible with Gradle 6.0.
Use '--warning-mode all' to show the individual deprecation warnings.
See https://docs.gradle.org/5.2.1/userguide/command_line_interface.html#sec:command_line_warnings

BUILD FAILED in 1m 10s
11 actionable tasks: 9 executed, 2 up-to-date

Publishing build scan...
https://gradle.com/s/jbc7elfsastle

Build step 'Invoke Gradle script' changed build result to FAILURE
Build step 'Invoke Gradle script' marked build as failure

---------------------------------------------------------------------
To unsubscribe, e-mail: builds-unsubscribe@beam.apache.org
For additional commands, e-mail: builds-help@beam.apache.org


Build failed in Jenkins: beam_PostCommit_Website_Publish #6673

Posted by Apache Jenkins Server <je...@builds.apache.org>.
See <https://ci-beam.apache.org/job/beam_PostCommit_Website_Publish/6673/display/redirect?page=changes>

Changes:

[noreply] [BEAM-10699] Logging BigQuery streaming insert tail latencies (#12609)


------------------------------------------
Started by timer
Running as SYSTEM
[EnvInject] - Loading node environment variables.
Building remotely on websites1 (git-websites svn-websites) in workspace <https://ci-beam.apache.org/job/beam_PostCommit_Website_Publish/ws/>
No credentials specified
Wiping out workspace first.
Cloning the remote Git repository
Cloning repository https://github.com/apache/beam.git
 > git init <https://ci-beam.apache.org/job/beam_PostCommit_Website_Publish/ws/src> # timeout=10
Fetching upstream changes from https://github.com/apache/beam.git
 > git --version # timeout=10
 > git fetch --tags --progress -- https://github.com/apache/beam.git +refs/heads/*:refs/remotes/origin/* # timeout=10
 > git config remote.origin.url https://github.com/apache/beam.git # timeout=10
 > git config --add remote.origin.fetch +refs/heads/*:refs/remotes/origin/* # timeout=10
 > git config remote.origin.url https://github.com/apache/beam.git # timeout=10
Fetching upstream changes from https://github.com/apache/beam.git
 > git fetch --tags --progress -- https://github.com/apache/beam.git +refs/heads/*:refs/remotes/origin/* +refs/pull/${ghprbPullId}/*:refs/remotes/origin/pr/${ghprbPullId}/* # timeout=10
 > git rev-parse origin/master^{commit} # timeout=10
Checking out Revision d89bbfa5ad7e392371c85586fae94334e8ca9a87 (origin/master)
 > git config core.sparsecheckout # timeout=10
 > git checkout -f d89bbfa5ad7e392371c85586fae94334e8ca9a87 # timeout=10
Commit message: "[BEAM-10699] Logging BigQuery streaming insert tail latencies (#12609)"
 > git rev-list --no-walk faf76d59a5b24bf7f0daed5a503a07f0fff70ec1 # timeout=10
No emails were triggered.
[EnvInject] - Executing scripts and injecting environment variables after the SCM step.
[EnvInject] - Injecting as environment variables the properties content 
SPARK_LOCAL_IP=127.0.0.1

[EnvInject] - Variables injected successfully.
[Gradle] - Launching build.
[src] $ <https://ci-beam.apache.org/job/beam_PostCommit_Website_Publish/ws/src/gradlew> --continue --max-workers=12 -Dorg.gradle.jvmargs=-Xms2g -Dorg.gradle.jvmargs=-Xmx4g -Pdocker-pull-licenses :website:clean :website:publishWebsite
To honour the JVM settings for this build a new JVM will be forked. Please consider using the daemon: https://docs.gradle.org/5.2.1/userguide/gradle_daemon.html.
Daemon will be stopped at the end of the build stopping after processing
> Task :buildSrc:compileJava NO-SOURCE
> Task :buildSrc:compileGroovy FROM-CACHE
> Task :buildSrc:pluginDescriptors
> Task :buildSrc:processResources
> Task :buildSrc:classes
> Task :buildSrc:jar
> Task :buildSrc:assemble
> Task :buildSrc:spotlessGroovy
> Task :buildSrc:spotlessGroovyCheck
> Task :buildSrc:spotlessGroovyGradle
> Task :buildSrc:spotlessGroovyGradleCheck
> Task :buildSrc:spotlessCheck
> Task :buildSrc:pluginUnderTestMetadata
> Task :buildSrc:compileTestJava NO-SOURCE
> Task :buildSrc:compileTestGroovy NO-SOURCE
> Task :buildSrc:processTestResources NO-SOURCE
> Task :buildSrc:testClasses UP-TO-DATE
> Task :buildSrc:test NO-SOURCE
> Task :buildSrc:validateTaskProperties FROM-CACHE
> Task :buildSrc:check
> Task :buildSrc:build
Configuration on demand is an incubating feature.
> Task :website:cleanWebsite UP-TO-DATE
> Task :website:clean UP-TO-DATE

> Task :website:buildDockerImage
Sending build context to Docker daemon  48.37MB
Step 1/8 : FROM debian:stretch-slim
stretch-slim: Pulling from library/debian
Digest: sha256:c4052b51588fc32fe0c25a984a34cad5dc5990b9c12744073a9c409a6d0737cf
Status: Downloaded newer image for debian:stretch-slim
 ---> 8ff748cdd6b1
Step 2/8 : SHELL ["/bin/bash", "-o", "pipefail", "-e", "-u", "-x", "-c"]
 ---> Using cache
 ---> e34c4df1e02e
Step 3/8 : ENV DEBIAN_FRONTEND=noninteractive     LANGUAGE=C.UTF-8     LANG=C.UTF-8     LC_ALL=C.UTF-8     LC_CTYPE=C.UTF-8     LC_MESSAGES=C.UTF-8
 ---> Using cache
 ---> 757069dfbc50
Step 4/8 : RUN apt-get update     && apt-get install -y --no-install-recommends         ca-certificates         curl         git         gnupg2         gosu         lynx     && apt-get autoremove -yqq --purge     && apt-get clean     && rm -rf /var/lib/apt/lists/*
 ---> Using cache
 ---> 296e1e0d5cf8
Step 5/8 : RUN curl -sL https://deb.nodesource.com/setup_10.x | bash -     && apt-get update     && apt-get install -y --no-install-recommends         nodejs     && apt-get autoremove -yqq --purge     && apt-get clean     && rm -rf /var/lib/apt/lists/*
 ---> Using cache
 ---> 8e22d2bec517
Step 6/8 : RUN curl -sS https://dl.yarnpkg.com/debian/pubkey.gpg | apt-key add -     && echo "deb https://dl.yarnpkg.com/debian/ stable main" | tee /etc/apt/sources.list.d/yarn.list     && apt-get update     && apt-get install -y --no-install-recommends yarn     && apt-get autoremove -yqq --purge     && apt-get clean     && rm -rf /var/lib/apt/lists/*
 ---> Using cache
 ---> 5a2a0e98de69
Step 7/8 : RUN HUGOHOME="$(mktemp -d)"     && export HUGOHOME     && curl -sL https://github.com/gohugoio/hugo/releases/download/v0.68.3/hugo_extended_0.68.3_Linux-64bit.tar.gz > "${HUGOHOME}/hugo.tar.gz"     && tar -xzvf "${HUGOHOME}/hugo.tar.gz" hugo     && mv hugo /usr/local/bin/hugo     && chmod +x /usr/local/bin/hugo     && rm -r "${HUGOHOME}"
 ---> Using cache
 ---> 4383f962e28a
Step 8/8 : WORKDIR /opt/
 ---> Using cache
 ---> 47a979744ea8
Successfully built 47a979744ea8
Successfully tagged beam-website:latest

> Task :website:createDockerContainer

> Task :website:startDockerContainer
512ad41ce9d98a302ac28176dddfebf408aa51992d9e41e41cde9bc4e94c8a9c

> Task :website:setupDockerContainer

> Task :website:installDependencies
yarn install v1.22.4
warning Skipping preferred cache folder "/.cache/yarn" because it is not writable.
warning Selected the next writable cache folder in the list, will be "/tmp/.yarn-cache-910".
[1/4] Resolving packages...
[2/4] Fetching packages...
info fsevents@2.1.3: The platform "linux" is incompatible with this module.
info "fsevents@2.1.3" is an optional dependency and failed compatibility check. Excluding it from installation.
[3/4] Linking dependencies...
error Could not write file "/opt/website/www/yarn-error.log": "EACCES: permission denied, open '/opt/website/www/yarn-error.log'"
info Visit https://yarnpkg.com/en/docs/cli/install for documentation about this command.
error An unexpected error occurred: "EACCES: permission denied, mkdir '/opt/website/www/node_modules'".

> Task :website:installDependencies FAILED

> Task :website:initGitSubmodules FAILED
error: could not lock config file .git/config: Permission denied
fatal: Failed to register url for submodule path 'website/www/site/themes/docsy'

> Task :website:buildCodeSamples FAILED
yarn run v1.22.4
warning Skipping preferred cache folder "/.cache/yarn" because it is not writable.
warning Selected the next writable cache folder in the list, will be "/tmp/.yarn-cache-910".
$ ./build_code_samples.sh
warning Cannot find a suitable global folder. Tried these: "/usr/local, /.yarn"
Working directory: /opt/website/www
Dist directory: ./site/code_samples
mkdir: cannot create directory ‘./site/code_samples’: Permission denied
error Command failed with exit code 1.
info Visit https://yarnpkg.com/en/docs/cli/run for documentation about this command.

> Task :website:buildApacheWebsite FAILED
yarn run v1.22.4
warning Skipping preferred cache folder "/.cache/yarn" because it is not writable.
warning Selected the next writable cache folder in the list, will be "/tmp/.yarn-cache-910".
$ cross-env HUGO_ENV=production hugo --minify -d ../dist -s site -v -d /opt/build/website/generated-apache-content --config /opt/website/www/site/config.toml
warning Cannot find a suitable global folder. Tried these: "/usr/local, /.yarn"
/bin/sh: 1: cross-env: not found
error Command failed with exit code 127.
info Visit https://yarnpkg.com/en/docs/cli/run for documentation about this command.

> Task :website:stopAndRemoveDockerContainer
512ad41ce9d98a302ac28176dddfebf408aa51992d9e41e41cde9bc4e94c8a9c

FAILURE: Build completed with 4 failures.

1: Task failed with an exception.
-----------
* What went wrong:
Execution failed for task ':website:installDependencies'.
> Process 'command 'docker'' finished with non-zero exit value 1

* Try:
Run with --stacktrace option to get the stack trace. Run with --info or --debug option to get more log output. Run with --scan to get full insights.
==============================================================================

2: Task failed with an exception.
-----------
* What went wrong:
Execution failed for task ':website:initGitSubmodules'.
> Process 'command 'docker'' finished with non-zero exit value 128

* Try:
Run with --stacktrace option to get the stack trace. Run with --info or --debug option to get more log output. Run with --scan to get full insights.
==============================================================================

3: Task failed with an exception.
-----------
* What went wrong:
Execution failed for task ':website:buildCodeSamples'.
> Process 'command 'docker'' finished with non-zero exit value 1

* Try:
Run with --stacktrace option to get the stack trace. Run with --info or --debug option to get more log output. Run with --scan to get full insights.
==============================================================================

4: Task failed with an exception.
-----------
* What went wrong:
Execution failed for task ':website:buildApacheWebsite'.
> Process 'command 'docker'' finished with non-zero exit value 127

* Try:
Run with --stacktrace option to get the stack trace. Run with --info or --debug option to get more log output. Run with --scan to get full insights.
==============================================================================

* Get more help at https://help.gradle.org

Deprecated Gradle features were used in this build, making it incompatible with Gradle 6.0.
Use '--warning-mode all' to show the individual deprecation warnings.
See https://docs.gradle.org/5.2.1/userguide/command_line_interface.html#sec:command_line_warnings

BUILD FAILED in 1m 2s
11 actionable tasks: 9 executed, 2 up-to-date

Publishing build scan...
https://gradle.com/s/7oarqeosgkm6e

Build step 'Invoke Gradle script' changed build result to FAILURE
Build step 'Invoke Gradle script' marked build as failure

---------------------------------------------------------------------
To unsubscribe, e-mail: builds-unsubscribe@beam.apache.org
For additional commands, e-mail: builds-help@beam.apache.org


Build failed in Jenkins: beam_PostCommit_Website_Publish #6672

Posted by Apache Jenkins Server <je...@builds.apache.org>.
See <https://ci-beam.apache.org/job/beam_PostCommit_Website_Publish/6672/display/redirect?page=changes>

Changes:

[Luke Cwik] [BEAM-10820] Delete dead code SDFFeederViaStateAndTimers.java

[Udi Meiri] [BEAM-10701] Fix paths yet again


------------------------------------------
Started by timer
Running as SYSTEM
[EnvInject] - Loading node environment variables.
Building remotely on websites1 (git-websites svn-websites) in workspace <https://ci-beam.apache.org/job/beam_PostCommit_Website_Publish/ws/>
No credentials specified
Wiping out workspace first.
Cloning the remote Git repository
Cloning repository https://github.com/apache/beam.git
 > git init <https://ci-beam.apache.org/job/beam_PostCommit_Website_Publish/ws/src> # timeout=10
Fetching upstream changes from https://github.com/apache/beam.git
 > git --version # timeout=10
 > git fetch --tags --progress -- https://github.com/apache/beam.git +refs/heads/*:refs/remotes/origin/* # timeout=10
 > git config remote.origin.url https://github.com/apache/beam.git # timeout=10
 > git config --add remote.origin.fetch +refs/heads/*:refs/remotes/origin/* # timeout=10
 > git config remote.origin.url https://github.com/apache/beam.git # timeout=10
Fetching upstream changes from https://github.com/apache/beam.git
 > git fetch --tags --progress -- https://github.com/apache/beam.git +refs/heads/*:refs/remotes/origin/* +refs/pull/${ghprbPullId}/*:refs/remotes/origin/pr/${ghprbPullId}/* # timeout=10
 > git rev-parse origin/master^{commit} # timeout=10
Checking out Revision faf76d59a5b24bf7f0daed5a503a07f0fff70ec1 (origin/master)
 > git config core.sparsecheckout # timeout=10
 > git checkout -f faf76d59a5b24bf7f0daed5a503a07f0fff70ec1 # timeout=10
Commit message: "Merge pull request #12696: [BEAM-10701] Fix paths yet again"
 > git rev-list --no-walk d5201cfb96ff4ac1299f8741a0f6cbdba2ac05ec # timeout=10
No emails were triggered.
[EnvInject] - Executing scripts and injecting environment variables after the SCM step.
[EnvInject] - Injecting as environment variables the properties content 
SPARK_LOCAL_IP=127.0.0.1

[EnvInject] - Variables injected successfully.
[Gradle] - Launching build.
[src] $ <https://ci-beam.apache.org/job/beam_PostCommit_Website_Publish/ws/src/gradlew> --continue --max-workers=12 -Dorg.gradle.jvmargs=-Xms2g -Dorg.gradle.jvmargs=-Xmx4g -Pdocker-pull-licenses :website:clean :website:publishWebsite
To honour the JVM settings for this build a new JVM will be forked. Please consider using the daemon: https://docs.gradle.org/5.2.1/userguide/gradle_daemon.html.
Daemon will be stopped at the end of the build stopping after processing
> Task :buildSrc:compileJava NO-SOURCE
> Task :buildSrc:compileGroovy FROM-CACHE
> Task :buildSrc:pluginDescriptors
> Task :buildSrc:processResources
> Task :buildSrc:classes
> Task :buildSrc:jar
> Task :buildSrc:assemble
> Task :buildSrc:spotlessGroovy
> Task :buildSrc:spotlessGroovyCheck
> Task :buildSrc:spotlessGroovyGradle
> Task :buildSrc:spotlessGroovyGradleCheck
> Task :buildSrc:spotlessCheck
> Task :buildSrc:pluginUnderTestMetadata
> Task :buildSrc:compileTestJava NO-SOURCE
> Task :buildSrc:compileTestGroovy NO-SOURCE
> Task :buildSrc:processTestResources NO-SOURCE
> Task :buildSrc:testClasses UP-TO-DATE
> Task :buildSrc:test NO-SOURCE
> Task :buildSrc:validateTaskProperties FROM-CACHE
> Task :buildSrc:check
> Task :buildSrc:build
Configuration on demand is an incubating feature.
> Task :website:cleanWebsite UP-TO-DATE
> Task :website:clean UP-TO-DATE

> Task :website:buildDockerImage
Sending build context to Docker daemon  48.37MB
Step 1/8 : FROM debian:stretch-slim
 ---> 8ff748cdd6b1
Step 2/8 : SHELL ["/bin/bash", "-o", "pipefail", "-e", "-u", "-x", "-c"]
 ---> Using cache
 ---> e34c4df1e02e
Step 3/8 : ENV DEBIAN_FRONTEND=noninteractive     LANGUAGE=C.UTF-8     LANG=C.UTF-8     LC_ALL=C.UTF-8     LC_CTYPE=C.UTF-8     LC_MESSAGES=C.UTF-8
 ---> Using cache
 ---> 757069dfbc50
Step 4/8 : RUN apt-get update     && apt-get install -y --no-install-recommends         ca-certificates         curl         git         gnupg2         gosu         lynx     && apt-get autoremove -yqq --purge     && apt-get clean     && rm -rf /var/lib/apt/lists/*
 ---> Using cache
 ---> 296e1e0d5cf8
Step 5/8 : RUN curl -sL https://deb.nodesource.com/setup_10.x | bash -     && apt-get update     && apt-get install -y --no-install-recommends         nodejs     && apt-get autoremove -yqq --purge     && apt-get clean     && rm -rf /var/lib/apt/lists/*
 ---> Using cache
 ---> 8e22d2bec517
Step 6/8 : RUN curl -sS https://dl.yarnpkg.com/debian/pubkey.gpg | apt-key add -     && echo "deb https://dl.yarnpkg.com/debian/ stable main" | tee /etc/apt/sources.list.d/yarn.list     && apt-get update     && apt-get install -y --no-install-recommends yarn     && apt-get autoremove -yqq --purge     && apt-get clean     && rm -rf /var/lib/apt/lists/*
 ---> Using cache
 ---> 5a2a0e98de69
Step 7/8 : RUN HUGOHOME="$(mktemp -d)"     && export HUGOHOME     && curl -sL https://github.com/gohugoio/hugo/releases/download/v0.68.3/hugo_extended_0.68.3_Linux-64bit.tar.gz > "${HUGOHOME}/hugo.tar.gz"     && tar -xzvf "${HUGOHOME}/hugo.tar.gz" hugo     && mv hugo /usr/local/bin/hugo     && chmod +x /usr/local/bin/hugo     && rm -r "${HUGOHOME}"
 ---> Using cache
 ---> 4383f962e28a
Step 8/8 : WORKDIR /opt/
 ---> Using cache
 ---> 47a979744ea8
Successfully built 47a979744ea8
Successfully tagged beam-website:latest

> Task :website:createDockerContainer

> Task :website:startDockerContainer
22c51e46f40c20b7dfa4be7cd8d3c98ce5f70e057a72d5a362e4c03fa69bd717

> Task :website:setupDockerContainer

> Task :website:installDependencies
yarn install v1.22.4
warning Skipping preferred cache folder "/.cache/yarn" because it is not writable.
warning Selected the next writable cache folder in the list, will be "/tmp/.yarn-cache-910".
[1/4] Resolving packages...
[2/4] Fetching packages...
info fsevents@2.1.3: The platform "linux" is incompatible with this module.
info "fsevents@2.1.3" is an optional dependency and failed compatibility check. Excluding it from installation.
[3/4] Linking dependencies...
error Could not write file "/opt/website/www/yarn-error.log": "EACCES: permission denied, open '/opt/website/www/yarn-error.log'"
info Visit https://yarnpkg.com/en/docs/cli/install for documentation about this command.
error An unexpected error occurred: "EACCES: permission denied, mkdir '/opt/website/www/node_modules'".

> Task :website:installDependencies FAILED

> Task :website:initGitSubmodules FAILED
error: could not lock config file .git/config: Permission denied
fatal: Failed to register url for submodule path 'website/www/site/themes/docsy'

> Task :website:buildCodeSamples FAILED
yarn run v1.22.4
warning Skipping preferred cache folder "/.cache/yarn" because it is not writable.
warning Selected the next writable cache folder in the list, will be "/tmp/.yarn-cache-910".
$ ./build_code_samples.sh
warning Cannot find a suitable global folder. Tried these: "/usr/local, /.yarn"
Working directory: /opt/website/www
Dist directory: ./site/code_samples
mkdir: cannot create directory ‘./site/code_samples’: Permission denied
error Command failed with exit code 1.
info Visit https://yarnpkg.com/en/docs/cli/run for documentation about this command.

> Task :website:buildApacheWebsite FAILED
yarn run v1.22.4
warning Skipping preferred cache folder "/.cache/yarn" because it is not writable.
warning Selected the next writable cache folder in the list, will be "/tmp/.yarn-cache-910".
$ cross-env HUGO_ENV=production hugo --minify -d ../dist -s site -v -d /opt/build/website/generated-apache-content --config /opt/website/www/site/config.toml
warning Cannot find a suitable global folder. Tried these: "/usr/local, /.yarn"
/bin/sh: 1: cross-env: not found
error Command failed with exit code 127.
info Visit https://yarnpkg.com/en/docs/cli/run for documentation about this command.

> Task :website:stopAndRemoveDockerContainer
22c51e46f40c20b7dfa4be7cd8d3c98ce5f70e057a72d5a362e4c03fa69bd717

FAILURE: Build completed with 4 failures.

1: Task failed with an exception.
-----------
* What went wrong:
Execution failed for task ':website:installDependencies'.
> Process 'command 'docker'' finished with non-zero exit value 1

* Try:
Run with --stacktrace option to get the stack trace. Run with --info or --debug option to get more log output. Run with --scan to get full insights.
==============================================================================

2: Task failed with an exception.
-----------
* What went wrong:
Execution failed for task ':website:initGitSubmodules'.
> Process 'command 'docker'' finished with non-zero exit value 128

* Try:
Run with --stacktrace option to get the stack trace. Run with --info or --debug option to get more log output. Run with --scan to get full insights.
==============================================================================

3: Task failed with an exception.
-----------
* What went wrong:
Execution failed for task ':website:buildCodeSamples'.
> Process 'command 'docker'' finished with non-zero exit value 1

* Try:
Run with --stacktrace option to get the stack trace. Run with --info or --debug option to get more log output. Run with --scan to get full insights.
==============================================================================

4: Task failed with an exception.
-----------
* What went wrong:
Execution failed for task ':website:buildApacheWebsite'.
> Process 'command 'docker'' finished with non-zero exit value 127

* Try:
Run with --stacktrace option to get the stack trace. Run with --info or --debug option to get more log output. Run with --scan to get full insights.
==============================================================================

* Get more help at https://help.gradle.org

Deprecated Gradle features were used in this build, making it incompatible with Gradle 6.0.
Use '--warning-mode all' to show the individual deprecation warnings.
See https://docs.gradle.org/5.2.1/userguide/command_line_interface.html#sec:command_line_warnings

BUILD FAILED in 1m 0s
11 actionable tasks: 9 executed, 2 up-to-date

Publishing build scan...
https://gradle.com/s/dwyk2wanqfzla

Build step 'Invoke Gradle script' changed build result to FAILURE
Build step 'Invoke Gradle script' marked build as failure

---------------------------------------------------------------------
To unsubscribe, e-mail: builds-unsubscribe@beam.apache.org
For additional commands, e-mail: builds-help@beam.apache.org


Build failed in Jenkins: beam_PostCommit_Website_Publish #6671

Posted by Apache Jenkins Server <je...@builds.apache.org>.
See <https://ci-beam.apache.org/job/beam_PostCommit_Website_Publish/6671/display/redirect?page=changes>

Changes:

[Kamil Wasilewski] [BEAM-10675] Clean up Python Load Tests


------------------------------------------
Started by timer
Running as SYSTEM
[EnvInject] - Loading node environment variables.
Building remotely on websites1 (git-websites svn-websites) in workspace <https://ci-beam.apache.org/job/beam_PostCommit_Website_Publish/ws/>
No credentials specified
Wiping out workspace first.
Cloning the remote Git repository
Cloning repository https://github.com/apache/beam.git
 > git init <https://ci-beam.apache.org/job/beam_PostCommit_Website_Publish/ws/src> # timeout=10
Fetching upstream changes from https://github.com/apache/beam.git
 > git --version # timeout=10
 > git fetch --tags --progress -- https://github.com/apache/beam.git +refs/heads/*:refs/remotes/origin/* # timeout=10
 > git config remote.origin.url https://github.com/apache/beam.git # timeout=10
 > git config --add remote.origin.fetch +refs/heads/*:refs/remotes/origin/* # timeout=10
 > git config remote.origin.url https://github.com/apache/beam.git # timeout=10
Fetching upstream changes from https://github.com/apache/beam.git
 > git fetch --tags --progress -- https://github.com/apache/beam.git +refs/heads/*:refs/remotes/origin/* +refs/pull/${ghprbPullId}/*:refs/remotes/origin/pr/${ghprbPullId}/* # timeout=10
 > git rev-parse origin/master^{commit} # timeout=10
Checking out Revision d5201cfb96ff4ac1299f8741a0f6cbdba2ac05ec (origin/master)
 > git config core.sparsecheckout # timeout=10
 > git checkout -f d5201cfb96ff4ac1299f8741a0f6cbdba2ac05ec # timeout=10
Commit message: "Merge pull request #12687 from kamilwu/load-tests-cleanup"
 > git rev-list --no-walk d6adcdfe806ef8a72b84c9841f1447999f0652c1 # timeout=10
No emails were triggered.
[EnvInject] - Executing scripts and injecting environment variables after the SCM step.
[EnvInject] - Injecting as environment variables the properties content 
SPARK_LOCAL_IP=127.0.0.1

[EnvInject] - Variables injected successfully.
[Gradle] - Launching build.
[src] $ <https://ci-beam.apache.org/job/beam_PostCommit_Website_Publish/ws/src/gradlew> --continue --max-workers=12 -Dorg.gradle.jvmargs=-Xms2g -Dorg.gradle.jvmargs=-Xmx4g -Pdocker-pull-licenses :website:clean :website:publishWebsite
To honour the JVM settings for this build a new JVM will be forked. Please consider using the daemon: https://docs.gradle.org/5.2.1/userguide/gradle_daemon.html.
Daemon will be stopped at the end of the build stopping after processing
> Task :buildSrc:compileJava NO-SOURCE
> Task :buildSrc:compileGroovy FROM-CACHE
> Task :buildSrc:pluginDescriptors
> Task :buildSrc:processResources
> Task :buildSrc:classes
> Task :buildSrc:jar
> Task :buildSrc:assemble
> Task :buildSrc:spotlessGroovy
> Task :buildSrc:spotlessGroovyCheck
> Task :buildSrc:spotlessGroovyGradle
> Task :buildSrc:spotlessGroovyGradleCheck
> Task :buildSrc:spotlessCheck
> Task :buildSrc:pluginUnderTestMetadata
> Task :buildSrc:compileTestJava NO-SOURCE
> Task :buildSrc:compileTestGroovy NO-SOURCE
> Task :buildSrc:processTestResources NO-SOURCE
> Task :buildSrc:testClasses UP-TO-DATE
> Task :buildSrc:test NO-SOURCE
> Task :buildSrc:validateTaskProperties FROM-CACHE
> Task :buildSrc:check
> Task :buildSrc:build
Configuration on demand is an incubating feature.
> Task :website:cleanWebsite UP-TO-DATE
> Task :website:clean UP-TO-DATE

> Task :website:buildDockerImage
Sending build context to Docker daemon  48.37MB
Step 1/8 : FROM debian:stretch-slim
 ---> 8ff748cdd6b1
Step 2/8 : SHELL ["/bin/bash", "-o", "pipefail", "-e", "-u", "-x", "-c"]
 ---> Using cache
 ---> e34c4df1e02e
Step 3/8 : ENV DEBIAN_FRONTEND=noninteractive     LANGUAGE=C.UTF-8     LANG=C.UTF-8     LC_ALL=C.UTF-8     LC_CTYPE=C.UTF-8     LC_MESSAGES=C.UTF-8
 ---> Using cache
 ---> 757069dfbc50
Step 4/8 : RUN apt-get update     && apt-get install -y --no-install-recommends         ca-certificates         curl         git         gnupg2         gosu         lynx     && apt-get autoremove -yqq --purge     && apt-get clean     && rm -rf /var/lib/apt/lists/*
 ---> Using cache
 ---> 296e1e0d5cf8
Step 5/8 : RUN curl -sL https://deb.nodesource.com/setup_10.x | bash -     && apt-get update     && apt-get install -y --no-install-recommends         nodejs     && apt-get autoremove -yqq --purge     && apt-get clean     && rm -rf /var/lib/apt/lists/*
 ---> Using cache
 ---> 8e22d2bec517
Step 6/8 : RUN curl -sS https://dl.yarnpkg.com/debian/pubkey.gpg | apt-key add -     && echo "deb https://dl.yarnpkg.com/debian/ stable main" | tee /etc/apt/sources.list.d/yarn.list     && apt-get update     && apt-get install -y --no-install-recommends yarn     && apt-get autoremove -yqq --purge     && apt-get clean     && rm -rf /var/lib/apt/lists/*
 ---> Using cache
 ---> 5a2a0e98de69
Step 7/8 : RUN HUGOHOME="$(mktemp -d)"     && export HUGOHOME     && curl -sL https://github.com/gohugoio/hugo/releases/download/v0.68.3/hugo_extended_0.68.3_Linux-64bit.tar.gz > "${HUGOHOME}/hugo.tar.gz"     && tar -xzvf "${HUGOHOME}/hugo.tar.gz" hugo     && mv hugo /usr/local/bin/hugo     && chmod +x /usr/local/bin/hugo     && rm -r "${HUGOHOME}"
 ---> Using cache
 ---> 4383f962e28a
Step 8/8 : WORKDIR /opt/
 ---> Using cache
 ---> 47a979744ea8
Successfully built 47a979744ea8
Successfully tagged beam-website:latest

> Task :website:createDockerContainer

> Task :website:startDockerContainer
017e152d81561a868102f536299d173ef66f88fc784cf1891b411651fa79ae89

> Task :website:setupDockerContainer

> Task :website:installDependencies
yarn install v1.22.4
warning Skipping preferred cache folder "/.cache/yarn" because it is not writable.
warning Selected the next writable cache folder in the list, will be "/tmp/.yarn-cache-910".
[1/4] Resolving packages...
[2/4] Fetching packages...
info fsevents@2.1.3: The platform "linux" is incompatible with this module.
info "fsevents@2.1.3" is an optional dependency and failed compatibility check. Excluding it from installation.
[3/4] Linking dependencies...
info Visit https://yarnpkg.com/en/docs/cli/install for documentation about this command.
error Could not write file "/opt/website/www/yarn-error.log": "EACCES: permission denied, open '/opt/website/www/yarn-error.log'"
error An unexpected error occurred: "EACCES: permission denied, mkdir '/opt/website/www/node_modules'".

> Task :website:installDependencies FAILED

> Task :website:initGitSubmodules FAILED
error: could not lock config file .git/config: Permission denied
fatal: Failed to register url for submodule path 'website/www/site/themes/docsy'

> Task :website:buildCodeSamples FAILED
yarn run v1.22.4
warning Skipping preferred cache folder "/.cache/yarn" because it is not writable.
warning Selected the next writable cache folder in the list, will be "/tmp/.yarn-cache-910".
$ ./build_code_samples.sh
warning Cannot find a suitable global folder. Tried these: "/usr/local, /.yarn"
Working directory: /opt/website/www
Dist directory: ./site/code_samples
mkdir: cannot create directory ‘./site/code_samples’: Permission denied
error Command failed with exit code 1.
info Visit https://yarnpkg.com/en/docs/cli/run for documentation about this command.

> Task :website:buildApacheWebsite FAILED
yarn run v1.22.4
warning Skipping preferred cache folder "/.cache/yarn" because it is not writable.
warning Selected the next writable cache folder in the list, will be "/tmp/.yarn-cache-910".
$ cross-env HUGO_ENV=production hugo --minify -d ../dist -s site -v -d /opt/build/website/generated-apache-content --config /opt/website/www/site/config.toml
warning Cannot find a suitable global folder. Tried these: "/usr/local, /.yarn"
/bin/sh: 1: cross-env: not found
error Command failed with exit code 127.
info Visit https://yarnpkg.com/en/docs/cli/run for documentation about this command.

> Task :website:stopAndRemoveDockerContainer
017e152d81561a868102f536299d173ef66f88fc784cf1891b411651fa79ae89

FAILURE: Build completed with 4 failures.

1: Task failed with an exception.
-----------
* What went wrong:
Execution failed for task ':website:installDependencies'.
> Process 'command 'docker'' finished with non-zero exit value 1

* Try:
Run with --stacktrace option to get the stack trace. Run with --info or --debug option to get more log output. Run with --scan to get full insights.
==============================================================================

2: Task failed with an exception.
-----------
* What went wrong:
Execution failed for task ':website:initGitSubmodules'.
> Process 'command 'docker'' finished with non-zero exit value 128

* Try:
Run with --stacktrace option to get the stack trace. Run with --info or --debug option to get more log output. Run with --scan to get full insights.
==============================================================================

3: Task failed with an exception.
-----------
* What went wrong:
Execution failed for task ':website:buildCodeSamples'.
> Process 'command 'docker'' finished with non-zero exit value 1

* Try:
Run with --stacktrace option to get the stack trace. Run with --info or --debug option to get more log output. Run with --scan to get full insights.
==============================================================================

4: Task failed with an exception.
-----------
* What went wrong:
Execution failed for task ':website:buildApacheWebsite'.
> Process 'command 'docker'' finished with non-zero exit value 127

* Try:
Run with --stacktrace option to get the stack trace. Run with --info or --debug option to get more log output. Run with --scan to get full insights.
==============================================================================

* Get more help at https://help.gradle.org

Deprecated Gradle features were used in this build, making it incompatible with Gradle 6.0.
Use '--warning-mode all' to show the individual deprecation warnings.
See https://docs.gradle.org/5.2.1/userguide/command_line_interface.html#sec:command_line_warnings

BUILD FAILED in 1m 0s
11 actionable tasks: 9 executed, 2 up-to-date

Publishing build scan...
https://gradle.com/s/qlc6co7fi6rzi

Build step 'Invoke Gradle script' changed build result to FAILURE
Build step 'Invoke Gradle script' marked build as failure

---------------------------------------------------------------------
To unsubscribe, e-mail: builds-unsubscribe@beam.apache.org
For additional commands, e-mail: builds-help@beam.apache.org


Build failed in Jenkins: beam_PostCommit_Website_Publish #6670

Posted by Apache Jenkins Server <je...@builds.apache.org>.
See <https://ci-beam.apache.org/job/beam_PostCommit_Website_Publish/6670/display/redirect?page=changes>

Changes:

[zyichi] Fix PairWithRestrictionFn process no attribute signature error

[Boyuan Zhang] Handle split when truncate observes windows.

[noreply] [BEAM-10821] Add Python SDK typing improvements to CHANGES.md (#12693)


------------------------------------------
Started by timer
Running as SYSTEM
[EnvInject] - Loading node environment variables.
Building remotely on websites1 (git-websites svn-websites) in workspace <https://ci-beam.apache.org/job/beam_PostCommit_Website_Publish/ws/>
No credentials specified
Wiping out workspace first.
Cloning the remote Git repository
Cloning repository https://github.com/apache/beam.git
 > git init <https://ci-beam.apache.org/job/beam_PostCommit_Website_Publish/ws/src> # timeout=10
Fetching upstream changes from https://github.com/apache/beam.git
 > git --version # timeout=10
 > git fetch --tags --progress -- https://github.com/apache/beam.git +refs/heads/*:refs/remotes/origin/* # timeout=10
 > git config remote.origin.url https://github.com/apache/beam.git # timeout=10
 > git config --add remote.origin.fetch +refs/heads/*:refs/remotes/origin/* # timeout=10
 > git config remote.origin.url https://github.com/apache/beam.git # timeout=10
Fetching upstream changes from https://github.com/apache/beam.git
 > git fetch --tags --progress -- https://github.com/apache/beam.git +refs/heads/*:refs/remotes/origin/* +refs/pull/${ghprbPullId}/*:refs/remotes/origin/pr/${ghprbPullId}/* # timeout=10
 > git rev-parse origin/master^{commit} # timeout=10
Checking out Revision d6adcdfe806ef8a72b84c9841f1447999f0652c1 (origin/master)
 > git config core.sparsecheckout # timeout=10
 > git checkout -f d6adcdfe806ef8a72b84c9841f1447999f0652c1 # timeout=10
Commit message: "Merge pull request #12419 from boyuanzz/window_split"
 > git rev-list --no-walk 5408b9738029252c28589687b8604a060c491dcf # timeout=10
No emails were triggered.
[EnvInject] - Executing scripts and injecting environment variables after the SCM step.
[EnvInject] - Injecting as environment variables the properties content 
SPARK_LOCAL_IP=127.0.0.1

[EnvInject] - Variables injected successfully.
[Gradle] - Launching build.
[src] $ <https://ci-beam.apache.org/job/beam_PostCommit_Website_Publish/ws/src/gradlew> --continue --max-workers=12 -Dorg.gradle.jvmargs=-Xms2g -Dorg.gradle.jvmargs=-Xmx4g -Pdocker-pull-licenses :website:clean :website:publishWebsite
To honour the JVM settings for this build a new JVM will be forked. Please consider using the daemon: https://docs.gradle.org/5.2.1/userguide/gradle_daemon.html.
Daemon will be stopped at the end of the build stopping after processing
> Task :buildSrc:compileJava NO-SOURCE
> Task :buildSrc:compileGroovy FROM-CACHE
> Task :buildSrc:pluginDescriptors
> Task :buildSrc:processResources
> Task :buildSrc:classes
> Task :buildSrc:jar
> Task :buildSrc:assemble
> Task :buildSrc:spotlessGroovy
> Task :buildSrc:spotlessGroovyCheck
> Task :buildSrc:spotlessGroovyGradle
> Task :buildSrc:spotlessGroovyGradleCheck
> Task :buildSrc:spotlessCheck
> Task :buildSrc:pluginUnderTestMetadata
> Task :buildSrc:compileTestJava NO-SOURCE
> Task :buildSrc:compileTestGroovy NO-SOURCE
> Task :buildSrc:processTestResources NO-SOURCE
> Task :buildSrc:testClasses UP-TO-DATE
> Task :buildSrc:test NO-SOURCE
> Task :buildSrc:validateTaskProperties FROM-CACHE
> Task :buildSrc:check
> Task :buildSrc:build
Configuration on demand is an incubating feature.
> Task :website:cleanWebsite UP-TO-DATE
> Task :website:clean UP-TO-DATE

> Task :website:buildDockerImage
Sending build context to Docker daemon  48.37MB
Step 1/8 : FROM debian:stretch-slim
 ---> 8ff748cdd6b1
Step 2/8 : SHELL ["/bin/bash", "-o", "pipefail", "-e", "-u", "-x", "-c"]
 ---> Using cache
 ---> e34c4df1e02e
Step 3/8 : ENV DEBIAN_FRONTEND=noninteractive     LANGUAGE=C.UTF-8     LANG=C.UTF-8     LC_ALL=C.UTF-8     LC_CTYPE=C.UTF-8     LC_MESSAGES=C.UTF-8
 ---> Using cache
 ---> 757069dfbc50
Step 4/8 : RUN apt-get update     && apt-get install -y --no-install-recommends         ca-certificates         curl         git         gnupg2         gosu         lynx     && apt-get autoremove -yqq --purge     && apt-get clean     && rm -rf /var/lib/apt/lists/*
 ---> Using cache
 ---> 296e1e0d5cf8
Step 5/8 : RUN curl -sL https://deb.nodesource.com/setup_10.x | bash -     && apt-get update     && apt-get install -y --no-install-recommends         nodejs     && apt-get autoremove -yqq --purge     && apt-get clean     && rm -rf /var/lib/apt/lists/*
 ---> Using cache
 ---> 8e22d2bec517
Step 6/8 : RUN curl -sS https://dl.yarnpkg.com/debian/pubkey.gpg | apt-key add -     && echo "deb https://dl.yarnpkg.com/debian/ stable main" | tee /etc/apt/sources.list.d/yarn.list     && apt-get update     && apt-get install -y --no-install-recommends yarn     && apt-get autoremove -yqq --purge     && apt-get clean     && rm -rf /var/lib/apt/lists/*
 ---> Using cache
 ---> 5a2a0e98de69
Step 7/8 : RUN HUGOHOME="$(mktemp -d)"     && export HUGOHOME     && curl -sL https://github.com/gohugoio/hugo/releases/download/v0.68.3/hugo_extended_0.68.3_Linux-64bit.tar.gz > "${HUGOHOME}/hugo.tar.gz"     && tar -xzvf "${HUGOHOME}/hugo.tar.gz" hugo     && mv hugo /usr/local/bin/hugo     && chmod +x /usr/local/bin/hugo     && rm -r "${HUGOHOME}"
 ---> Using cache
 ---> 4383f962e28a
Step 8/8 : WORKDIR /opt/
 ---> Using cache
 ---> 47a979744ea8
Successfully built 47a979744ea8
Successfully tagged beam-website:latest

> Task :website:createDockerContainer

> Task :website:startDockerContainer
39b585386b2bae4f703fbea34579e4deac503d7078f6973406752ca8f7572bab

> Task :website:setupDockerContainer

> Task :website:installDependencies
yarn install v1.22.4
warning Skipping preferred cache folder "/.cache/yarn" because it is not writable.
warning Selected the next writable cache folder in the list, will be "/tmp/.yarn-cache-910".
[1/4] Resolving packages...
[2/4] Fetching packages...
info fsevents@2.1.3: The platform "linux" is incompatible with this module.
info "fsevents@2.1.3" is an optional dependency and failed compatibility check. Excluding it from installation.
[3/4] Linking dependencies...
info Visit https://yarnpkg.com/en/docs/cli/install for documentation about this command.
error Could not write file "/opt/website/www/yarn-error.log": "EACCES: permission denied, open '/opt/website/www/yarn-error.log'"
error An unexpected error occurred: "EACCES: permission denied, mkdir '/opt/website/www/node_modules'".

> Task :website:installDependencies FAILED

> Task :website:initGitSubmodules FAILED
error: could not lock config file .git/config: Permission denied
fatal: Failed to register url for submodule path 'website/www/site/themes/docsy'

> Task :website:buildCodeSamples FAILED
yarn run v1.22.4
warning Skipping preferred cache folder "/.cache/yarn" because it is not writable.
warning Selected the next writable cache folder in the list, will be "/tmp/.yarn-cache-910".
$ ./build_code_samples.sh
warning Cannot find a suitable global folder. Tried these: "/usr/local, /.yarn"
Working directory: /opt/website/www
Dist directory: ./site/code_samples
mkdir: cannot create directory ‘./site/code_samples’: Permission denied
error Command failed with exit code 1.
info Visit https://yarnpkg.com/en/docs/cli/run for documentation about this command.

> Task :website:buildApacheWebsite FAILED
yarn run v1.22.4
warning Skipping preferred cache folder "/.cache/yarn" because it is not writable.
warning Selected the next writable cache folder in the list, will be "/tmp/.yarn-cache-910".
$ cross-env HUGO_ENV=production hugo --minify -d ../dist -s site -v -d /opt/build/website/generated-apache-content --config /opt/website/www/site/config.toml
warning Cannot find a suitable global folder. Tried these: "/usr/local, /.yarn"
/bin/sh: 1: cross-env: not found
error Command failed with exit code 127.
info Visit https://yarnpkg.com/en/docs/cli/run for documentation about this command.

> Task :website:stopAndRemoveDockerContainer
39b585386b2bae4f703fbea34579e4deac503d7078f6973406752ca8f7572bab

FAILURE: Build completed with 4 failures.

1: Task failed with an exception.
-----------
* What went wrong:
Execution failed for task ':website:installDependencies'.
> Process 'command 'docker'' finished with non-zero exit value 1

* Try:
Run with --stacktrace option to get the stack trace. Run with --info or --debug option to get more log output. Run with --scan to get full insights.
==============================================================================

2: Task failed with an exception.
-----------
* What went wrong:
Execution failed for task ':website:initGitSubmodules'.
> Process 'command 'docker'' finished with non-zero exit value 128

* Try:
Run with --stacktrace option to get the stack trace. Run with --info or --debug option to get more log output. Run with --scan to get full insights.
==============================================================================

3: Task failed with an exception.
-----------
* What went wrong:
Execution failed for task ':website:buildCodeSamples'.
> Process 'command 'docker'' finished with non-zero exit value 1

* Try:
Run with --stacktrace option to get the stack trace. Run with --info or --debug option to get more log output. Run with --scan to get full insights.
==============================================================================

4: Task failed with an exception.
-----------
* What went wrong:
Execution failed for task ':website:buildApacheWebsite'.
> Process 'command 'docker'' finished with non-zero exit value 127

* Try:
Run with --stacktrace option to get the stack trace. Run with --info or --debug option to get more log output. Run with --scan to get full insights.
==============================================================================

* Get more help at https://help.gradle.org

Deprecated Gradle features were used in this build, making it incompatible with Gradle 6.0.
Use '--warning-mode all' to show the individual deprecation warnings.
See https://docs.gradle.org/5.2.1/userguide/command_line_interface.html#sec:command_line_warnings

BUILD FAILED in 1m 6s
11 actionable tasks: 9 executed, 2 up-to-date

Publishing build scan...
https://gradle.com/s/jssbmg2alq5ra

Build step 'Invoke Gradle script' changed build result to FAILURE
Build step 'Invoke Gradle script' marked build as failure

---------------------------------------------------------------------
To unsubscribe, e-mail: builds-unsubscribe@beam.apache.org
For additional commands, e-mail: builds-help@beam.apache.org


Build failed in Jenkins: beam_PostCommit_Website_Publish #6669

Posted by Apache Jenkins Server <je...@builds.apache.org>.
See <https://ci-beam.apache.org/job/beam_PostCommit_Website_Publish/6669/display/redirect?page=changes>

Changes:

[leiyiz] implement query 12

[saavan] Fix author names

[noreply] [BEAM-10701] Add codecov config, fix paths hopefully (#12684)

[noreply] Merge pull request #12674 from [BEAM-8258] basic metric feature for

[noreply] Add skipped tests for Series.dt and Series.str methods (#12615)

[noreply] [BEAM-9547] Add a few more DataFrame operations (#12682)


------------------------------------------
Started by timer
Running as SYSTEM
[EnvInject] - Loading node environment variables.
Building remotely on websites1 (git-websites svn-websites) in workspace <https://ci-beam.apache.org/job/beam_PostCommit_Website_Publish/ws/>
No credentials specified
Wiping out workspace first.
Cloning the remote Git repository
Cloning repository https://github.com/apache/beam.git
 > git init <https://ci-beam.apache.org/job/beam_PostCommit_Website_Publish/ws/src> # timeout=10
Fetching upstream changes from https://github.com/apache/beam.git
 > git --version # timeout=10
 > git fetch --tags --progress -- https://github.com/apache/beam.git +refs/heads/*:refs/remotes/origin/* # timeout=10
 > git config remote.origin.url https://github.com/apache/beam.git # timeout=10
 > git config --add remote.origin.fetch +refs/heads/*:refs/remotes/origin/* # timeout=10
 > git config remote.origin.url https://github.com/apache/beam.git # timeout=10
Fetching upstream changes from https://github.com/apache/beam.git
 > git fetch --tags --progress -- https://github.com/apache/beam.git +refs/heads/*:refs/remotes/origin/* +refs/pull/${ghprbPullId}/*:refs/remotes/origin/pr/${ghprbPullId}/* # timeout=10
 > git rev-parse origin/master^{commit} # timeout=10
Checking out Revision 5408b9738029252c28589687b8604a060c491dcf (origin/master)
 > git config core.sparsecheckout # timeout=10
 > git checkout -f 5408b9738029252c28589687b8604a060c491dcf # timeout=10
Commit message: "[BEAM-9547] Add a few more DataFrame operations (#12682)"
 > git rev-list --no-walk b1849ed09fb236906ff0b83b0f394c08b05d4b3c # timeout=10
No emails were triggered.
[EnvInject] - Executing scripts and injecting environment variables after the SCM step.
[EnvInject] - Injecting as environment variables the properties content 
SPARK_LOCAL_IP=127.0.0.1

[EnvInject] - Variables injected successfully.
[Gradle] - Launching build.
[src] $ <https://ci-beam.apache.org/job/beam_PostCommit_Website_Publish/ws/src/gradlew> --continue --max-workers=12 -Dorg.gradle.jvmargs=-Xms2g -Dorg.gradle.jvmargs=-Xmx4g -Pdocker-pull-licenses :website:clean :website:publishWebsite
To honour the JVM settings for this build a new JVM will be forked. Please consider using the daemon: https://docs.gradle.org/5.2.1/userguide/gradle_daemon.html.
Daemon will be stopped at the end of the build stopping after processing
> Task :buildSrc:compileJava NO-SOURCE
> Task :buildSrc:compileGroovy FROM-CACHE
> Task :buildSrc:pluginDescriptors
> Task :buildSrc:processResources
> Task :buildSrc:classes
> Task :buildSrc:jar
> Task :buildSrc:assemble
> Task :buildSrc:spotlessGroovy
> Task :buildSrc:spotlessGroovyCheck
> Task :buildSrc:spotlessGroovyGradle
> Task :buildSrc:spotlessGroovyGradleCheck
> Task :buildSrc:spotlessCheck
> Task :buildSrc:pluginUnderTestMetadata
> Task :buildSrc:compileTestJava NO-SOURCE
> Task :buildSrc:compileTestGroovy NO-SOURCE
> Task :buildSrc:processTestResources NO-SOURCE
> Task :buildSrc:testClasses UP-TO-DATE
> Task :buildSrc:test NO-SOURCE
> Task :buildSrc:validateTaskProperties FROM-CACHE
> Task :buildSrc:check
> Task :buildSrc:build
Configuration on demand is an incubating feature.
> Task :website:cleanWebsite UP-TO-DATE
> Task :website:clean UP-TO-DATE

> Task :website:buildDockerImage
Sending build context to Docker daemon  48.37MB
Step 1/8 : FROM debian:stretch-slim
stretch-slim: Pulling from library/debian
Digest: sha256:c4052b51588fc32fe0c25a984a34cad5dc5990b9c12744073a9c409a6d0737cf
Status: Downloaded newer image for debian:stretch-slim
 ---> 8ff748cdd6b1
Step 2/8 : SHELL ["/bin/bash", "-o", "pipefail", "-e", "-u", "-x", "-c"]
 ---> Using cache
 ---> e34c4df1e02e
Step 3/8 : ENV DEBIAN_FRONTEND=noninteractive     LANGUAGE=C.UTF-8     LANG=C.UTF-8     LC_ALL=C.UTF-8     LC_CTYPE=C.UTF-8     LC_MESSAGES=C.UTF-8
 ---> Using cache
 ---> 757069dfbc50
Step 4/8 : RUN apt-get update     && apt-get install -y --no-install-recommends         ca-certificates         curl         git         gnupg2         gosu         lynx     && apt-get autoremove -yqq --purge     && apt-get clean     && rm -rf /var/lib/apt/lists/*
 ---> Using cache
 ---> 296e1e0d5cf8
Step 5/8 : RUN curl -sL https://deb.nodesource.com/setup_10.x | bash -     && apt-get update     && apt-get install -y --no-install-recommends         nodejs     && apt-get autoremove -yqq --purge     && apt-get clean     && rm -rf /var/lib/apt/lists/*
 ---> Using cache
 ---> 8e22d2bec517
Step 6/8 : RUN curl -sS https://dl.yarnpkg.com/debian/pubkey.gpg | apt-key add -     && echo "deb https://dl.yarnpkg.com/debian/ stable main" | tee /etc/apt/sources.list.d/yarn.list     && apt-get update     && apt-get install -y --no-install-recommends yarn     && apt-get autoremove -yqq --purge     && apt-get clean     && rm -rf /var/lib/apt/lists/*
 ---> Using cache
 ---> 5a2a0e98de69
Step 7/8 : RUN HUGOHOME="$(mktemp -d)"     && export HUGOHOME     && curl -sL https://github.com/gohugoio/hugo/releases/download/v0.68.3/hugo_extended_0.68.3_Linux-64bit.tar.gz > "${HUGOHOME}/hugo.tar.gz"     && tar -xzvf "${HUGOHOME}/hugo.tar.gz" hugo     && mv hugo /usr/local/bin/hugo     && chmod +x /usr/local/bin/hugo     && rm -r "${HUGOHOME}"
 ---> Using cache
 ---> 4383f962e28a
Step 8/8 : WORKDIR /opt/
 ---> Using cache
 ---> 47a979744ea8
Successfully built 47a979744ea8
Successfully tagged beam-website:latest

> Task :website:createDockerContainer

> Task :website:startDockerContainer
33870df8f6412ca1b5c10aecbc6e6f8e35c2222c4278fa8c3d714ad12d77eb8a

> Task :website:setupDockerContainer

> Task :website:installDependencies
yarn install v1.22.4
warning Skipping preferred cache folder "/.cache/yarn" because it is not writable.
warning Selected the next writable cache folder in the list, will be "/tmp/.yarn-cache-910".
[1/4] Resolving packages...
[2/4] Fetching packages...
info fsevents@2.1.3: The platform "linux" is incompatible with this module.
info "fsevents@2.1.3" is an optional dependency and failed compatibility check. Excluding it from installation.
[3/4] Linking dependencies...
info Visit https://yarnpkg.com/en/docs/cli/install for documentation about this command.
error Could not write file "/opt/website/www/yarn-error.log": "EACCES: permission denied, open '/opt/website/www/yarn-error.log'"
error An unexpected error occurred: "EACCES: permission denied, mkdir '/opt/website/www/node_modules'".

> Task :website:installDependencies FAILED

> Task :website:initGitSubmodules FAILED
error: could not lock config file .git/config: Permission denied
fatal: Failed to register url for submodule path 'website/www/site/themes/docsy'

> Task :website:buildCodeSamples FAILED
yarn run v1.22.4
warning Skipping preferred cache folder "/.cache/yarn" because it is not writable.
warning Selected the next writable cache folder in the list, will be "/tmp/.yarn-cache-910".
$ ./build_code_samples.sh
warning Cannot find a suitable global folder. Tried these: "/usr/local, /.yarn"
Working directory: /opt/website/www
Dist directory: ./site/code_samples
mkdir: cannot create directory ‘./site/code_samples’: Permission denied
error Command failed with exit code 1.
info Visit https://yarnpkg.com/en/docs/cli/run for documentation about this command.

> Task :website:buildApacheWebsite FAILED
yarn run v1.22.4
warning Skipping preferred cache folder "/.cache/yarn" because it is not writable.
$ cross-env HUGO_ENV=production hugo --minify -d ../dist -s site -v -d /opt/build/website/generated-apache-content --config /opt/website/www/site/config.toml
warning Selected the next writable cache folder in the list, will be "/tmp/.yarn-cache-910".
warning Cannot find a suitable global folder. Tried these: "/usr/local, /.yarn"
/bin/sh: 1: cross-env: not found
error Command failed with exit code 127.
info Visit https://yarnpkg.com/en/docs/cli/run for documentation about this command.

> Task :website:stopAndRemoveDockerContainer
33870df8f6412ca1b5c10aecbc6e6f8e35c2222c4278fa8c3d714ad12d77eb8a

FAILURE: Build completed with 4 failures.

1: Task failed with an exception.
-----------
* What went wrong:
Execution failed for task ':website:installDependencies'.
> Process 'command 'docker'' finished with non-zero exit value 1

* Try:
Run with --stacktrace option to get the stack trace. Run with --info or --debug option to get more log output. Run with --scan to get full insights.
==============================================================================

2: Task failed with an exception.
-----------
* What went wrong:
Execution failed for task ':website:initGitSubmodules'.
> Process 'command 'docker'' finished with non-zero exit value 128

* Try:
Run with --stacktrace option to get the stack trace. Run with --info or --debug option to get more log output. Run with --scan to get full insights.
==============================================================================

3: Task failed with an exception.
-----------
* What went wrong:
Execution failed for task ':website:buildCodeSamples'.
> Process 'command 'docker'' finished with non-zero exit value 1

* Try:
Run with --stacktrace option to get the stack trace. Run with --info or --debug option to get more log output. Run with --scan to get full insights.
==============================================================================

4: Task failed with an exception.
-----------
* What went wrong:
Execution failed for task ':website:buildApacheWebsite'.
> Process 'command 'docker'' finished with non-zero exit value 127

* Try:
Run with --stacktrace option to get the stack trace. Run with --info or --debug option to get more log output. Run with --scan to get full insights.
==============================================================================

* Get more help at https://help.gradle.org

Deprecated Gradle features were used in this build, making it incompatible with Gradle 6.0.
Use '--warning-mode all' to show the individual deprecation warnings.
See https://docs.gradle.org/5.2.1/userguide/command_line_interface.html#sec:command_line_warnings

BUILD FAILED in 1m 8s
11 actionable tasks: 9 executed, 2 up-to-date

Publishing build scan...
https://gradle.com/s/xjeib52wcip6o

Build step 'Invoke Gradle script' changed build result to FAILURE
Build step 'Invoke Gradle script' marked build as failure

---------------------------------------------------------------------
To unsubscribe, e-mail: builds-unsubscribe@beam.apache.org
For additional commands, e-mail: builds-help@beam.apache.org


Build failed in Jenkins: beam_PostCommit_Website_Publish #6668

Posted by Apache Jenkins Server <je...@builds.apache.org>.
See <https://ci-beam.apache.org/job/beam_PostCommit_Website_Publish/6668/display/redirect?page=changes>

Changes:

[sychen] Refactor to reuse computation+key

[Luke Cwik] [BEAM-10771] Fix whitespace error causing whitespace lint to fail

[noreply] [BEAM-4980] Upgrade to Netty 4.1.51.Final and Netty_tcnative

[noreply] [BEAM-10670] Make Twister2Runner opt-out for using an SDF powered Read


------------------------------------------
Started by timer
Running as SYSTEM
[EnvInject] - Loading node environment variables.
Building remotely on websites1 (git-websites svn-websites) in workspace <https://ci-beam.apache.org/job/beam_PostCommit_Website_Publish/ws/>
No credentials specified
Wiping out workspace first.
Cloning the remote Git repository
Cloning repository https://github.com/apache/beam.git
 > git init <https://ci-beam.apache.org/job/beam_PostCommit_Website_Publish/ws/src> # timeout=10
Fetching upstream changes from https://github.com/apache/beam.git
 > git --version # timeout=10
 > git fetch --tags --progress -- https://github.com/apache/beam.git +refs/heads/*:refs/remotes/origin/* # timeout=10
 > git config remote.origin.url https://github.com/apache/beam.git # timeout=10
 > git config --add remote.origin.fetch +refs/heads/*:refs/remotes/origin/* # timeout=10
 > git config remote.origin.url https://github.com/apache/beam.git # timeout=10
Fetching upstream changes from https://github.com/apache/beam.git
 > git fetch --tags --progress -- https://github.com/apache/beam.git +refs/heads/*:refs/remotes/origin/* +refs/pull/${ghprbPullId}/*:refs/remotes/origin/pr/${ghprbPullId}/* # timeout=10
 > git rev-parse origin/master^{commit} # timeout=10
Checking out Revision b1849ed09fb236906ff0b83b0f394c08b05d4b3c (origin/master)
 > git config core.sparsecheckout # timeout=10
 > git checkout -f b1849ed09fb236906ff0b83b0f394c08b05d4b3c # timeout=10
Commit message: "Merge pull request #12677 from nehsyc/cleanup"
 > git rev-list --no-walk f675112bc6894a63b38f6a4ffd7eff985efaaa08 # timeout=10
No emails were triggered.
[EnvInject] - Executing scripts and injecting environment variables after the SCM step.
[EnvInject] - Injecting as environment variables the properties content 
SPARK_LOCAL_IP=127.0.0.1

[EnvInject] - Variables injected successfully.
[Gradle] - Launching build.
[src] $ <https://ci-beam.apache.org/job/beam_PostCommit_Website_Publish/ws/src/gradlew> --continue --max-workers=12 -Dorg.gradle.jvmargs=-Xms2g -Dorg.gradle.jvmargs=-Xmx4g -Pdocker-pull-licenses :website:clean :website:publishWebsite
To honour the JVM settings for this build a new JVM will be forked. Please consider using the daemon: https://docs.gradle.org/5.2.1/userguide/gradle_daemon.html.
Daemon will be stopped at the end of the build stopping after processing
> Task :buildSrc:compileJava NO-SOURCE
> Task :buildSrc:compileGroovy
> Task :buildSrc:pluginDescriptors
> Task :buildSrc:processResources
> Task :buildSrc:classes
> Task :buildSrc:jar
> Task :buildSrc:assemble
> Task :buildSrc:spotlessGroovy
> Task :buildSrc:spotlessGroovyCheck
> Task :buildSrc:spotlessGroovyGradle
> Task :buildSrc:spotlessGroovyGradleCheck
> Task :buildSrc:spotlessCheck
> Task :buildSrc:pluginUnderTestMetadata
> Task :buildSrc:compileTestJava NO-SOURCE
> Task :buildSrc:compileTestGroovy NO-SOURCE
> Task :buildSrc:processTestResources NO-SOURCE
> Task :buildSrc:testClasses UP-TO-DATE
> Task :buildSrc:test NO-SOURCE
> Task :buildSrc:validateTaskProperties
> Task :buildSrc:check
> Task :buildSrc:build
Configuration on demand is an incubating feature.
> Task :website:cleanWebsite UP-TO-DATE
> Task :website:clean UP-TO-DATE

> Task :website:buildDockerImage
Sending build context to Docker daemon  48.37MB
Step 1/8 : FROM debian:stretch-slim
 ---> 8ff748cdd6b1
Step 2/8 : SHELL ["/bin/bash", "-o", "pipefail", "-e", "-u", "-x", "-c"]
 ---> Using cache
 ---> e34c4df1e02e
Step 3/8 : ENV DEBIAN_FRONTEND=noninteractive     LANGUAGE=C.UTF-8     LANG=C.UTF-8     LC_ALL=C.UTF-8     LC_CTYPE=C.UTF-8     LC_MESSAGES=C.UTF-8
 ---> Using cache
 ---> 757069dfbc50
Step 4/8 : RUN apt-get update     && apt-get install -y --no-install-recommends         ca-certificates         curl         git         gnupg2         gosu         lynx     && apt-get autoremove -yqq --purge     && apt-get clean     && rm -rf /var/lib/apt/lists/*
 ---> Using cache
 ---> 296e1e0d5cf8
Step 5/8 : RUN curl -sL https://deb.nodesource.com/setup_10.x | bash -     && apt-get update     && apt-get install -y --no-install-recommends         nodejs     && apt-get autoremove -yqq --purge     && apt-get clean     && rm -rf /var/lib/apt/lists/*
 ---> Using cache
 ---> 8e22d2bec517
Step 6/8 : RUN curl -sS https://dl.yarnpkg.com/debian/pubkey.gpg | apt-key add -     && echo "deb https://dl.yarnpkg.com/debian/ stable main" | tee /etc/apt/sources.list.d/yarn.list     && apt-get update     && apt-get install -y --no-install-recommends yarn     && apt-get autoremove -yqq --purge     && apt-get clean     && rm -rf /var/lib/apt/lists/*
 ---> Using cache
 ---> 5a2a0e98de69
Step 7/8 : RUN HUGOHOME="$(mktemp -d)"     && export HUGOHOME     && curl -sL https://github.com/gohugoio/hugo/releases/download/v0.68.3/hugo_extended_0.68.3_Linux-64bit.tar.gz > "${HUGOHOME}/hugo.tar.gz"     && tar -xzvf "${HUGOHOME}/hugo.tar.gz" hugo     && mv hugo /usr/local/bin/hugo     && chmod +x /usr/local/bin/hugo     && rm -r "${HUGOHOME}"
 ---> Using cache
 ---> 4383f962e28a
Step 8/8 : WORKDIR /opt/
 ---> Using cache
 ---> 47a979744ea8
Successfully built 47a979744ea8
Successfully tagged beam-website:latest

> Task :website:createDockerContainer

> Task :website:startDockerContainer
da6e177753580db60f0cd5d1996c6f6eca7d77ce6d1b3e10b7f4876c07d99d61

> Task :website:setupDockerContainer

> Task :website:installDependencies
yarn install v1.22.4
warning Skipping preferred cache folder "/.cache/yarn" because it is not writable.
warning Selected the next writable cache folder in the list, will be "/tmp/.yarn-cache-910".
[1/4] Resolving packages...
[2/4] Fetching packages...
info fsevents@2.1.3: The platform "linux" is incompatible with this module.
info "fsevents@2.1.3" is an optional dependency and failed compatibility check. Excluding it from installation.
[3/4] Linking dependencies...
info Visit https://yarnpkg.com/en/docs/cli/install for documentation about this command.
error Could not write file "/opt/website/www/yarn-error.log": "EACCES: permission denied, open '/opt/website/www/yarn-error.log'"
error An unexpected error occurred: "EACCES: permission denied, mkdir '/opt/website/www/node_modules'".

> Task :website:installDependencies FAILED

> Task :website:initGitSubmodules FAILED
error: could not lock config file .git/config: Permission denied
fatal: Failed to register url for submodule path 'website/www/site/themes/docsy'

> Task :website:buildCodeSamples FAILED
yarn run v1.22.4
warning Skipping preferred cache folder "/.cache/yarn" because it is not writable.
warning Selected the next writable cache folder in the list, will be "/tmp/.yarn-cache-910".
$ ./build_code_samples.sh
warning Cannot find a suitable global folder. Tried these: "/usr/local, /.yarn"
Working directory: /opt/website/www
Dist directory: ./site/code_samples
mkdir: cannot create directory ‘./site/code_samples’: Permission denied
error Command failed with exit code 1.
info Visit https://yarnpkg.com/en/docs/cli/run for documentation about this command.

> Task :website:buildApacheWebsite FAILED
yarn run v1.22.4
warning Skipping preferred cache folder "/.cache/yarn" because it is not writable.
warning Selected the next writable cache folder in the list, will be "/tmp/.yarn-cache-910".
$ cross-env HUGO_ENV=production hugo --minify -d ../dist -s site -v -d /opt/build/website/generated-apache-content --config /opt/website/www/site/config.toml
warning Cannot find a suitable global folder. Tried these: "/usr/local, /.yarn"
/bin/sh: 1: cross-env: not found
error Command failed with exit code 127.
info Visit https://yarnpkg.com/en/docs/cli/run for documentation about this command.

> Task :website:stopAndRemoveDockerContainer
da6e177753580db60f0cd5d1996c6f6eca7d77ce6d1b3e10b7f4876c07d99d61

FAILURE: Build completed with 4 failures.

1: Task failed with an exception.
-----------
* What went wrong:
Execution failed for task ':website:installDependencies'.
> Process 'command 'docker'' finished with non-zero exit value 1

* Try:
Run with --stacktrace option to get the stack trace. Run with --info or --debug option to get more log output. Run with --scan to get full insights.
==============================================================================

2: Task failed with an exception.
-----------
* What went wrong:
Execution failed for task ':website:initGitSubmodules'.
> Process 'command 'docker'' finished with non-zero exit value 128

* Try:
Run with --stacktrace option to get the stack trace. Run with --info or --debug option to get more log output. Run with --scan to get full insights.
==============================================================================

3: Task failed with an exception.
-----------
* What went wrong:
Execution failed for task ':website:buildCodeSamples'.
> Process 'command 'docker'' finished with non-zero exit value 1

* Try:
Run with --stacktrace option to get the stack trace. Run with --info or --debug option to get more log output. Run with --scan to get full insights.
==============================================================================

4: Task failed with an exception.
-----------
* What went wrong:
Execution failed for task ':website:buildApacheWebsite'.
> Process 'command 'docker'' finished with non-zero exit value 127

* Try:
Run with --stacktrace option to get the stack trace. Run with --info or --debug option to get more log output. Run with --scan to get full insights.
==============================================================================

* Get more help at https://help.gradle.org

Deprecated Gradle features were used in this build, making it incompatible with Gradle 6.0.
Use '--warning-mode all' to show the individual deprecation warnings.
See https://docs.gradle.org/5.2.1/userguide/command_line_interface.html#sec:command_line_warnings

BUILD FAILED in 58s
11 actionable tasks: 9 executed, 2 up-to-date

Publishing build scan...
https://gradle.com/s/ntjdgouvxdsey

Build step 'Invoke Gradle script' changed build result to FAILURE
Build step 'Invoke Gradle script' marked build as failure

---------------------------------------------------------------------
To unsubscribe, e-mail: builds-unsubscribe@beam.apache.org
For additional commands, e-mail: builds-help@beam.apache.org


Build failed in Jenkins: beam_PostCommit_Website_Publish #6667

Posted by Apache Jenkins Server <je...@builds.apache.org>.
See <https://ci-beam.apache.org/job/beam_PostCommit_Website_Publish/6667/display/redirect?page=changes>

Changes:

[noreply] [BEAM-10675] Add Python GBK Load Tests for streaming on Dataflow 


------------------------------------------
Started by timer
Running as SYSTEM
[EnvInject] - Loading node environment variables.
Building remotely on websites1 (git-websites svn-websites) in workspace <https://ci-beam.apache.org/job/beam_PostCommit_Website_Publish/ws/>
No credentials specified
Wiping out workspace first.
Cloning the remote Git repository
Cloning repository https://github.com/apache/beam.git
 > git init <https://ci-beam.apache.org/job/beam_PostCommit_Website_Publish/ws/src> # timeout=10
Fetching upstream changes from https://github.com/apache/beam.git
 > git --version # timeout=10
 > git fetch --tags --progress -- https://github.com/apache/beam.git +refs/heads/*:refs/remotes/origin/* # timeout=10
 > git config remote.origin.url https://github.com/apache/beam.git # timeout=10
 > git config --add remote.origin.fetch +refs/heads/*:refs/remotes/origin/* # timeout=10
 > git config remote.origin.url https://github.com/apache/beam.git # timeout=10
Fetching upstream changes from https://github.com/apache/beam.git
 > git fetch --tags --progress -- https://github.com/apache/beam.git +refs/heads/*:refs/remotes/origin/* +refs/pull/${ghprbPullId}/*:refs/remotes/origin/pr/${ghprbPullId}/* # timeout=10
 > git rev-parse origin/master^{commit} # timeout=10
Checking out Revision f675112bc6894a63b38f6a4ffd7eff985efaaa08 (origin/master)
 > git config core.sparsecheckout # timeout=10
 > git checkout -f f675112bc6894a63b38f6a4ffd7eff985efaaa08 # timeout=10
Commit message: "[BEAM-10675] Add Python GBK Load Tests for streaming on Dataflow  (#12612)"
 > git rev-list --no-walk 0b364446162bdf51ad8d23b5a539e3cedbb5b936 # timeout=10
No emails were triggered.
[EnvInject] - Executing scripts and injecting environment variables after the SCM step.
[EnvInject] - Injecting as environment variables the properties content 
SPARK_LOCAL_IP=127.0.0.1

[EnvInject] - Variables injected successfully.
[Gradle] - Launching build.
[src] $ <https://ci-beam.apache.org/job/beam_PostCommit_Website_Publish/ws/src/gradlew> --continue --max-workers=12 -Dorg.gradle.jvmargs=-Xms2g -Dorg.gradle.jvmargs=-Xmx4g -Pdocker-pull-licenses :website:clean :website:publishWebsite
To honour the JVM settings for this build a new JVM will be forked. Please consider using the daemon: https://docs.gradle.org/5.2.1/userguide/gradle_daemon.html.
Daemon will be stopped at the end of the build stopping after processing
> Task :buildSrc:compileJava NO-SOURCE
> Task :buildSrc:compileGroovy FROM-CACHE
> Task :buildSrc:pluginDescriptors
> Task :buildSrc:processResources
> Task :buildSrc:classes
> Task :buildSrc:jar
> Task :buildSrc:assemble
> Task :buildSrc:spotlessGroovy
> Task :buildSrc:spotlessGroovyCheck
> Task :buildSrc:spotlessGroovyGradle
> Task :buildSrc:spotlessGroovyGradleCheck
> Task :buildSrc:spotlessCheck
> Task :buildSrc:pluginUnderTestMetadata
> Task :buildSrc:compileTestJava NO-SOURCE
> Task :buildSrc:compileTestGroovy NO-SOURCE
> Task :buildSrc:processTestResources NO-SOURCE
> Task :buildSrc:testClasses UP-TO-DATE
> Task :buildSrc:test NO-SOURCE
> Task :buildSrc:validateTaskProperties FROM-CACHE
> Task :buildSrc:check
> Task :buildSrc:build
Configuration on demand is an incubating feature.
> Task :website:cleanWebsite UP-TO-DATE
> Task :website:clean UP-TO-DATE

> Task :website:buildDockerImage
Sending build context to Docker daemon  48.37MB
Step 1/8 : FROM debian:stretch-slim
 ---> 8ff748cdd6b1
Step 2/8 : SHELL ["/bin/bash", "-o", "pipefail", "-e", "-u", "-x", "-c"]
 ---> Using cache
 ---> e34c4df1e02e
Step 3/8 : ENV DEBIAN_FRONTEND=noninteractive     LANGUAGE=C.UTF-8     LANG=C.UTF-8     LC_ALL=C.UTF-8     LC_CTYPE=C.UTF-8     LC_MESSAGES=C.UTF-8
 ---> Using cache
 ---> 757069dfbc50
Step 4/8 : RUN apt-get update     && apt-get install -y --no-install-recommends         ca-certificates         curl         git         gnupg2         gosu         lynx     && apt-get autoremove -yqq --purge     && apt-get clean     && rm -rf /var/lib/apt/lists/*
 ---> Using cache
 ---> 296e1e0d5cf8
Step 5/8 : RUN curl -sL https://deb.nodesource.com/setup_10.x | bash -     && apt-get update     && apt-get install -y --no-install-recommends         nodejs     && apt-get autoremove -yqq --purge     && apt-get clean     && rm -rf /var/lib/apt/lists/*
 ---> Using cache
 ---> 8e22d2bec517
Step 6/8 : RUN curl -sS https://dl.yarnpkg.com/debian/pubkey.gpg | apt-key add -     && echo "deb https://dl.yarnpkg.com/debian/ stable main" | tee /etc/apt/sources.list.d/yarn.list     && apt-get update     && apt-get install -y --no-install-recommends yarn     && apt-get autoremove -yqq --purge     && apt-get clean     && rm -rf /var/lib/apt/lists/*
 ---> Using cache
 ---> 5a2a0e98de69
Step 7/8 : RUN HUGOHOME="$(mktemp -d)"     && export HUGOHOME     && curl -sL https://github.com/gohugoio/hugo/releases/download/v0.68.3/hugo_extended_0.68.3_Linux-64bit.tar.gz > "${HUGOHOME}/hugo.tar.gz"     && tar -xzvf "${HUGOHOME}/hugo.tar.gz" hugo     && mv hugo /usr/local/bin/hugo     && chmod +x /usr/local/bin/hugo     && rm -r "${HUGOHOME}"
 ---> Using cache
 ---> 4383f962e28a
Step 8/8 : WORKDIR /opt/
 ---> Using cache
 ---> 47a979744ea8
Successfully built 47a979744ea8
Successfully tagged beam-website:latest

> Task :website:createDockerContainer

> Task :website:startDockerContainer
ea68e152c223f84478a5c1ea9bb0ce329416e7621cfe7cdbfc4fd18bfe86e527

> Task :website:setupDockerContainer

> Task :website:installDependencies
yarn install v1.22.4
warning Skipping preferred cache folder "/.cache/yarn" because it is not writable.
warning Selected the next writable cache folder in the list, will be "/tmp/.yarn-cache-910".
[1/4] Resolving packages...
[2/4] Fetching packages...
info fsevents@2.1.3: The platform "linux" is incompatible with this module.
info "fsevents@2.1.3" is an optional dependency and failed compatibility check. Excluding it from installation.
[3/4] Linking dependencies...
info Visit https://yarnpkg.com/en/docs/cli/install for documentation about this command.
error Could not write file "/opt/website/www/yarn-error.log": "EACCES: permission denied, open '/opt/website/www/yarn-error.log'"
error An unexpected error occurred: "EACCES: permission denied, mkdir '/opt/website/www/node_modules'".

> Task :website:installDependencies FAILED

> Task :website:initGitSubmodules FAILED
error: could not lock config file .git/config: Permission denied
fatal: Failed to register url for submodule path 'website/www/site/themes/docsy'

> Task :website:buildCodeSamples FAILED
yarn run v1.22.4
warning Skipping preferred cache folder "/.cache/yarn" because it is not writable.
warning Selected the next writable cache folder in the list, will be "/tmp/.yarn-cache-910".
$ ./build_code_samples.sh
warning Cannot find a suitable global folder. Tried these: "/usr/local, /.yarn"
Working directory: /opt/website/www
Dist directory: ./site/code_samples
mkdir: cannot create directory ‘./site/code_samples’: Permission denied
error Command failed with exit code 1.
info Visit https://yarnpkg.com/en/docs/cli/run for documentation about this command.

> Task :website:buildApacheWebsite FAILED
yarn run v1.22.4
warning Skipping preferred cache folder "/.cache/yarn" because it is not writable.
warning Selected the next writable cache folder in the list, will be "/tmp/.yarn-cache-910".
$ cross-env HUGO_ENV=production hugo --minify -d ../dist -s site -v -d /opt/build/website/generated-apache-content --config /opt/website/www/site/config.toml
warning Cannot find a suitable global folder. Tried these: "/usr/local, /.yarn"
/bin/sh: 1: cross-env: not found
error Command failed with exit code 127.
info Visit https://yarnpkg.com/en/docs/cli/run for documentation about this command.

> Task :website:stopAndRemoveDockerContainer
ea68e152c223f84478a5c1ea9bb0ce329416e7621cfe7cdbfc4fd18bfe86e527

FAILURE: Build completed with 4 failures.

1: Task failed with an exception.
-----------
* What went wrong:
Execution failed for task ':website:installDependencies'.
> Process 'command 'docker'' finished with non-zero exit value 1

* Try:
Run with --stacktrace option to get the stack trace. Run with --info or --debug option to get more log output. Run with --scan to get full insights.
==============================================================================

2: Task failed with an exception.
-----------
* What went wrong:
Execution failed for task ':website:initGitSubmodules'.
> Process 'command 'docker'' finished with non-zero exit value 128

* Try:
Run with --stacktrace option to get the stack trace. Run with --info or --debug option to get more log output. Run with --scan to get full insights.
==============================================================================

3: Task failed with an exception.
-----------
* What went wrong:
Execution failed for task ':website:buildCodeSamples'.
> Process 'command 'docker'' finished with non-zero exit value 1

* Try:
Run with --stacktrace option to get the stack trace. Run with --info or --debug option to get more log output. Run with --scan to get full insights.
==============================================================================

4: Task failed with an exception.
-----------
* What went wrong:
Execution failed for task ':website:buildApacheWebsite'.
> Process 'command 'docker'' finished with non-zero exit value 127

* Try:
Run with --stacktrace option to get the stack trace. Run with --info or --debug option to get more log output. Run with --scan to get full insights.
==============================================================================

* Get more help at https://help.gradle.org

Deprecated Gradle features were used in this build, making it incompatible with Gradle 6.0.
Use '--warning-mode all' to show the individual deprecation warnings.
See https://docs.gradle.org/5.2.1/userguide/command_line_interface.html#sec:command_line_warnings

BUILD FAILED in 51s
11 actionable tasks: 9 executed, 2 up-to-date

Publishing build scan...
https://gradle.com/s/whfccqwlpxfz6

Build step 'Invoke Gradle script' changed build result to FAILURE
Build step 'Invoke Gradle script' marked build as failure

---------------------------------------------------------------------
To unsubscribe, e-mail: builds-unsubscribe@beam.apache.org
For additional commands, e-mail: builds-help@beam.apache.org


Build failed in Jenkins: beam_PostCommit_Website_Publish #6666

Posted by Apache Jenkins Server <je...@builds.apache.org>.
See <https://ci-beam.apache.org/job/beam_PostCommit_Website_Publish/6666/display/redirect?page=changes>

Changes:

[noreply] [BEAM-9680] Add Aggregation Count lesson to Go SDK katas (#12646)


------------------------------------------
Started by timer
Running as SYSTEM
[EnvInject] - Loading node environment variables.
Building remotely on websites1 (git-websites svn-websites) in workspace <https://ci-beam.apache.org/job/beam_PostCommit_Website_Publish/ws/>
No credentials specified
Wiping out workspace first.
Cloning the remote Git repository
Cloning repository https://github.com/apache/beam.git
 > git init <https://ci-beam.apache.org/job/beam_PostCommit_Website_Publish/ws/src> # timeout=10
Fetching upstream changes from https://github.com/apache/beam.git
 > git --version # timeout=10
 > git fetch --tags --progress -- https://github.com/apache/beam.git +refs/heads/*:refs/remotes/origin/* # timeout=10
 > git config remote.origin.url https://github.com/apache/beam.git # timeout=10
 > git config --add remote.origin.fetch +refs/heads/*:refs/remotes/origin/* # timeout=10
 > git config remote.origin.url https://github.com/apache/beam.git # timeout=10
Fetching upstream changes from https://github.com/apache/beam.git
 > git fetch --tags --progress -- https://github.com/apache/beam.git +refs/heads/*:refs/remotes/origin/* +refs/pull/${ghprbPullId}/*:refs/remotes/origin/pr/${ghprbPullId}/* # timeout=10
 > git rev-parse origin/master^{commit} # timeout=10
Checking out Revision 0b364446162bdf51ad8d23b5a539e3cedbb5b936 (origin/master)
 > git config core.sparsecheckout # timeout=10
 > git checkout -f 0b364446162bdf51ad8d23b5a539e3cedbb5b936 # timeout=10
Commit message: "[BEAM-9680] Add Aggregation Count lesson to Go SDK katas (#12646)"
 > git rev-list --no-walk 1efe5c38e9e6a1fd6e9b038e0ed76d3ad965b292 # timeout=10
No emails were triggered.
[EnvInject] - Executing scripts and injecting environment variables after the SCM step.
[EnvInject] - Injecting as environment variables the properties content 
SPARK_LOCAL_IP=127.0.0.1

[EnvInject] - Variables injected successfully.
[Gradle] - Launching build.
[src] $ <https://ci-beam.apache.org/job/beam_PostCommit_Website_Publish/ws/src/gradlew> --continue --max-workers=12 -Dorg.gradle.jvmargs=-Xms2g -Dorg.gradle.jvmargs=-Xmx4g -Pdocker-pull-licenses :website:clean :website:publishWebsite
To honour the JVM settings for this build a new JVM will be forked. Please consider using the daemon: https://docs.gradle.org/5.2.1/userguide/gradle_daemon.html.
Daemon will be stopped at the end of the build stopping after processing
> Task :buildSrc:compileJava NO-SOURCE
> Task :buildSrc:compileGroovy FROM-CACHE
> Task :buildSrc:pluginDescriptors
> Task :buildSrc:processResources
> Task :buildSrc:classes
> Task :buildSrc:jar
> Task :buildSrc:assemble
> Task :buildSrc:spotlessGroovy
> Task :buildSrc:spotlessGroovyCheck
> Task :buildSrc:spotlessGroovyGradle
> Task :buildSrc:spotlessGroovyGradleCheck
> Task :buildSrc:spotlessCheck
> Task :buildSrc:pluginUnderTestMetadata
> Task :buildSrc:compileTestJava NO-SOURCE
> Task :buildSrc:compileTestGroovy NO-SOURCE
> Task :buildSrc:processTestResources NO-SOURCE
> Task :buildSrc:testClasses UP-TO-DATE
> Task :buildSrc:test NO-SOURCE
> Task :buildSrc:validateTaskProperties FROM-CACHE
> Task :buildSrc:check
> Task :buildSrc:build
Configuration on demand is an incubating feature.
> Task :website:cleanWebsite UP-TO-DATE
> Task :website:clean UP-TO-DATE

> Task :website:buildDockerImage
Sending build context to Docker daemon  48.37MB
Step 1/8 : FROM debian:stretch-slim
 ---> 8ff748cdd6b1
Step 2/8 : SHELL ["/bin/bash", "-o", "pipefail", "-e", "-u", "-x", "-c"]
 ---> Using cache
 ---> e34c4df1e02e
Step 3/8 : ENV DEBIAN_FRONTEND=noninteractive     LANGUAGE=C.UTF-8     LANG=C.UTF-8     LC_ALL=C.UTF-8     LC_CTYPE=C.UTF-8     LC_MESSAGES=C.UTF-8
 ---> Using cache
 ---> 757069dfbc50
Step 4/8 : RUN apt-get update     && apt-get install -y --no-install-recommends         ca-certificates         curl         git         gnupg2         gosu         lynx     && apt-get autoremove -yqq --purge     && apt-get clean     && rm -rf /var/lib/apt/lists/*
 ---> Using cache
 ---> 296e1e0d5cf8
Step 5/8 : RUN curl -sL https://deb.nodesource.com/setup_10.x | bash -     && apt-get update     && apt-get install -y --no-install-recommends         nodejs     && apt-get autoremove -yqq --purge     && apt-get clean     && rm -rf /var/lib/apt/lists/*
 ---> Using cache
 ---> 8e22d2bec517
Step 6/8 : RUN curl -sS https://dl.yarnpkg.com/debian/pubkey.gpg | apt-key add -     && echo "deb https://dl.yarnpkg.com/debian/ stable main" | tee /etc/apt/sources.list.d/yarn.list     && apt-get update     && apt-get install -y --no-install-recommends yarn     && apt-get autoremove -yqq --purge     && apt-get clean     && rm -rf /var/lib/apt/lists/*
 ---> Using cache
 ---> 5a2a0e98de69
Step 7/8 : RUN HUGOHOME="$(mktemp -d)"     && export HUGOHOME     && curl -sL https://github.com/gohugoio/hugo/releases/download/v0.68.3/hugo_extended_0.68.3_Linux-64bit.tar.gz > "${HUGOHOME}/hugo.tar.gz"     && tar -xzvf "${HUGOHOME}/hugo.tar.gz" hugo     && mv hugo /usr/local/bin/hugo     && chmod +x /usr/local/bin/hugo     && rm -r "${HUGOHOME}"
 ---> Using cache
 ---> 4383f962e28a
Step 8/8 : WORKDIR /opt/
 ---> Using cache
 ---> 47a979744ea8
Successfully built 47a979744ea8
Successfully tagged beam-website:latest

> Task :website:createDockerContainer

> Task :website:startDockerContainer
2f0445caae0611b03786a03fa4ce0ef908023f52c5d57b4feb482fc326c84a45

> Task :website:setupDockerContainer

> Task :website:installDependencies
yarn install v1.22.4
warning Skipping preferred cache folder "/.cache/yarn" because it is not writable.
warning Selected the next writable cache folder in the list, will be "/tmp/.yarn-cache-910".
[1/4] Resolving packages...
[2/4] Fetching packages...
info fsevents@2.1.3: The platform "linux" is incompatible with this module.
info "fsevents@2.1.3" is an optional dependency and failed compatibility check. Excluding it from installation.
[3/4] Linking dependencies...
info Visit https://yarnpkg.com/en/docs/cli/install for documentation about this command.
error Could not write file "/opt/website/www/yarn-error.log": "EACCES: permission denied, open '/opt/website/www/yarn-error.log'"
error An unexpected error occurred: "EACCES: permission denied, mkdir '/opt/website/www/node_modules'".

> Task :website:installDependencies FAILED

> Task :website:initGitSubmodules FAILED
error: could not lock config file .git/config: Permission denied
fatal: Failed to register url for submodule path 'website/www/site/themes/docsy'

> Task :website:buildCodeSamples FAILED
yarn run v1.22.4
warning Skipping preferred cache folder "/.cache/yarn" because it is not writable.
warning Selected the next writable cache folder in the list, will be "/tmp/.yarn-cache-910".
$ ./build_code_samples.sh
warning Cannot find a suitable global folder. Tried these: "/usr/local, /.yarn"
Working directory: /opt/website/www
Dist directory: ./site/code_samples
mkdir: cannot create directory ‘./site/code_samples’: Permission denied
error Command failed with exit code 1.
info Visit https://yarnpkg.com/en/docs/cli/run for documentation about this command.

> Task :website:buildApacheWebsite FAILED
yarn run v1.22.4
warning Skipping preferred cache folder "/.cache/yarn" because it is not writable.
warning Selected the next writable cache folder in the list, will be "/tmp/.yarn-cache-910".
$ cross-env HUGO_ENV=production hugo --minify -d ../dist -s site -v -d /opt/build/website/generated-apache-content --config /opt/website/www/site/config.toml
warning Cannot find a suitable global folder. Tried these: "/usr/local, /.yarn"
/bin/sh: 1: cross-env: not found
error Command failed with exit code 127.
info Visit https://yarnpkg.com/en/docs/cli/run for documentation about this command.

> Task :website:stopAndRemoveDockerContainer
2f0445caae0611b03786a03fa4ce0ef908023f52c5d57b4feb482fc326c84a45

FAILURE: Build completed with 4 failures.

1: Task failed with an exception.
-----------
* What went wrong:
Execution failed for task ':website:installDependencies'.
> Process 'command 'docker'' finished with non-zero exit value 1

* Try:
Run with --stacktrace option to get the stack trace. Run with --info or --debug option to get more log output. Run with --scan to get full insights.
==============================================================================

2: Task failed with an exception.
-----------
* What went wrong:
Execution failed for task ':website:initGitSubmodules'.
> Process 'command 'docker'' finished with non-zero exit value 128

* Try:
Run with --stacktrace option to get the stack trace. Run with --info or --debug option to get more log output. Run with --scan to get full insights.
==============================================================================

3: Task failed with an exception.
-----------
* What went wrong:
Execution failed for task ':website:buildCodeSamples'.
> Process 'command 'docker'' finished with non-zero exit value 1

* Try:
Run with --stacktrace option to get the stack trace. Run with --info or --debug option to get more log output. Run with --scan to get full insights.
==============================================================================

4: Task failed with an exception.
-----------
* What went wrong:
Execution failed for task ':website:buildApacheWebsite'.
> Process 'command 'docker'' finished with non-zero exit value 127

* Try:
Run with --stacktrace option to get the stack trace. Run with --info or --debug option to get more log output. Run with --scan to get full insights.
==============================================================================

* Get more help at https://help.gradle.org

Deprecated Gradle features were used in this build, making it incompatible with Gradle 6.0.
Use '--warning-mode all' to show the individual deprecation warnings.
See https://docs.gradle.org/5.2.1/userguide/command_line_interface.html#sec:command_line_warnings

BUILD FAILED in 43s
11 actionable tasks: 9 executed, 2 up-to-date

Publishing build scan...
https://gradle.com/s/yfk3fyzqvez4g

Build step 'Invoke Gradle script' changed build result to FAILURE
Build step 'Invoke Gradle script' marked build as failure

---------------------------------------------------------------------
To unsubscribe, e-mail: builds-unsubscribe@beam.apache.org
For additional commands, e-mail: builds-help@beam.apache.org


Build failed in Jenkins: beam_PostCommit_Website_Publish #6665

Posted by Apache Jenkins Server <je...@builds.apache.org>.
See <https://ci-beam.apache.org/job/beam_PostCommit_Website_Publish/6665/display/redirect?page=changes>

Changes:

[rehmanmuradali0] Adding key in Spark

[kmjung] Update BigQuery storage API source to v1

[kmjung] Make stream progress reporting work with v1 API

[kmjung] Clean up some leftovers

[kmjung] Address code review feedback

[noreply] Dataframe set_index is not index preserving (#12676)


------------------------------------------
Started by timer
Running as SYSTEM
[EnvInject] - Loading node environment variables.
Building remotely on websites1 (git-websites svn-websites) in workspace <https://ci-beam.apache.org/job/beam_PostCommit_Website_Publish/ws/>
No credentials specified
Wiping out workspace first.
Cloning the remote Git repository
Cloning repository https://github.com/apache/beam.git
 > git init <https://ci-beam.apache.org/job/beam_PostCommit_Website_Publish/ws/src> # timeout=10
Fetching upstream changes from https://github.com/apache/beam.git
 > git --version # timeout=10
 > git fetch --tags --progress -- https://github.com/apache/beam.git +refs/heads/*:refs/remotes/origin/* # timeout=10
 > git config remote.origin.url https://github.com/apache/beam.git # timeout=10
 > git config --add remote.origin.fetch +refs/heads/*:refs/remotes/origin/* # timeout=10
 > git config remote.origin.url https://github.com/apache/beam.git # timeout=10
Fetching upstream changes from https://github.com/apache/beam.git
 > git fetch --tags --progress -- https://github.com/apache/beam.git +refs/heads/*:refs/remotes/origin/* +refs/pull/${ghprbPullId}/*:refs/remotes/origin/pr/${ghprbPullId}/* # timeout=10
 > git rev-parse origin/master^{commit} # timeout=10
Checking out Revision 1efe5c38e9e6a1fd6e9b038e0ed76d3ad965b292 (origin/master)
 > git config core.sparsecheckout # timeout=10
 > git checkout -f 1efe5c38e9e6a1fd6e9b038e0ed76d3ad965b292 # timeout=10
Commit message: "Merge pull request #12494: [BEAM-10658] Update BigQuery storage sources to v1 API"
 > git rev-list --no-walk ab1112cd8febd6f15069b6f6d4537eeb1c972756 # timeout=10
No emails were triggered.
[EnvInject] - Executing scripts and injecting environment variables after the SCM step.
[EnvInject] - Injecting as environment variables the properties content 
SPARK_LOCAL_IP=127.0.0.1

[EnvInject] - Variables injected successfully.
[Gradle] - Launching build.
[src] $ <https://ci-beam.apache.org/job/beam_PostCommit_Website_Publish/ws/src/gradlew> --continue --max-workers=12 -Dorg.gradle.jvmargs=-Xms2g -Dorg.gradle.jvmargs=-Xmx4g -Pdocker-pull-licenses :website:clean :website:publishWebsite
To honour the JVM settings for this build a new JVM will be forked. Please consider using the daemon: https://docs.gradle.org/5.2.1/userguide/gradle_daemon.html.
Daemon will be stopped at the end of the build stopping after processing
> Task :buildSrc:compileJava NO-SOURCE
> Task :buildSrc:compileGroovy FROM-CACHE
> Task :buildSrc:pluginDescriptors
> Task :buildSrc:processResources
> Task :buildSrc:classes
> Task :buildSrc:jar
> Task :buildSrc:assemble
> Task :buildSrc:spotlessGroovy
> Task :buildSrc:spotlessGroovyCheck
> Task :buildSrc:spotlessGroovyGradle
> Task :buildSrc:spotlessGroovyGradleCheck
> Task :buildSrc:spotlessCheck
> Task :buildSrc:pluginUnderTestMetadata
> Task :buildSrc:compileTestJava NO-SOURCE
> Task :buildSrc:compileTestGroovy NO-SOURCE
> Task :buildSrc:processTestResources NO-SOURCE
> Task :buildSrc:testClasses UP-TO-DATE
> Task :buildSrc:test NO-SOURCE
> Task :buildSrc:validateTaskProperties FROM-CACHE
> Task :buildSrc:check
> Task :buildSrc:build
Configuration on demand is an incubating feature.
> Task :website:cleanWebsite UP-TO-DATE
> Task :website:clean UP-TO-DATE

> Task :website:buildDockerImage
Sending build context to Docker daemon  48.37MB
Step 1/8 : FROM debian:stretch-slim
stretch-slim: Pulling from library/debian
Digest: sha256:c4052b51588fc32fe0c25a984a34cad5dc5990b9c12744073a9c409a6d0737cf
Status: Downloaded newer image for debian:stretch-slim
 ---> 8ff748cdd6b1
Step 2/8 : SHELL ["/bin/bash", "-o", "pipefail", "-e", "-u", "-x", "-c"]
 ---> Using cache
 ---> e34c4df1e02e
Step 3/8 : ENV DEBIAN_FRONTEND=noninteractive     LANGUAGE=C.UTF-8     LANG=C.UTF-8     LC_ALL=C.UTF-8     LC_CTYPE=C.UTF-8     LC_MESSAGES=C.UTF-8
 ---> Using cache
 ---> 757069dfbc50
Step 4/8 : RUN apt-get update     && apt-get install -y --no-install-recommends         ca-certificates         curl         git         gnupg2         gosu         lynx     && apt-get autoremove -yqq --purge     && apt-get clean     && rm -rf /var/lib/apt/lists/*
 ---> Using cache
 ---> 296e1e0d5cf8
Step 5/8 : RUN curl -sL https://deb.nodesource.com/setup_10.x | bash -     && apt-get update     && apt-get install -y --no-install-recommends         nodejs     && apt-get autoremove -yqq --purge     && apt-get clean     && rm -rf /var/lib/apt/lists/*
 ---> Using cache
 ---> 8e22d2bec517
Step 6/8 : RUN curl -sS https://dl.yarnpkg.com/debian/pubkey.gpg | apt-key add -     && echo "deb https://dl.yarnpkg.com/debian/ stable main" | tee /etc/apt/sources.list.d/yarn.list     && apt-get update     && apt-get install -y --no-install-recommends yarn     && apt-get autoremove -yqq --purge     && apt-get clean     && rm -rf /var/lib/apt/lists/*
 ---> Using cache
 ---> 5a2a0e98de69
Step 7/8 : RUN HUGOHOME="$(mktemp -d)"     && export HUGOHOME     && curl -sL https://github.com/gohugoio/hugo/releases/download/v0.68.3/hugo_extended_0.68.3_Linux-64bit.tar.gz > "${HUGOHOME}/hugo.tar.gz"     && tar -xzvf "${HUGOHOME}/hugo.tar.gz" hugo     && mv hugo /usr/local/bin/hugo     && chmod +x /usr/local/bin/hugo     && rm -r "${HUGOHOME}"
 ---> Using cache
 ---> 4383f962e28a
Step 8/8 : WORKDIR /opt/
 ---> Using cache
 ---> 47a979744ea8
Successfully built 47a979744ea8
Successfully tagged beam-website:latest

> Task :website:createDockerContainer

> Task :website:startDockerContainer
e6dcec9b15aa7ee544b5d7c6a70b8c129bb41c12f45a93ce1073584ea5b7248f

> Task :website:setupDockerContainer

> Task :website:installDependencies
yarn install v1.22.4
warning Skipping preferred cache folder "/.cache/yarn" because it is not writable.
warning Selected the next writable cache folder in the list, will be "/tmp/.yarn-cache-910".
[1/4] Resolving packages...
[2/4] Fetching packages...
info fsevents@2.1.3: The platform "linux" is incompatible with this module.
info "fsevents@2.1.3" is an optional dependency and failed compatibility check. Excluding it from installation.
[3/4] Linking dependencies...
error Could not write file "/opt/website/www/yarn-error.log": "EACCES: permission denied, open '/opt/website/www/yarn-error.log'"
info Visit https://yarnpkg.com/en/docs/cli/install for documentation about this command.
error An unexpected error occurred: "EACCES: permission denied, mkdir '/opt/website/www/node_modules'".

> Task :website:installDependencies FAILED

> Task :website:initGitSubmodules FAILED
error: could not lock config file .git/config: Permission denied
fatal: Failed to register url for submodule path 'website/www/site/themes/docsy'

> Task :website:buildCodeSamples FAILED
yarn run v1.22.4
warning Skipping preferred cache folder "/.cache/yarn" because it is not writable.
warning Selected the next writable cache folder in the list, will be "/tmp/.yarn-cache-910".
$ ./build_code_samples.sh
warning Cannot find a suitable global folder. Tried these: "/usr/local, /.yarn"
Working directory: /opt/website/www
Dist directory: ./site/code_samples
mkdir: cannot create directory ‘./site/code_samples’: Permission denied
info Visit https://yarnpkg.com/en/docs/cli/run for documentation about this command.
error Command failed with exit code 1.

> Task :website:buildApacheWebsite FAILED
yarn run v1.22.4
warning Skipping preferred cache folder "/.cache/yarn" because it is not writable.
warning Selected the next writable cache folder in the list, will be "/tmp/.yarn-cache-910".
$ cross-env HUGO_ENV=production hugo --minify -d ../dist -s site -v -d /opt/build/website/generated-apache-content --config /opt/website/www/site/config.toml
warning Cannot find a suitable global folder. Tried these: "/usr/local, /.yarn"
/bin/sh: 1: cross-env: not found
info Visit https://yarnpkg.com/en/docs/cli/run for documentation about this command.
error Command failed with exit code 127.

> Task :website:stopAndRemoveDockerContainer
e6dcec9b15aa7ee544b5d7c6a70b8c129bb41c12f45a93ce1073584ea5b7248f

FAILURE: Build completed with 4 failures.

1: Task failed with an exception.
-----------
* What went wrong:
Execution failed for task ':website:installDependencies'.
> Process 'command 'docker'' finished with non-zero exit value 1

* Try:
Run with --stacktrace option to get the stack trace. Run with --info or --debug option to get more log output. Run with --scan to get full insights.
==============================================================================

2: Task failed with an exception.
-----------
* What went wrong:
Execution failed for task ':website:initGitSubmodules'.
> Process 'command 'docker'' finished with non-zero exit value 128

* Try:
Run with --stacktrace option to get the stack trace. Run with --info or --debug option to get more log output. Run with --scan to get full insights.
==============================================================================

3: Task failed with an exception.
-----------
* What went wrong:
Execution failed for task ':website:buildCodeSamples'.
> Process 'command 'docker'' finished with non-zero exit value 1

* Try:
Run with --stacktrace option to get the stack trace. Run with --info or --debug option to get more log output. Run with --scan to get full insights.
==============================================================================

4: Task failed with an exception.
-----------
* What went wrong:
Execution failed for task ':website:buildApacheWebsite'.
> Process 'command 'docker'' finished with non-zero exit value 127

* Try:
Run with --stacktrace option to get the stack trace. Run with --info or --debug option to get more log output. Run with --scan to get full insights.
==============================================================================

* Get more help at https://help.gradle.org

Deprecated Gradle features were used in this build, making it incompatible with Gradle 6.0.
Use '--warning-mode all' to show the individual deprecation warnings.
See https://docs.gradle.org/5.2.1/userguide/command_line_interface.html#sec:command_line_warnings

BUILD FAILED in 41s
11 actionable tasks: 9 executed, 2 up-to-date

Publishing build scan...
https://gradle.com/s/jevc77xezst6a

Build step 'Invoke Gradle script' changed build result to FAILURE
Build step 'Invoke Gradle script' marked build as failure

---------------------------------------------------------------------
To unsubscribe, e-mail: builds-unsubscribe@beam.apache.org
For additional commands, e-mail: builds-help@beam.apache.org


Build failed in Jenkins: beam_PostCommit_Website_Publish #6664

Posted by Apache Jenkins Server <je...@builds.apache.org>.
See <https://ci-beam.apache.org/job/beam_PostCommit_Website_Publish/6664/display/redirect>

Changes:


------------------------------------------
Started by timer
Running as SYSTEM
[EnvInject] - Loading node environment variables.
Building remotely on websites1 (git-websites svn-websites) in workspace <https://ci-beam.apache.org/job/beam_PostCommit_Website_Publish/ws/>
No credentials specified
Wiping out workspace first.
Cloning the remote Git repository
Cloning repository https://github.com/apache/beam.git
 > git init <https://ci-beam.apache.org/job/beam_PostCommit_Website_Publish/ws/src> # timeout=10
Fetching upstream changes from https://github.com/apache/beam.git
 > git --version # timeout=10
 > git fetch --tags --progress -- https://github.com/apache/beam.git +refs/heads/*:refs/remotes/origin/* # timeout=10
 > git config remote.origin.url https://github.com/apache/beam.git # timeout=10
 > git config --add remote.origin.fetch +refs/heads/*:refs/remotes/origin/* # timeout=10
 > git config remote.origin.url https://github.com/apache/beam.git # timeout=10
Fetching upstream changes from https://github.com/apache/beam.git
 > git fetch --tags --progress -- https://github.com/apache/beam.git +refs/heads/*:refs/remotes/origin/* +refs/pull/${ghprbPullId}/*:refs/remotes/origin/pr/${ghprbPullId}/* # timeout=10
 > git rev-parse origin/master^{commit} # timeout=10
Checking out Revision ab1112cd8febd6f15069b6f6d4537eeb1c972756 (origin/master)
 > git config core.sparsecheckout # timeout=10
 > git checkout -f ab1112cd8febd6f15069b6f6d4537eeb1c972756 # timeout=10
Commit message: "[BEAM-10777] Add two blog posts detailing changes to the type hints module of the Python SDK (#12657)"
 > git rev-list --no-walk ab1112cd8febd6f15069b6f6d4537eeb1c972756 # timeout=10
No emails were triggered.
[EnvInject] - Executing scripts and injecting environment variables after the SCM step.
[EnvInject] - Injecting as environment variables the properties content 
SPARK_LOCAL_IP=127.0.0.1

[EnvInject] - Variables injected successfully.
[Gradle] - Launching build.
[src] $ <https://ci-beam.apache.org/job/beam_PostCommit_Website_Publish/ws/src/gradlew> --continue --max-workers=12 -Dorg.gradle.jvmargs=-Xms2g -Dorg.gradle.jvmargs=-Xmx4g -Pdocker-pull-licenses :website:clean :website:publishWebsite
To honour the JVM settings for this build a new JVM will be forked. Please consider using the daemon: https://docs.gradle.org/5.2.1/userguide/gradle_daemon.html.
Daemon will be stopped at the end of the build stopping after processing
> Task :buildSrc:compileJava NO-SOURCE
> Task :buildSrc:compileGroovy FROM-CACHE
> Task :buildSrc:pluginDescriptors
> Task :buildSrc:processResources
> Task :buildSrc:classes
> Task :buildSrc:jar
> Task :buildSrc:assemble
> Task :buildSrc:spotlessGroovy
> Task :buildSrc:spotlessGroovyCheck
> Task :buildSrc:spotlessGroovyGradle
> Task :buildSrc:spotlessGroovyGradleCheck
> Task :buildSrc:spotlessCheck
> Task :buildSrc:pluginUnderTestMetadata
> Task :buildSrc:compileTestJava NO-SOURCE
> Task :buildSrc:compileTestGroovy NO-SOURCE
> Task :buildSrc:processTestResources NO-SOURCE
> Task :buildSrc:testClasses UP-TO-DATE
> Task :buildSrc:test NO-SOURCE
> Task :buildSrc:validateTaskProperties FROM-CACHE
> Task :buildSrc:check
> Task :buildSrc:build
Configuration on demand is an incubating feature.
> Task :website:cleanWebsite UP-TO-DATE
> Task :website:clean UP-TO-DATE

> Task :website:buildDockerImage
Sending build context to Docker daemon  48.37MB
Step 1/8 : FROM debian:stretch-slim
 ---> 8ff748cdd6b1
Step 2/8 : SHELL ["/bin/bash", "-o", "pipefail", "-e", "-u", "-x", "-c"]
 ---> Using cache
 ---> e34c4df1e02e
Step 3/8 : ENV DEBIAN_FRONTEND=noninteractive     LANGUAGE=C.UTF-8     LANG=C.UTF-8     LC_ALL=C.UTF-8     LC_CTYPE=C.UTF-8     LC_MESSAGES=C.UTF-8
 ---> Using cache
 ---> 757069dfbc50
Step 4/8 : RUN apt-get update     && apt-get install -y --no-install-recommends         ca-certificates         curl         git         gnupg2         gosu         lynx     && apt-get autoremove -yqq --purge     && apt-get clean     && rm -rf /var/lib/apt/lists/*
 ---> Using cache
 ---> 296e1e0d5cf8
Step 5/8 : RUN curl -sL https://deb.nodesource.com/setup_10.x | bash -     && apt-get update     && apt-get install -y --no-install-recommends         nodejs     && apt-get autoremove -yqq --purge     && apt-get clean     && rm -rf /var/lib/apt/lists/*
 ---> Using cache
 ---> 8e22d2bec517
Step 6/8 : RUN curl -sS https://dl.yarnpkg.com/debian/pubkey.gpg | apt-key add -     && echo "deb https://dl.yarnpkg.com/debian/ stable main" | tee /etc/apt/sources.list.d/yarn.list     && apt-get update     && apt-get install -y --no-install-recommends yarn     && apt-get autoremove -yqq --purge     && apt-get clean     && rm -rf /var/lib/apt/lists/*
 ---> Using cache
 ---> 5a2a0e98de69
Step 7/8 : RUN HUGOHOME="$(mktemp -d)"     && export HUGOHOME     && curl -sL https://github.com/gohugoio/hugo/releases/download/v0.68.3/hugo_extended_0.68.3_Linux-64bit.tar.gz > "${HUGOHOME}/hugo.tar.gz"     && tar -xzvf "${HUGOHOME}/hugo.tar.gz" hugo     && mv hugo /usr/local/bin/hugo     && chmod +x /usr/local/bin/hugo     && rm -r "${HUGOHOME}"
 ---> Using cache
 ---> 4383f962e28a
Step 8/8 : WORKDIR /opt/
 ---> Using cache
 ---> 47a979744ea8
Successfully built 47a979744ea8
Successfully tagged beam-website:latest

> Task :website:createDockerContainer

> Task :website:startDockerContainer
08c13b0745a1a55b8b0ec48b1b742e266d4c159278709b24a69ee9bef151df59

> Task :website:setupDockerContainer

> Task :website:installDependencies
yarn install v1.22.4
warning Skipping preferred cache folder "/.cache/yarn" because it is not writable.
warning Selected the next writable cache folder in the list, will be "/tmp/.yarn-cache-910".
[1/4] Resolving packages...
[2/4] Fetching packages...
info fsevents@2.1.3: The platform "linux" is incompatible with this module.
info "fsevents@2.1.3" is an optional dependency and failed compatibility check. Excluding it from installation.
[3/4] Linking dependencies...
error Could not write file "/opt/website/www/yarn-error.log": "EACCES: permission denied, open '/opt/website/www/yarn-error.log'"
info Visit https://yarnpkg.com/en/docs/cli/install for documentation about this command.
error An unexpected error occurred: "EACCES: permission denied, mkdir '/opt/website/www/node_modules'".

> Task :website:installDependencies FAILED

> Task :website:initGitSubmodules FAILED
error: could not lock config file .git/config: Permission denied
fatal: Failed to register url for submodule path 'website/www/site/themes/docsy'

> Task :website:buildCodeSamples FAILED
yarn run v1.22.4
warning Skipping preferred cache folder "/.cache/yarn" because it is not writable.
warning Selected the next writable cache folder in the list, will be "/tmp/.yarn-cache-910".
$ ./build_code_samples.sh
warning Cannot find a suitable global folder. Tried these: "/usr/local, /.yarn"
Working directory: /opt/website/www
Dist directory: ./site/code_samples
mkdir: cannot create directory ‘./site/code_samples’: Permission denied
error Command failed with exit code 1.
info Visit https://yarnpkg.com/en/docs/cli/run for documentation about this command.

> Task :website:buildApacheWebsite FAILED
yarn run v1.22.4
warning Skipping preferred cache folder "/.cache/yarn" because it is not writable.
warning Selected the next writable cache folder in the list, will be "/tmp/.yarn-cache-910".
$ cross-env HUGO_ENV=production hugo --minify -d ../dist -s site -v -d /opt/build/website/generated-apache-content --config /opt/website/www/site/config.toml
warning Cannot find a suitable global folder. Tried these: "/usr/local, /.yarn"
/bin/sh: 1: cross-env: not found
error Command failed with exit code 127.
info Visit https://yarnpkg.com/en/docs/cli/run for documentation about this command.

> Task :website:stopAndRemoveDockerContainer
08c13b0745a1a55b8b0ec48b1b742e266d4c159278709b24a69ee9bef151df59

FAILURE: Build completed with 4 failures.

1: Task failed with an exception.
-----------
* What went wrong:
Execution failed for task ':website:installDependencies'.
> Process 'command 'docker'' finished with non-zero exit value 1

* Try:
Run with --stacktrace option to get the stack trace. Run with --info or --debug option to get more log output. Run with --scan to get full insights.
==============================================================================

2: Task failed with an exception.
-----------
* What went wrong:
Execution failed for task ':website:initGitSubmodules'.
> Process 'command 'docker'' finished with non-zero exit value 128

* Try:
Run with --stacktrace option to get the stack trace. Run with --info or --debug option to get more log output. Run with --scan to get full insights.
==============================================================================

3: Task failed with an exception.
-----------
* What went wrong:
Execution failed for task ':website:buildCodeSamples'.
> Process 'command 'docker'' finished with non-zero exit value 1

* Try:
Run with --stacktrace option to get the stack trace. Run with --info or --debug option to get more log output. Run with --scan to get full insights.
==============================================================================

4: Task failed with an exception.
-----------
* What went wrong:
Execution failed for task ':website:buildApacheWebsite'.
> Process 'command 'docker'' finished with non-zero exit value 127

* Try:
Run with --stacktrace option to get the stack trace. Run with --info or --debug option to get more log output. Run with --scan to get full insights.
==============================================================================

* Get more help at https://help.gradle.org

Deprecated Gradle features were used in this build, making it incompatible with Gradle 6.0.
Use '--warning-mode all' to show the individual deprecation warnings.
See https://docs.gradle.org/5.2.1/userguide/command_line_interface.html#sec:command_line_warnings

BUILD FAILED in 52s
11 actionable tasks: 9 executed, 2 up-to-date

Publishing build scan...
https://gradle.com/s/gcazebyvbo5ks

Build step 'Invoke Gradle script' changed build result to FAILURE
Build step 'Invoke Gradle script' marked build as failure

---------------------------------------------------------------------
To unsubscribe, e-mail: builds-unsubscribe@beam.apache.org
For additional commands, e-mail: builds-help@beam.apache.org


Build failed in Jenkins: beam_PostCommit_Website_Publish #6663

Posted by Apache Jenkins Server <je...@builds.apache.org>.
See <https://ci-beam.apache.org/job/beam_PostCommit_Website_Publish/6663/display/redirect>

Changes:


------------------------------------------
Started by timer
Running as SYSTEM
[EnvInject] - Loading node environment variables.
Building remotely on websites1 (git-websites svn-websites) in workspace <https://ci-beam.apache.org/job/beam_PostCommit_Website_Publish/ws/>
No credentials specified
Wiping out workspace first.
Cloning the remote Git repository
Cloning repository https://github.com/apache/beam.git
 > git init <https://ci-beam.apache.org/job/beam_PostCommit_Website_Publish/ws/src> # timeout=10
Fetching upstream changes from https://github.com/apache/beam.git
 > git --version # timeout=10
 > git fetch --tags --progress -- https://github.com/apache/beam.git +refs/heads/*:refs/remotes/origin/* # timeout=10
 > git config remote.origin.url https://github.com/apache/beam.git # timeout=10
 > git config --add remote.origin.fetch +refs/heads/*:refs/remotes/origin/* # timeout=10
 > git config remote.origin.url https://github.com/apache/beam.git # timeout=10
Fetching upstream changes from https://github.com/apache/beam.git
 > git fetch --tags --progress -- https://github.com/apache/beam.git +refs/heads/*:refs/remotes/origin/* +refs/pull/${ghprbPullId}/*:refs/remotes/origin/pr/${ghprbPullId}/* # timeout=10
 > git rev-parse origin/master^{commit} # timeout=10
Checking out Revision ab1112cd8febd6f15069b6f6d4537eeb1c972756 (origin/master)
 > git config core.sparsecheckout # timeout=10
 > git checkout -f ab1112cd8febd6f15069b6f6d4537eeb1c972756 # timeout=10
Commit message: "[BEAM-10777] Add two blog posts detailing changes to the type hints module of the Python SDK (#12657)"
 > git rev-list --no-walk ab1112cd8febd6f15069b6f6d4537eeb1c972756 # timeout=10
No emails were triggered.
[EnvInject] - Executing scripts and injecting environment variables after the SCM step.
[EnvInject] - Injecting as environment variables the properties content 
SPARK_LOCAL_IP=127.0.0.1

[EnvInject] - Variables injected successfully.
[Gradle] - Launching build.
[src] $ <https://ci-beam.apache.org/job/beam_PostCommit_Website_Publish/ws/src/gradlew> --continue --max-workers=12 -Dorg.gradle.jvmargs=-Xms2g -Dorg.gradle.jvmargs=-Xmx4g -Pdocker-pull-licenses :website:clean :website:publishWebsite
To honour the JVM settings for this build a new JVM will be forked. Please consider using the daemon: https://docs.gradle.org/5.2.1/userguide/gradle_daemon.html.
Daemon will be stopped at the end of the build stopping after processing
> Task :buildSrc:compileJava NO-SOURCE
> Task :buildSrc:compileGroovy FROM-CACHE
> Task :buildSrc:pluginDescriptors
> Task :buildSrc:processResources
> Task :buildSrc:classes
> Task :buildSrc:jar
> Task :buildSrc:assemble
> Task :buildSrc:spotlessGroovy
> Task :buildSrc:spotlessGroovyCheck
> Task :buildSrc:spotlessGroovyGradle
> Task :buildSrc:spotlessGroovyGradleCheck
> Task :buildSrc:spotlessCheck
> Task :buildSrc:pluginUnderTestMetadata
> Task :buildSrc:compileTestJava NO-SOURCE
> Task :buildSrc:compileTestGroovy NO-SOURCE
> Task :buildSrc:processTestResources NO-SOURCE
> Task :buildSrc:testClasses UP-TO-DATE
> Task :buildSrc:test NO-SOURCE
> Task :buildSrc:validateTaskProperties FROM-CACHE
> Task :buildSrc:check
> Task :buildSrc:build
Configuration on demand is an incubating feature.
> Task :website:cleanWebsite UP-TO-DATE
> Task :website:clean UP-TO-DATE

> Task :website:buildDockerImage
Sending build context to Docker daemon  48.37MB
Step 1/8 : FROM debian:stretch-slim
 ---> 8ff748cdd6b1
Step 2/8 : SHELL ["/bin/bash", "-o", "pipefail", "-e", "-u", "-x", "-c"]
 ---> Using cache
 ---> e34c4df1e02e
Step 3/8 : ENV DEBIAN_FRONTEND=noninteractive     LANGUAGE=C.UTF-8     LANG=C.UTF-8     LC_ALL=C.UTF-8     LC_CTYPE=C.UTF-8     LC_MESSAGES=C.UTF-8
 ---> Using cache
 ---> 757069dfbc50
Step 4/8 : RUN apt-get update     && apt-get install -y --no-install-recommends         ca-certificates         curl         git         gnupg2         gosu         lynx     && apt-get autoremove -yqq --purge     && apt-get clean     && rm -rf /var/lib/apt/lists/*
 ---> Using cache
 ---> 296e1e0d5cf8
Step 5/8 : RUN curl -sL https://deb.nodesource.com/setup_10.x | bash -     && apt-get update     && apt-get install -y --no-install-recommends         nodejs     && apt-get autoremove -yqq --purge     && apt-get clean     && rm -rf /var/lib/apt/lists/*
 ---> Using cache
 ---> 8e22d2bec517
Step 6/8 : RUN curl -sS https://dl.yarnpkg.com/debian/pubkey.gpg | apt-key add -     && echo "deb https://dl.yarnpkg.com/debian/ stable main" | tee /etc/apt/sources.list.d/yarn.list     && apt-get update     && apt-get install -y --no-install-recommends yarn     && apt-get autoremove -yqq --purge     && apt-get clean     && rm -rf /var/lib/apt/lists/*
 ---> Using cache
 ---> 5a2a0e98de69
Step 7/8 : RUN HUGOHOME="$(mktemp -d)"     && export HUGOHOME     && curl -sL https://github.com/gohugoio/hugo/releases/download/v0.68.3/hugo_extended_0.68.3_Linux-64bit.tar.gz > "${HUGOHOME}/hugo.tar.gz"     && tar -xzvf "${HUGOHOME}/hugo.tar.gz" hugo     && mv hugo /usr/local/bin/hugo     && chmod +x /usr/local/bin/hugo     && rm -r "${HUGOHOME}"
 ---> Using cache
 ---> 4383f962e28a
Step 8/8 : WORKDIR /opt/
 ---> Using cache
 ---> 47a979744ea8
Successfully built 47a979744ea8
Successfully tagged beam-website:latest

> Task :website:createDockerContainer

> Task :website:startDockerContainer
832c22cc7dcb3bf69c5029c8dad541ea9f29413564ab37b41f7b0a222c8533f1

> Task :website:setupDockerContainer

> Task :website:installDependencies
yarn install v1.22.4
warning Skipping preferred cache folder "/.cache/yarn" because it is not writable.
warning Selected the next writable cache folder in the list, will be "/tmp/.yarn-cache-910".
[1/4] Resolving packages...
[2/4] Fetching packages...
info fsevents@2.1.3: The platform "linux" is incompatible with this module.
info "fsevents@2.1.3" is an optional dependency and failed compatibility check. Excluding it from installation.
[3/4] Linking dependencies...
error Could not write file "/opt/website/www/yarn-error.log": "EACCES: permission denied, open '/opt/website/www/yarn-error.log'"
info Visit https://yarnpkg.com/en/docs/cli/install for documentation about this command.
error An unexpected error occurred: "EACCES: permission denied, mkdir '/opt/website/www/node_modules'".

> Task :website:installDependencies FAILED

> Task :website:initGitSubmodules FAILED
error: could not lock config file .git/config: Permission denied
fatal: Failed to register url for submodule path 'website/www/site/themes/docsy'

> Task :website:buildCodeSamples FAILED
yarn run v1.22.4
warning Skipping preferred cache folder "/.cache/yarn" because it is not writable.
warning Selected the next writable cache folder in the list, will be "/tmp/.yarn-cache-910".
$ ./build_code_samples.sh
warning Cannot find a suitable global folder. Tried these: "/usr/local, /.yarn"
Working directory: /opt/website/www
Dist directory: ./site/code_samples
mkdir: cannot create directory ‘./site/code_samples’: Permission denied
error Command failed with exit code 1.
info Visit https://yarnpkg.com/en/docs/cli/run for documentation about this command.

> Task :website:buildApacheWebsite FAILED
yarn run v1.22.4
warning Skipping preferred cache folder "/.cache/yarn" because it is not writable.
warning Selected the next writable cache folder in the list, will be "/tmp/.yarn-cache-910".
$ cross-env HUGO_ENV=production hugo --minify -d ../dist -s site -v -d /opt/build/website/generated-apache-content --config /opt/website/www/site/config.toml
warning Cannot find a suitable global folder. Tried these: "/usr/local, /.yarn"
/bin/sh: 1: cross-env: not found
error Command failed with exit code 127.
info Visit https://yarnpkg.com/en/docs/cli/run for documentation about this command.

> Task :website:stopAndRemoveDockerContainer
832c22cc7dcb3bf69c5029c8dad541ea9f29413564ab37b41f7b0a222c8533f1

FAILURE: Build completed with 4 failures.

1: Task failed with an exception.
-----------
* What went wrong:
Execution failed for task ':website:installDependencies'.
> Process 'command 'docker'' finished with non-zero exit value 1

* Try:
Run with --stacktrace option to get the stack trace. Run with --info or --debug option to get more log output. Run with --scan to get full insights.
==============================================================================

2: Task failed with an exception.
-----------
* What went wrong:
Execution failed for task ':website:initGitSubmodules'.
> Process 'command 'docker'' finished with non-zero exit value 128

* Try:
Run with --stacktrace option to get the stack trace. Run with --info or --debug option to get more log output. Run with --scan to get full insights.
==============================================================================

3: Task failed with an exception.
-----------
* What went wrong:
Execution failed for task ':website:buildCodeSamples'.
> Process 'command 'docker'' finished with non-zero exit value 1

* Try:
Run with --stacktrace option to get the stack trace. Run with --info or --debug option to get more log output. Run with --scan to get full insights.
==============================================================================

4: Task failed with an exception.
-----------
* What went wrong:
Execution failed for task ':website:buildApacheWebsite'.
> Process 'command 'docker'' finished with non-zero exit value 127

* Try:
Run with --stacktrace option to get the stack trace. Run with --info or --debug option to get more log output. Run with --scan to get full insights.
==============================================================================

* Get more help at https://help.gradle.org

Deprecated Gradle features were used in this build, making it incompatible with Gradle 6.0.
Use '--warning-mode all' to show the individual deprecation warnings.
See https://docs.gradle.org/5.2.1/userguide/command_line_interface.html#sec:command_line_warnings

BUILD FAILED in 56s
11 actionable tasks: 9 executed, 2 up-to-date

Publishing build scan...
https://gradle.com/s/f7tmaytwfckio

Build step 'Invoke Gradle script' changed build result to FAILURE
Build step 'Invoke Gradle script' marked build as failure

---------------------------------------------------------------------
To unsubscribe, e-mail: builds-unsubscribe@beam.apache.org
For additional commands, e-mail: builds-help@beam.apache.org


Build failed in Jenkins: beam_PostCommit_Website_Publish #6662

Posted by Apache Jenkins Server <je...@builds.apache.org>.
See <https://ci-beam.apache.org/job/beam_PostCommit_Website_Publish/6662/display/redirect?page=changes>

Changes:

[noreply] [BEAM-10777] Add two blog posts detailing changes to the type hints


------------------------------------------
Started by timer
Running as SYSTEM
[EnvInject] - Loading node environment variables.
Building remotely on websites1 (git-websites svn-websites) in workspace <https://ci-beam.apache.org/job/beam_PostCommit_Website_Publish/ws/>
No credentials specified
Wiping out workspace first.
Cloning the remote Git repository
Cloning repository https://github.com/apache/beam.git
 > git init <https://ci-beam.apache.org/job/beam_PostCommit_Website_Publish/ws/src> # timeout=10
Fetching upstream changes from https://github.com/apache/beam.git
 > git --version # timeout=10
 > git fetch --tags --progress -- https://github.com/apache/beam.git +refs/heads/*:refs/remotes/origin/* # timeout=10
 > git config remote.origin.url https://github.com/apache/beam.git # timeout=10
 > git config --add remote.origin.fetch +refs/heads/*:refs/remotes/origin/* # timeout=10
 > git config remote.origin.url https://github.com/apache/beam.git # timeout=10
Fetching upstream changes from https://github.com/apache/beam.git
 > git fetch --tags --progress -- https://github.com/apache/beam.git +refs/heads/*:refs/remotes/origin/* +refs/pull/${ghprbPullId}/*:refs/remotes/origin/pr/${ghprbPullId}/* # timeout=10
 > git rev-parse origin/master^{commit} # timeout=10
Checking out Revision ab1112cd8febd6f15069b6f6d4537eeb1c972756 (origin/master)
 > git config core.sparsecheckout # timeout=10
 > git checkout -f ab1112cd8febd6f15069b6f6d4537eeb1c972756 # timeout=10
Commit message: "[BEAM-10777] Add two blog posts detailing changes to the type hints module of the Python SDK (#12657)"
 > git rev-list --no-walk a99c6826a067f49ebb60e625c8652900c7d0e810 # timeout=10
No emails were triggered.
[EnvInject] - Executing scripts and injecting environment variables after the SCM step.
[EnvInject] - Injecting as environment variables the properties content 
SPARK_LOCAL_IP=127.0.0.1

[EnvInject] - Variables injected successfully.
[Gradle] - Launching build.
[src] $ <https://ci-beam.apache.org/job/beam_PostCommit_Website_Publish/ws/src/gradlew> --continue --max-workers=12 -Dorg.gradle.jvmargs=-Xms2g -Dorg.gradle.jvmargs=-Xmx4g -Pdocker-pull-licenses :website:clean :website:publishWebsite
To honour the JVM settings for this build a new JVM will be forked. Please consider using the daemon: https://docs.gradle.org/5.2.1/userguide/gradle_daemon.html.
Daemon will be stopped at the end of the build stopping after processing
> Task :buildSrc:compileJava NO-SOURCE
> Task :buildSrc:compileGroovy FROM-CACHE
> Task :buildSrc:pluginDescriptors
> Task :buildSrc:processResources
> Task :buildSrc:classes
> Task :buildSrc:jar
> Task :buildSrc:assemble
> Task :buildSrc:spotlessGroovy
> Task :buildSrc:spotlessGroovyCheck
> Task :buildSrc:spotlessGroovyGradle
> Task :buildSrc:spotlessGroovyGradleCheck
> Task :buildSrc:spotlessCheck
> Task :buildSrc:pluginUnderTestMetadata
> Task :buildSrc:compileTestJava NO-SOURCE
> Task :buildSrc:compileTestGroovy NO-SOURCE
> Task :buildSrc:processTestResources NO-SOURCE
> Task :buildSrc:testClasses UP-TO-DATE
> Task :buildSrc:test NO-SOURCE
> Task :buildSrc:validateTaskProperties FROM-CACHE
> Task :buildSrc:check
> Task :buildSrc:build
Configuration on demand is an incubating feature.
> Task :website:cleanWebsite UP-TO-DATE
> Task :website:clean UP-TO-DATE

> Task :website:buildDockerImage
Sending build context to Docker daemon  48.37MB
Step 1/8 : FROM debian:stretch-slim
 ---> 8ff748cdd6b1
Step 2/8 : SHELL ["/bin/bash", "-o", "pipefail", "-e", "-u", "-x", "-c"]
 ---> Using cache
 ---> e34c4df1e02e
Step 3/8 : ENV DEBIAN_FRONTEND=noninteractive     LANGUAGE=C.UTF-8     LANG=C.UTF-8     LC_ALL=C.UTF-8     LC_CTYPE=C.UTF-8     LC_MESSAGES=C.UTF-8
 ---> Using cache
 ---> 757069dfbc50
Step 4/8 : RUN apt-get update     && apt-get install -y --no-install-recommends         ca-certificates         curl         git         gnupg2         gosu         lynx     && apt-get autoremove -yqq --purge     && apt-get clean     && rm -rf /var/lib/apt/lists/*
 ---> Using cache
 ---> 296e1e0d5cf8
Step 5/8 : RUN curl -sL https://deb.nodesource.com/setup_10.x | bash -     && apt-get update     && apt-get install -y --no-install-recommends         nodejs     && apt-get autoremove -yqq --purge     && apt-get clean     && rm -rf /var/lib/apt/lists/*
 ---> Using cache
 ---> 8e22d2bec517
Step 6/8 : RUN curl -sS https://dl.yarnpkg.com/debian/pubkey.gpg | apt-key add -     && echo "deb https://dl.yarnpkg.com/debian/ stable main" | tee /etc/apt/sources.list.d/yarn.list     && apt-get update     && apt-get install -y --no-install-recommends yarn     && apt-get autoremove -yqq --purge     && apt-get clean     && rm -rf /var/lib/apt/lists/*
 ---> Using cache
 ---> 5a2a0e98de69
Step 7/8 : RUN HUGOHOME="$(mktemp -d)"     && export HUGOHOME     && curl -sL https://github.com/gohugoio/hugo/releases/download/v0.68.3/hugo_extended_0.68.3_Linux-64bit.tar.gz > "${HUGOHOME}/hugo.tar.gz"     && tar -xzvf "${HUGOHOME}/hugo.tar.gz" hugo     && mv hugo /usr/local/bin/hugo     && chmod +x /usr/local/bin/hugo     && rm -r "${HUGOHOME}"
 ---> Using cache
 ---> 4383f962e28a
Step 8/8 : WORKDIR /opt/
 ---> Using cache
 ---> 47a979744ea8
Successfully built 47a979744ea8
Successfully tagged beam-website:latest

> Task :website:createDockerContainer

> Task :website:startDockerContainer
9dde0b8d6e17d5cad97be6521196e5e9e3d11fadcb74e67f0c75501e671e6658

> Task :website:setupDockerContainer

> Task :website:installDependencies
yarn install v1.22.4
warning Skipping preferred cache folder "/.cache/yarn" because it is not writable.
warning Selected the next writable cache folder in the list, will be "/tmp/.yarn-cache-910".
[1/4] Resolving packages...
[2/4] Fetching packages...
info fsevents@2.1.3: The platform "linux" is incompatible with this module.
info "fsevents@2.1.3" is an optional dependency and failed compatibility check. Excluding it from installation.
[3/4] Linking dependencies...
error Could not write file "/opt/website/www/yarn-error.log": "EACCES: permission denied, open '/opt/website/www/yarn-error.log'"
info Visit https://yarnpkg.com/en/docs/cli/install for documentation about this command.
error An unexpected error occurred: "EACCES: permission denied, mkdir '/opt/website/www/node_modules'".

> Task :website:installDependencies FAILED

> Task :website:initGitSubmodules FAILED
error: could not lock config file .git/config: Permission denied
fatal: Failed to register url for submodule path 'website/www/site/themes/docsy'

> Task :website:buildCodeSamples FAILED
yarn run v1.22.4
warning Skipping preferred cache folder "/.cache/yarn" because it is not writable.
warning Selected the next writable cache folder in the list, will be "/tmp/.yarn-cache-910".
$ ./build_code_samples.sh
warning Cannot find a suitable global folder. Tried these: "/usr/local, /.yarn"
Working directory: /opt/website/www
Dist directory: ./site/code_samples
mkdir: cannot create directory ‘./site/code_samples’: Permission denied
info Visit https://yarnpkg.com/en/docs/cli/run for documentation about this command.
error Command failed with exit code 1.

> Task :website:buildApacheWebsite FAILED
yarn run v1.22.4
warning Skipping preferred cache folder "/.cache/yarn" because it is not writable.
warning Selected the next writable cache folder in the list, will be "/tmp/.yarn-cache-910".
$ cross-env HUGO_ENV=production hugo --minify -d ../dist -s site -v -d /opt/build/website/generated-apache-content --config /opt/website/www/site/config.toml
warning Cannot find a suitable global folder. Tried these: "/usr/local, /.yarn"
/bin/sh: 1: cross-env: not found
error Command failed with exit code 127.
info Visit https://yarnpkg.com/en/docs/cli/run for documentation about this command.

> Task :website:stopAndRemoveDockerContainer
9dde0b8d6e17d5cad97be6521196e5e9e3d11fadcb74e67f0c75501e671e6658

FAILURE: Build completed with 4 failures.

1: Task failed with an exception.
-----------
* What went wrong:
Execution failed for task ':website:installDependencies'.
> Process 'command 'docker'' finished with non-zero exit value 1

* Try:
Run with --stacktrace option to get the stack trace. Run with --info or --debug option to get more log output. Run with --scan to get full insights.
==============================================================================

2: Task failed with an exception.
-----------
* What went wrong:
Execution failed for task ':website:initGitSubmodules'.
> Process 'command 'docker'' finished with non-zero exit value 128

* Try:
Run with --stacktrace option to get the stack trace. Run with --info or --debug option to get more log output. Run with --scan to get full insights.
==============================================================================

3: Task failed with an exception.
-----------
* What went wrong:
Execution failed for task ':website:buildCodeSamples'.
> Process 'command 'docker'' finished with non-zero exit value 1

* Try:
Run with --stacktrace option to get the stack trace. Run with --info or --debug option to get more log output. Run with --scan to get full insights.
==============================================================================

4: Task failed with an exception.
-----------
* What went wrong:
Execution failed for task ':website:buildApacheWebsite'.
> Process 'command 'docker'' finished with non-zero exit value 127

* Try:
Run with --stacktrace option to get the stack trace. Run with --info or --debug option to get more log output. Run with --scan to get full insights.
==============================================================================

* Get more help at https://help.gradle.org

Deprecated Gradle features were used in this build, making it incompatible with Gradle 6.0.
Use '--warning-mode all' to show the individual deprecation warnings.
See https://docs.gradle.org/5.2.1/userguide/command_line_interface.html#sec:command_line_warnings

BUILD FAILED in 54s
11 actionable tasks: 9 executed, 2 up-to-date

Publishing build scan...
https://gradle.com/s/vep7tumhsyda4

Build step 'Invoke Gradle script' changed build result to FAILURE
Build step 'Invoke Gradle script' marked build as failure

---------------------------------------------------------------------
To unsubscribe, e-mail: builds-unsubscribe@beam.apache.org
For additional commands, e-mail: builds-help@beam.apache.org


Build failed in Jenkins: beam_PostCommit_Website_Publish #6661

Posted by Apache Jenkins Server <je...@builds.apache.org>.
See <https://ci-beam.apache.org/job/beam_PostCommit_Website_Publish/6661/display/redirect?page=changes>

Changes:

[Robin Qiu] Propagate BigQuery streaming insert throttled time to Dataflow worker in

[Kamil Wasilewski] [BEAM-10524] JSON decoder for ReadFromBigQuery supports repeatable

[noreply] Merge pull request #12415 from [BEAM-10603] Add the RecordingManager and


------------------------------------------
[...truncated 32.69 KB...]
Get:7 https://deb.nodesource.com/node_10.x stretch/main amd64 Packages [766 B]
Fetched 5351 B in 0s (9580 B/s)
Reading package lists...

## Run `sudo apt-get install -y nodejs` to install Node.js 10.x and npm
## You may also need development tools to build native addons:
     sudo apt-get install gcc g++ make
## To install the Yarn package manager, run:
     curl -sL https://dl.yarnpkg.com/debian/pubkey.gpg | sudo apt-key add -
     echo "deb https://dl.yarnpkg.com/debian/ stable main" | sudo tee /etc/apt/sources.list.d/yarn.list
     sudo apt-get update && sudo apt-get install yarn


+ apt-get update
Hit:1 http://security.debian.org/debian-security stretch/updates InRelease
Ign:2 http://deb.debian.org/debian stretch InRelease
Hit:3 http://deb.debian.org/debian stretch-updates InRelease
Hit:4 http://deb.debian.org/debian stretch Release
Hit:5 https://deb.nodesource.com/node_10.x stretch InRelease
Reading package lists...
+ apt-get install -y --no-install-recommends nodejs
Reading package lists...
Building dependency tree...
Reading state information...
The following additional packages will be installed:
  libpython2.7-minimal python-minimal python2.7-minimal
Suggested packages:
  binfmt-support
Recommended packages:
  libpython2.7-stdlib python python2.7
The following NEW packages will be installed:
  libpython2.7-minimal nodejs python-minimal python2.7-minimal
0 upgraded, 4 newly installed, 0 to remove and 0 not upgraded.
Need to get 18.0 MB of archives.
After this operation, 88.2 MB of additional disk space will be used.
Get:1 http://security.debian.org/debian-security stretch/updates/main amd64 libpython2.7-minimal amd64 2.7.13-2+deb9u4 [390 kB]
Get:2 http://deb.debian.org/debian stretch/main amd64 python-minimal amd64 2.7.13-2 [40.5 kB]
Get:3 http://security.debian.org/debian-security stretch/updates/main amd64 python2.7-minimal amd64 2.7.13-2+deb9u4 [1386 kB]
Get:4 https://deb.nodesource.com/node_10.x stretch/main amd64 nodejs amd64 10.22.0-1nodesource1 [16.2 MB]
debconf: delaying package configuration, since apt-utils is not installed
Fetched 18.0 MB in 0s (55.9 MB/s)
Selecting previously unselected package libpython2.7-minimal:amd64.
(Reading database ... 
(Reading database ... 5%(Reading database ... 10%(Reading database ... 15%(Reading database ... 20%(Reading database ... 25%(Reading database ... 30%(Reading database ... 35%(Reading database ... 40%(Reading database ... 45%(Reading database ... 50%(Reading database ... 55%(Reading database ... 60%(Reading database ... 65%(Reading database ... 70%(Reading database ... 75%
(Reading database ... 80%
(Reading database ... 85%
(Reading database ... 90%
(Reading database ... 95%
(Reading database ... 100%(Reading database ... 10945 files and directories currently installed.)
Preparing to unpack .../libpython2.7-minimal_2.7.13-2+deb9u4_amd64.deb ...
Unpacking libpython2.7-minimal:amd64 (2.7.13-2+deb9u4) ...
Selecting previously unselected package python2.7-minimal.
Preparing to unpack .../python2.7-minimal_2.7.13-2+deb9u4_amd64.deb ...
Unpacking python2.7-minimal (2.7.13-2+deb9u4) ...
Selecting previously unselected package python-minimal.
Preparing to unpack .../python-minimal_2.7.13-2_amd64.deb ...
Unpacking python-minimal (2.7.13-2) ...
Selecting previously unselected package nodejs.
Preparing to unpack .../nodejs_10.22.0-1nodesource1_amd64.deb ...
Unpacking nodejs (10.22.0-1nodesource1) ...
Setting up libpython2.7-minimal:amd64 (2.7.13-2+deb9u4) ...
Setting up python2.7-minimal (2.7.13-2+deb9u4) ...
Setting up python-minimal (2.7.13-2) ...
Setting up nodejs (10.22.0-1nodesource1) ...
+ apt-get autoremove -yqq --purge
+ apt-get clean
+ rm -rf /var/lib/apt/lists/deb.debian.org_debian_dists_stretch-updates_InRelease /var/lib/apt/lists/deb.debian.org_debian_dists_stretch-updates_main_binary-amd64_Packages.lz4 /var/lib/apt/lists/deb.debian.org_debian_dists_stretch_Release /var/lib/apt/lists/deb.debian.org_debian_dists_stretch_Release.gpg /var/lib/apt/lists/deb.debian.org_debian_dists_stretch_main_binary-amd64_Packages.lz4 /var/lib/apt/lists/deb.nodesource.com_node%5f10.x_dists_stretch_InRelease /var/lib/apt/lists/deb.nodesource.com_node%5f10.x_dists_stretch_main_binary-amd64_Packages.lz4 /var/lib/apt/lists/lock /var/lib/apt/lists/partial /var/lib/apt/lists/security.debian.org_debian-security_dists_stretch_updates_InRelease /var/lib/apt/lists/security.debian.org_debian-security_dists_stretch_updates_main_binary-amd64_Packages.lz4
Removing intermediate container 89219a2a237b
 ---> 8e22d2bec517
Step 6/8 : RUN curl -sS https://dl.yarnpkg.com/debian/pubkey.gpg | apt-key add -     && echo "deb https://dl.yarnpkg.com/debian/ stable main" | tee /etc/apt/sources.list.d/yarn.list     && apt-get update     && apt-get install -y --no-install-recommends yarn     && apt-get autoremove -yqq --purge     && apt-get clean     && rm -rf /var/lib/apt/lists/*
 ---> Running in 7ff6c9c2b385
+ curl -sS https://dl.yarnpkg.com/debian/pubkey.gpg
+ apt-key add -
Warning: apt-key output should not be parsed (stdout is not a terminal)
OK
+ tee /etc/apt/sources.list.d/yarn.list
+ echo 'deb https://dl.yarnpkg.com/debian/ stable main'
deb https://dl.yarnpkg.com/debian/ stable main
+ apt-get update
Get:1 http://security.debian.org/debian-security stretch/updates InRelease [53.0 kB]
Ign:2 http://deb.debian.org/debian stretch InRelease
Get:3 http://deb.debian.org/debian stretch-updates InRelease [93.6 kB]
Get:4 http://deb.debian.org/debian stretch Release [118 kB]
Get:5 http://deb.debian.org/debian stretch Release.gpg [2410 B]
Get:6 https://deb.nodesource.com/node_10.x stretch InRelease [4585 B]
Get:7 https://dl.yarnpkg.com/debian stable InRelease [17.1 kB]
Get:8 http://security.debian.org/debian-security stretch/updates/main amd64 Packages [558 kB]
Get:9 http://deb.debian.org/debian stretch-updates/main amd64 Packages [2596 B]
Get:10 http://deb.debian.org/debian stretch/main amd64 Packages [7080 kB]
Get:11 https://deb.nodesource.com/node_10.x stretch/main amd64 Packages [766 B]
Get:12 https://dl.yarnpkg.com/debian stable/main amd64 Packages [9953 B]
Get:13 https://dl.yarnpkg.com/debian stable/main all Packages [9953 B]
Fetched 7949 kB in 1s (5489 kB/s)
Reading package lists...
+ apt-get install -y --no-install-recommends yarn
Reading package lists...
Building dependency tree...
Reading state information...
The following NEW packages will be installed:
  yarn
0 upgraded, 1 newly installed, 0 to remove and 0 not upgraded.
Need to get 891 kB of archives.
After this operation, 5407 kB of additional disk space will be used.
Get:1 https://dl.yarnpkg.com/debian stable/main amd64 yarn all 1.22.4-1 [891 kB]
debconf: delaying package configuration, since apt-utils is not installed
Fetched 891 kB in 0s (6537 kB/s)
Selecting previously unselected package yarn.
(Reading database ... 
(Reading database ... 5%(Reading database ... 10%(Reading database ... 15%(Reading database ... 20%(Reading database ... 25%(Reading database ... 30%(Reading database ... 35%(Reading database ... 40%(Reading database ... 45%(Reading database ... 50%(Reading database ... 55%(Reading database ... 60%(Reading database ... 65%(Reading database ... 70%(Reading database ... 75%
(Reading database ... 80%
(Reading database ... 85%
(Reading database ... 90%
(Reading database ... 95%
(Reading database ... 100%(Reading database ... 15894 files and directories currently installed.)
Preparing to unpack .../archives/yarn_1.22.4-1_all.deb ...
Unpacking yarn (1.22.4-1) ...
Setting up yarn (1.22.4-1) ...
+ apt-get autoremove -yqq --purge
+ apt-get clean
+ rm -rf /var/lib/apt/lists/deb.debian.org_debian_dists_stretch-updates_InRelease /var/lib/apt/lists/deb.debian.org_debian_dists_stretch-updates_main_binary-amd64_Packages.lz4 /var/lib/apt/lists/deb.debian.org_debian_dists_stretch_Release /var/lib/apt/lists/deb.debian.org_debian_dists_stretch_Release.gpg /var/lib/apt/lists/deb.debian.org_debian_dists_stretch_main_binary-amd64_Packages.lz4 /var/lib/apt/lists/deb.nodesource.com_node%5f10.x_dists_stretch_InRelease /var/lib/apt/lists/deb.nodesource.com_node%5f10.x_dists_stretch_main_binary-amd64_Packages.lz4 /var/lib/apt/lists/dl.yarnpkg.com_debian_dists_stable_InRelease /var/lib/apt/lists/dl.yarnpkg.com_debian_dists_stable_main_binary-all_Packages.lz4 /var/lib/apt/lists/dl.yarnpkg.com_debian_dists_stable_main_binary-amd64_Packages.lz4 /var/lib/apt/lists/lock /var/lib/apt/lists/partial /var/lib/apt/lists/security.debian.org_debian-security_dists_stretch_updates_InRelease /var/lib/apt/lists/security.debian.org_debian-security_dists_stretch_updates_main_binary-amd64_Packages.lz4
Removing intermediate container 7ff6c9c2b385
 ---> 5a2a0e98de69
Step 7/8 : RUN HUGOHOME="$(mktemp -d)"     && export HUGOHOME     && curl -sL https://github.com/gohugoio/hugo/releases/download/v0.68.3/hugo_extended_0.68.3_Linux-64bit.tar.gz > "${HUGOHOME}/hugo.tar.gz"     && tar -xzvf "${HUGOHOME}/hugo.tar.gz" hugo     && mv hugo /usr/local/bin/hugo     && chmod +x /usr/local/bin/hugo     && rm -r "${HUGOHOME}"
 ---> Running in 9b993301ca8b
++ mktemp -d
+ HUGOHOME=/tmp/tmp.N7eRI2GsvG
+ export HUGOHOME
+ curl -sL https://github.com/gohugoio/hugo/releases/download/v0.68.3/hugo_extended_0.68.3_Linux-64bit.tar.gz
+ tar -xzvf /tmp/tmp.N7eRI2GsvG/hugo.tar.gz hugo
hugo
+ mv hugo /usr/local/bin/hugo
+ chmod +x /usr/local/bin/hugo
+ rm -r /tmp/tmp.N7eRI2GsvG
Removing intermediate container 9b993301ca8b
 ---> 4383f962e28a
Step 8/8 : WORKDIR /opt/
 ---> Running in f835328a658a
Removing intermediate container f835328a658a
 ---> 47a979744ea8
Successfully built 47a979744ea8
Successfully tagged beam-website:latest

> Task :website:createDockerContainer

> Task :website:startDockerContainer
40381350e6a2a31edbdc550eb43cbf7c914e4ee96dde2dd149eff4048dc241f8

> Task :website:setupDockerContainer

> Task :website:installDependencies
yarn install v1.22.4
warning Skipping preferred cache folder "/.cache/yarn" because it is not writable.
warning Selected the next writable cache folder in the list, will be "/tmp/.yarn-cache-910".
[1/4] Resolving packages...
[2/4] Fetching packages...
info fsevents@2.1.3: The platform "linux" is incompatible with this module.
info "fsevents@2.1.3" is an optional dependency and failed compatibility check. Excluding it from installation.
[3/4] Linking dependencies...
error Could not write file "/opt/website/www/yarn-error.log": "EACCES: permission denied, open '/opt/website/www/yarn-error.log'"
info Visit https://yarnpkg.com/en/docs/cli/install for documentation about this command.
error An unexpected error occurred: "EACCES: permission denied, mkdir '/opt/website/www/node_modules'".

> Task :website:installDependencies FAILED

> Task :website:initGitSubmodules FAILED
error: could not lock config file .git/config: Permission denied
fatal: Failed to register url for submodule path 'website/www/site/themes/docsy'

> Task :website:buildCodeSamples FAILED
yarn run v1.22.4
warning Skipping preferred cache folder "/.cache/yarn" because it is not writable.
warning Selected the next writable cache folder in the list, will be "/tmp/.yarn-cache-910".
$ ./build_code_samples.sh
warning Cannot find a suitable global folder. Tried these: "/usr/local, /.yarn"
Working directory: /opt/website/www
Dist directory: ./site/code_samples
mkdir: cannot create directory ‘./site/code_samples’: Permission denied
info Visit https://yarnpkg.com/en/docs/cli/run for documentation about this command.
error Command failed with exit code 1.

> Task :website:buildApacheWebsite FAILED
yarn run v1.22.4
warning Skipping preferred cache folder "/.cache/yarn" because it is not writable.
warning Selected the next writable cache folder in the list, will be "/tmp/.yarn-cache-910".
$ cross-env HUGO_ENV=production hugo --minify -d ../dist -s site -v -d /opt/build/website/generated-apache-content --config /opt/website/www/site/config.toml
warning Cannot find a suitable global folder. Tried these: "/usr/local, /.yarn"
/bin/sh: 1: cross-env: not found
error Command failed with exit code 127.
info Visit https://yarnpkg.com/en/docs/cli/run for documentation about this command.

> Task :website:stopAndRemoveDockerContainer
40381350e6a2a31edbdc550eb43cbf7c914e4ee96dde2dd149eff4048dc241f8

FAILURE: Build completed with 4 failures.

1: Task failed with an exception.
-----------
* What went wrong:
Execution failed for task ':website:installDependencies'.
> Process 'command 'docker'' finished with non-zero exit value 1

* Try:
Run with --stacktrace option to get the stack trace. Run with --info or --debug option to get more log output. Run with --scan to get full insights.
==============================================================================

2: Task failed with an exception.
-----------
* What went wrong:
Execution failed for task ':website:initGitSubmodules'.
> Process 'command 'docker'' finished with non-zero exit value 128

* Try:
Run with --stacktrace option to get the stack trace. Run with --info or --debug option to get more log output. Run with --scan to get full insights.
==============================================================================

3: Task failed with an exception.
-----------
* What went wrong:
Execution failed for task ':website:buildCodeSamples'.
> Process 'command 'docker'' finished with non-zero exit value 1

* Try:
Run with --stacktrace option to get the stack trace. Run with --info or --debug option to get more log output. Run with --scan to get full insights.
==============================================================================

4: Task failed with an exception.
-----------
* What went wrong:
Execution failed for task ':website:buildApacheWebsite'.
> Process 'command 'docker'' finished with non-zero exit value 127

* Try:
Run with --stacktrace option to get the stack trace. Run with --info or --debug option to get more log output. Run with --scan to get full insights.
==============================================================================

* Get more help at https://help.gradle.org

Deprecated Gradle features were used in this build, making it incompatible with Gradle 6.0.
Use '--warning-mode all' to show the individual deprecation warnings.
See https://docs.gradle.org/5.2.1/userguide/command_line_interface.html#sec:command_line_warnings

BUILD FAILED in 3m 19s
11 actionable tasks: 9 executed, 2 up-to-date

Publishing build scan...
https://gradle.com/s/5jpvo4t3s4iuq

Build step 'Invoke Gradle script' changed build result to FAILURE
Build step 'Invoke Gradle script' marked build as failure

---------------------------------------------------------------------
To unsubscribe, e-mail: builds-unsubscribe@beam.apache.org
For additional commands, e-mail: builds-help@beam.apache.org


Build failed in Jenkins: beam_PostCommit_Website_Publish #6660

Posted by Apache Jenkins Server <je...@builds.apache.org>.
See <https://ci-beam.apache.org/job/beam_PostCommit_Website_Publish/6660/display/redirect?page=changes>

Changes:

[Udi Meiri] Silence red PYTHONPATH warning from tox

[tobiasz.kedzierski] [BEAM-10682] Add workflow to run Java tests on Linux/Windows/Mac


------------------------------------------
Started by timer
Running as SYSTEM
[EnvInject] - Loading node environment variables.
Building remotely on websites1 (git-websites svn-websites) in workspace <https://ci-beam.apache.org/job/beam_PostCommit_Website_Publish/ws/>
No credentials specified
Wiping out workspace first.
Cloning the remote Git repository
Cloning repository https://github.com/apache/beam.git
 > git init <https://ci-beam.apache.org/job/beam_PostCommit_Website_Publish/ws/src> # timeout=10
Fetching upstream changes from https://github.com/apache/beam.git
 > git --version # timeout=10
 > git fetch --tags --progress -- https://github.com/apache/beam.git +refs/heads/*:refs/remotes/origin/* # timeout=10
 > git config remote.origin.url https://github.com/apache/beam.git # timeout=10
 > git config --add remote.origin.fetch +refs/heads/*:refs/remotes/origin/* # timeout=10
 > git config remote.origin.url https://github.com/apache/beam.git # timeout=10
Fetching upstream changes from https://github.com/apache/beam.git
 > git fetch --tags --progress -- https://github.com/apache/beam.git +refs/heads/*:refs/remotes/origin/* +refs/pull/${ghprbPullId}/*:refs/remotes/origin/pr/${ghprbPullId}/* # timeout=10
 > git rev-parse origin/master^{commit} # timeout=10
Checking out Revision 3add33ea16b6fe2f7efdcd4485cc03dcb8771a77 (origin/master)
 > git config core.sparsecheckout # timeout=10
 > git checkout -f 3add33ea16b6fe2f7efdcd4485cc03dcb8771a77 # timeout=10
Commit message: "Merge pull request #12602: Silence red PYTHONPATH warning from tox"
 > git rev-list --no-walk 4172ce2eac2c603e8fe6b352857285293df0985c # timeout=10
No emails were triggered.
[EnvInject] - Executing scripts and injecting environment variables after the SCM step.
[EnvInject] - Injecting as environment variables the properties content 
SPARK_LOCAL_IP=127.0.0.1

[EnvInject] - Variables injected successfully.
[Gradle] - Launching build.
[src] $ <https://ci-beam.apache.org/job/beam_PostCommit_Website_Publish/ws/src/gradlew> --continue --max-workers=12 -Dorg.gradle.jvmargs=-Xms2g -Dorg.gradle.jvmargs=-Xmx4g -Pdocker-pull-licenses :website:clean :website:publishWebsite
To honour the JVM settings for this build a new JVM will be forked. Please consider using the daemon: https://docs.gradle.org/5.2.1/userguide/gradle_daemon.html.
Daemon will be stopped at the end of the build stopping after processing
> Task :buildSrc:compileJava NO-SOURCE
> Task :buildSrc:compileGroovy
> Task :buildSrc:pluginDescriptors
> Task :buildSrc:processResources
> Task :buildSrc:classes
> Task :buildSrc:jar
> Task :buildSrc:assemble
> Task :buildSrc:spotlessGroovy
> Task :buildSrc:spotlessGroovyCheck
> Task :buildSrc:spotlessGroovyGradle
> Task :buildSrc:spotlessGroovyGradleCheck
> Task :buildSrc:spotlessCheck
> Task :buildSrc:pluginUnderTestMetadata
> Task :buildSrc:compileTestJava NO-SOURCE
> Task :buildSrc:compileTestGroovy NO-SOURCE
> Task :buildSrc:processTestResources NO-SOURCE
> Task :buildSrc:testClasses UP-TO-DATE
> Task :buildSrc:test NO-SOURCE
> Task :buildSrc:validateTaskProperties
> Task :buildSrc:check
> Task :buildSrc:build
Configuration on demand is an incubating feature.
> Task :website:cleanWebsite UP-TO-DATE
> Task :website:clean UP-TO-DATE

> Task :website:buildDockerImage
Sending build context to Docker daemon  48.35MB
Step 1/8 : FROM debian:stretch-slim
 ---> 8ff748cdd6b1
Step 2/8 : SHELL ["/bin/bash", "-o", "pipefail", "-e", "-u", "-x", "-c"]
 ---> Using cache
 ---> d133e66c9c57
Step 3/8 : ENV DEBIAN_FRONTEND=noninteractive     LANGUAGE=C.UTF-8     LANG=C.UTF-8     LC_ALL=C.UTF-8     LC_CTYPE=C.UTF-8     LC_MESSAGES=C.UTF-8
 ---> Using cache
 ---> a2b4c1866e24
Step 4/8 : RUN apt-get update     && apt-get install -y --no-install-recommends         ca-certificates         curl         git         gnupg2         gosu         lynx     && apt-get autoremove -yqq --purge     && apt-get clean     && rm -rf /var/lib/apt/lists/*
 ---> Using cache
 ---> 31bea9d298b5
Step 5/8 : RUN curl -sL https://deb.nodesource.com/setup_10.x | bash -     && apt-get update     && apt-get install -y --no-install-recommends         nodejs     && apt-get autoremove -yqq --purge     && apt-get clean     && rm -rf /var/lib/apt/lists/*
 ---> Using cache
 ---> 65e26af631fe
Step 6/8 : RUN curl -sS https://dl.yarnpkg.com/debian/pubkey.gpg | apt-key add -     && echo "deb https://dl.yarnpkg.com/debian/ stable main" | tee /etc/apt/sources.list.d/yarn.list     && apt-get update     && apt-get install -y --no-install-recommends yarn     && apt-get autoremove -yqq --purge     && apt-get clean     && rm -rf /var/lib/apt/lists/*
 ---> Using cache
 ---> 026dac6d2d34
Step 7/8 : RUN HUGOHOME="$(mktemp -d)"     && export HUGOHOME     && curl -sL https://github.com/gohugoio/hugo/releases/download/v0.68.3/hugo_extended_0.68.3_Linux-64bit.tar.gz > "${HUGOHOME}/hugo.tar.gz"     && tar -xzvf "${HUGOHOME}/hugo.tar.gz" hugo     && mv hugo /usr/local/bin/hugo     && chmod +x /usr/local/bin/hugo     && rm -r "${HUGOHOME}"
 ---> Using cache
 ---> d1b8f6f7124a
Step 8/8 : WORKDIR /opt/
 ---> Using cache
 ---> 04d1500c7140
Successfully built 04d1500c7140
Successfully tagged beam-website:latest

> Task :website:createDockerContainer

> Task :website:startDockerContainer
1453de02ef43155a6d2affb24f6fb18110ca0573932fa0d571d0e4b6a935c798

> Task :website:setupDockerContainer

> Task :website:installDependencies
yarn install v1.22.4
warning Skipping preferred cache folder "/.cache/yarn" because it is not writable.
warning Selected the next writable cache folder in the list, will be "/tmp/.yarn-cache-910".
[1/4] Resolving packages...
[2/4] Fetching packages...
info fsevents@2.1.3: The platform "linux" is incompatible with this module.
info "fsevents@2.1.3" is an optional dependency and failed compatibility check. Excluding it from installation.
[3/4] Linking dependencies...
error Could not write file "/opt/website/www/yarn-error.log": "EACCES: permission denied, open '/opt/website/www/yarn-error.log'"
info Visit https://yarnpkg.com/en/docs/cli/install for documentation about this command.
error An unexpected error occurred: "EACCES: permission denied, mkdir '/opt/website/www/node_modules'".

> Task :website:installDependencies FAILED

> Task :website:initGitSubmodules FAILED
error: could not lock config file .git/config: Permission denied
fatal: Failed to register url for submodule path 'website/www/site/themes/docsy'

> Task :website:buildCodeSamples FAILED
yarn run v1.22.4
warning Skipping preferred cache folder "/.cache/yarn" because it is not writable.
warning Selected the next writable cache folder in the list, will be "/tmp/.yarn-cache-910".
$ ./build_code_samples.sh
warning Cannot find a suitable global folder. Tried these: "/usr/local, /.yarn"
Working directory: /opt/website/www
Dist directory: ./site/code_samples
mkdir: cannot create directory ‘./site/code_samples’: Permission denied
error Command failed with exit code 1.
info Visit https://yarnpkg.com/en/docs/cli/run for documentation about this command.

> Task :website:buildApacheWebsite FAILED
yarn run v1.22.4
warning Skipping preferred cache folder "/.cache/yarn" because it is not writable.
warning Selected the next writable cache folder in the list, will be "/tmp/.yarn-cache-910".
$ cross-env HUGO_ENV=production hugo --minify -d ../dist -s site -v -d /opt/build/website/generated-apache-content --config /opt/website/www/site/config.toml
warning Cannot find a suitable global folder. Tried these: "/usr/local, /.yarn"
/bin/sh: 1: cross-env: not found
error Command failed with exit code 127.
info Visit https://yarnpkg.com/en/docs/cli/run for documentation about this command.

> Task :website:stopAndRemoveDockerContainer
1453de02ef43155a6d2affb24f6fb18110ca0573932fa0d571d0e4b6a935c798

FAILURE: Build completed with 4 failures.

1: Task failed with an exception.
-----------
* What went wrong:
Execution failed for task ':website:installDependencies'.
> Process 'command 'docker'' finished with non-zero exit value 1

* Try:
Run with --stacktrace option to get the stack trace. Run with --info or --debug option to get more log output. Run with --scan to get full insights.
==============================================================================

2: Task failed with an exception.
-----------
* What went wrong:
Execution failed for task ':website:initGitSubmodules'.
> Process 'command 'docker'' finished with non-zero exit value 128

* Try:
Run with --stacktrace option to get the stack trace. Run with --info or --debug option to get more log output. Run with --scan to get full insights.
==============================================================================

3: Task failed with an exception.
-----------
* What went wrong:
Execution failed for task ':website:buildCodeSamples'.
> Process 'command 'docker'' finished with non-zero exit value 1

* Try:
Run with --stacktrace option to get the stack trace. Run with --info or --debug option to get more log output. Run with --scan to get full insights.
==============================================================================

4: Task failed with an exception.
-----------
* What went wrong:
Execution failed for task ':website:buildApacheWebsite'.
> Process 'command 'docker'' finished with non-zero exit value 127

* Try:
Run with --stacktrace option to get the stack trace. Run with --info or --debug option to get more log output. Run with --scan to get full insights.
==============================================================================

* Get more help at https://help.gradle.org

Deprecated Gradle features were used in this build, making it incompatible with Gradle 6.0.
Use '--warning-mode all' to show the individual deprecation warnings.
See https://docs.gradle.org/5.2.1/userguide/command_line_interface.html#sec:command_line_warnings

BUILD FAILED in 53s
11 actionable tasks: 9 executed, 2 up-to-date

Publishing build scan...
https://gradle.com/s/im24wkyi7gtba

Build step 'Invoke Gradle script' changed build result to FAILURE
Build step 'Invoke Gradle script' marked build as failure

---------------------------------------------------------------------
To unsubscribe, e-mail: builds-unsubscribe@beam.apache.org
For additional commands, e-mail: builds-help@beam.apache.org