You are viewing a plain text version of this content. The canonical link for it is here.
Posted to issues@bigtop.apache.org by "ASF GitHub Bot (JIRA)" <ji...@apache.org> on 2016/08/01 21:54:20 UTC

[jira] [Commented] (BIGTOP-2477) Add Juju charm for spark component

    [ https://issues.apache.org/jira/browse/BIGTOP-2477?page=com.atlassian.jira.plugin.system.issuetabpanels:comment-tabpanel&focusedCommentId=15402888#comment-15402888 ] 

ASF GitHub Bot commented on BIGTOP-2477:
----------------------------------------

Github user petevg commented on the issue:

    https://github.com/apache/bigtop/pull/117
  
    When I run bundletester on this charm, on AWS, I get a failure during 02-smoke-test.py, and the sparkscale machines are blocked waiting for the relation to java.
    
    Will dig into it further -- I suspect that it's just an issue w/ a test not setting up a relation.
    
    Here's the failure:
    
    ERROR: spark::02-smoke-test.py
    [/tmp/bundletester-oB8F_D/spark/tests/02-smoke-test.py exit 1]
    2016-08-01 17:35:51 Starting deployment of local.aws-test:miles
    2016-08-01 17:35:52 Deploying services...
    2016-08-01 17:37:00 Config specifies num units for subordinate: openjdk
    2016-08-01 17:37:01 Adding relations...
    2016-08-01 17:37:02  Adding relation spark:java <-> openjdk:java
    2016-08-01 17:39:30 Deployment complete in 219.51 seconds
    /home/petevg/.local/lib/python3.5/site-packages/path.py:1717: DeprecationWarning
    : path is deprecated. Use Path instead.                                        
      warnings.warn(msg, DeprecationWarning)
    F
    ======================================================================
    FAIL: test_deploy (__main__.TestDeploy)
    ----------------------------------------------------------------------
    Traceback (most recent call last):
      File "/tmp/bundletester-oB8F_D/spark/tests/02-smoke-test.py", line 41, in test
    _deploy                                                                        
        assert "completed" in output['status']
    AssertionError
    
    ----------------------------------------------------------------------
    Ran 1 test in 474.559s
    
    FAILED (failures=1)


> Add Juju charm for spark component
> ----------------------------------
>
>                 Key: BIGTOP-2477
>                 URL: https://issues.apache.org/jira/browse/BIGTOP-2477
>             Project: Bigtop
>          Issue Type: New Feature
>          Components: deployment
>    Affects Versions: 1.1.0
>            Reporter: Cory Johns
>            Assignee: Cory Johns
>            Priority: Minor
>
> This is to add a Juju charm for the Apache Spark component, with an optional relation to the Apache Hadoop component.



--
This message was sent by Atlassian JIRA
(v6.3.4#6332)