You are viewing a plain text version of this content. The canonical link for it is here.
Posted to commits@karaf.apache.org by Apache Jenkins Server <je...@builds.apache.org> on 2011/12/22 17:08:55 UTC
Build failed in Jenkins: Karaf #825
See <https://builds.apache.org/job/Karaf/825/changes>
Changes:
[jbonofre] Update all NOTICE files
------------------------------------------
[...truncated 16202 lines...]
Uploading: https://repository.apache.org/content/repositories/snapshots/org/apache/karaf/admin/org.apache.karaf.admin.management/3.0.0-SNAPSHOT/maven-metadata.xml
Uploaded: https://repository.apache.org/content/repositories/snapshots/org/apache/karaf/admin/org.apache.karaf.admin.management/3.0.0-SNAPSHOT/maven-metadata.xml (2 KB at 8.8 KB/sec)
Uploading: https://repository.apache.org/content/repositories/snapshots/org/apache/karaf/admin/org.apache.karaf.admin.management/maven-metadata.xml
Uploaded: https://repository.apache.org/content/repositories/snapshots/org/apache/karaf/admin/org.apache.karaf.admin.management/maven-metadata.xml (2 KB at 5.1 KB/sec)
[ERROR] uniqueVersion == false is not anymore supported in maven 3
[INFO] Deployment in https://repository.apache.org/content/repositories/snapshots (id=apache.snapshots.https,uniqueVersion=false)
Deploying the main artifact karaf-assembly-archetype-3.0.0-SNAPSHOT.jar
Downloading: https://repository.apache.org/content/repositories/snapshots/org/apache/karaf/archetypes/karaf-assembly-archetype/3.0.0-SNAPSHOT/maven-metadata.xml
Downloaded: https://repository.apache.org/content/repositories/snapshots/org/apache/karaf/archetypes/karaf-assembly-archetype/3.0.0-SNAPSHOT/maven-metadata.xml (804 B at 0.1 KB/sec)
Uploading: https://repository.apache.org/content/repositories/snapshots/org/apache/karaf/archetypes/karaf-assembly-archetype/3.0.0-SNAPSHOT/karaf-assembly-archetype-3.0.0-20111222.160804-28.jar
Uploaded: https://repository.apache.org/content/repositories/snapshots/org/apache/karaf/archetypes/karaf-assembly-archetype/3.0.0-SNAPSHOT/karaf-assembly-archetype-3.0.0-20111222.160804-28.jar (13 KB at 50.3 KB/sec)
Uploading: https://repository.apache.org/content/repositories/snapshots/org/apache/karaf/archetypes/karaf-assembly-archetype/3.0.0-SNAPSHOT/karaf-assembly-archetype-3.0.0-20111222.160804-28.pom
Uploaded: https://repository.apache.org/content/repositories/snapshots/org/apache/karaf/archetypes/karaf-assembly-archetype/3.0.0-SNAPSHOT/karaf-assembly-archetype-3.0.0-20111222.160804-28.pom (5 KB at 9.1 KB/sec)
Downloading: https://repository.apache.org/content/repositories/snapshots/org/apache/karaf/archetypes/karaf-assembly-archetype/maven-metadata.xml
Downloaded: https://repository.apache.org/content/repositories/snapshots/org/apache/karaf/archetypes/karaf-assembly-archetype/maven-metadata.xml (391 B at 0.9 KB/sec)
Uploading: https://repository.apache.org/content/repositories/snapshots/org/apache/karaf/archetypes/karaf-assembly-archetype/3.0.0-SNAPSHOT/maven-metadata.xml
Uploaded: https://repository.apache.org/content/repositories/snapshots/org/apache/karaf/archetypes/karaf-assembly-archetype/3.0.0-SNAPSHOT/maven-metadata.xml (2 KB at 3.3 KB/sec)
Uploading: https://repository.apache.org/content/repositories/snapshots/org/apache/karaf/archetypes/karaf-assembly-archetype/maven-metadata.xml
Uploaded: https://repository.apache.org/content/repositories/snapshots/org/apache/karaf/archetypes/karaf-assembly-archetype/maven-metadata.xml (782 B at 3.7 KB/sec)
[ERROR] uniqueVersion == false is not anymore supported in maven 3
[INFO] Deployment in https://repository.apache.org/content/repositories/snapshots (id=apache.snapshots.https,uniqueVersion=false)
Deploying the main artifact karaf-blueprint-archetype-3.0.0-SNAPSHOT.jar
Downloading: https://repository.apache.org/content/repositories/snapshots/org/apache/karaf/archetypes/karaf-blueprint-archetype/3.0.0-SNAPSHOT/maven-metadata.xml
Downloaded: https://repository.apache.org/content/repositories/snapshots/org/apache/karaf/archetypes/karaf-blueprint-archetype/3.0.0-SNAPSHOT/maven-metadata.xml (805 B at 3.6 KB/sec)
Uploading: https://repository.apache.org/content/repositories/snapshots/org/apache/karaf/archetypes/karaf-blueprint-archetype/3.0.0-SNAPSHOT/karaf-blueprint-archetype-3.0.0-20111222.160806-13.jar
Uploaded: https://repository.apache.org/content/repositories/snapshots/org/apache/karaf/archetypes/karaf-blueprint-archetype/3.0.0-SNAPSHOT/karaf-blueprint-archetype-3.0.0-20111222.160806-13.jar (14 KB at 31.7 KB/sec)
Uploading: https://repository.apache.org/content/repositories/snapshots/org/apache/karaf/archetypes/karaf-blueprint-archetype/3.0.0-SNAPSHOT/karaf-blueprint-archetype-3.0.0-20111222.160806-13.pom
Uploaded: https://repository.apache.org/content/repositories/snapshots/org/apache/karaf/archetypes/karaf-blueprint-archetype/3.0.0-SNAPSHOT/karaf-blueprint-archetype-3.0.0-20111222.160806-13.pom (5 KB at 16.6 KB/sec)
Downloading: https://repository.apache.org/content/repositories/snapshots/org/apache/karaf/archetypes/karaf-blueprint-archetype/maven-metadata.xml
Downloaded: https://repository.apache.org/content/repositories/snapshots/org/apache/karaf/archetypes/karaf-blueprint-archetype/maven-metadata.xml (392 B at 1.5 KB/sec)
Uploading: https://repository.apache.org/content/repositories/snapshots/org/apache/karaf/archetypes/karaf-blueprint-archetype/3.0.0-SNAPSHOT/maven-metadata.xml
Uploaded: https://repository.apache.org/content/repositories/snapshots/org/apache/karaf/archetypes/karaf-blueprint-archetype/3.0.0-SNAPSHOT/maven-metadata.xml (2 KB at 10.4 KB/sec)
Uploading: https://repository.apache.org/content/repositories/snapshots/org/apache/karaf/archetypes/karaf-blueprint-archetype/maven-metadata.xml
Uploaded: https://repository.apache.org/content/repositories/snapshots/org/apache/karaf/archetypes/karaf-blueprint-archetype/maven-metadata.xml (784 B at 3.3 KB/sec)
[ERROR] uniqueVersion == false is not anymore supported in maven 3
[INFO] Deployment in https://repository.apache.org/content/repositories/snapshots (id=apache.snapshots.https,uniqueVersion=false)
Deploying the main artifact karaf-bundle-archetype-3.0.0-SNAPSHOT.jar
Downloading: https://repository.apache.org/content/repositories/snapshots/org/apache/karaf/archetypes/karaf-bundle-archetype/3.0.0-SNAPSHOT/maven-metadata.xml
Downloaded: https://repository.apache.org/content/repositories/snapshots/org/apache/karaf/archetypes/karaf-bundle-archetype/3.0.0-SNAPSHOT/maven-metadata.xml (802 B at 5.6 KB/sec)
Uploading: https://repository.apache.org/content/repositories/snapshots/org/apache/karaf/archetypes/karaf-bundle-archetype/3.0.0-SNAPSHOT/karaf-bundle-archetype-3.0.0-20111222.160808-13.jar
Uploaded: https://repository.apache.org/content/repositories/snapshots/org/apache/karaf/archetypes/karaf-bundle-archetype/3.0.0-SNAPSHOT/karaf-bundle-archetype-3.0.0-20111222.160808-13.jar (13 KB at 49.7 KB/sec)
Uploading: https://repository.apache.org/content/repositories/snapshots/org/apache/karaf/archetypes/karaf-bundle-archetype/3.0.0-SNAPSHOT/karaf-bundle-archetype-3.0.0-20111222.160808-13.pom
Uploaded: https://repository.apache.org/content/repositories/snapshots/org/apache/karaf/archetypes/karaf-bundle-archetype/3.0.0-SNAPSHOT/karaf-bundle-archetype-3.0.0-20111222.160808-13.pom (5 KB at 17.0 KB/sec)
Downloading: https://repository.apache.org/content/repositories/snapshots/org/apache/karaf/archetypes/karaf-bundle-archetype/maven-metadata.xml
Downloaded: https://repository.apache.org/content/repositories/snapshots/org/apache/karaf/archetypes/karaf-bundle-archetype/maven-metadata.xml (389 B at 0.2 KB/sec)
Uploading: https://repository.apache.org/content/repositories/snapshots/org/apache/karaf/archetypes/karaf-bundle-archetype/3.0.0-SNAPSHOT/maven-metadata.xml
Uploaded: https://repository.apache.org/content/repositories/snapshots/org/apache/karaf/archetypes/karaf-bundle-archetype/3.0.0-SNAPSHOT/maven-metadata.xml (2 KB at 7.8 KB/sec)
Uploading: https://repository.apache.org/content/repositories/snapshots/org/apache/karaf/archetypes/karaf-bundle-archetype/maven-metadata.xml
Uploaded: https://repository.apache.org/content/repositories/snapshots/org/apache/karaf/archetypes/karaf-bundle-archetype/maven-metadata.xml (778 B at 2.7 KB/sec)
[ERROR] uniqueVersion == false is not anymore supported in maven 3
[INFO] Deployment in https://repository.apache.org/content/repositories/snapshots (id=apache.snapshots.https,uniqueVersion=false)
Deploying the main artifact karaf-command-archetype-3.0.0-SNAPSHOT.jar
Downloading: https://repository.apache.org/content/repositories/snapshots/org/apache/karaf/archetypes/karaf-command-archetype/3.0.0-SNAPSHOT/maven-metadata.xml
Downloaded: https://repository.apache.org/content/repositories/snapshots/org/apache/karaf/archetypes/karaf-command-archetype/3.0.0-SNAPSHOT/maven-metadata.xml (803 B at 0.7 KB/sec)
Uploading: https://repository.apache.org/content/repositories/snapshots/org/apache/karaf/archetypes/karaf-command-archetype/3.0.0-SNAPSHOT/karaf-command-archetype-3.0.0-20111222.160811-13.jar
Uploaded: https://repository.apache.org/content/repositories/snapshots/org/apache/karaf/archetypes/karaf-command-archetype/3.0.0-SNAPSHOT/karaf-command-archetype-3.0.0-20111222.160811-13.jar (20 KB at 65.2 KB/sec)
Uploading: https://repository.apache.org/content/repositories/snapshots/org/apache/karaf/archetypes/karaf-command-archetype/3.0.0-SNAPSHOT/karaf-command-archetype-3.0.0-20111222.160811-13.pom
Uploaded: https://repository.apache.org/content/repositories/snapshots/org/apache/karaf/archetypes/karaf-command-archetype/3.0.0-SNAPSHOT/karaf-command-archetype-3.0.0-20111222.160811-13.pom (6 KB at 8.6 KB/sec)
Downloading: https://repository.apache.org/content/repositories/snapshots/org/apache/karaf/archetypes/karaf-command-archetype/maven-metadata.xml
Downloaded: https://repository.apache.org/content/repositories/snapshots/org/apache/karaf/archetypes/karaf-command-archetype/maven-metadata.xml (390 B at 0.9 KB/sec)
Uploading: https://repository.apache.org/content/repositories/snapshots/org/apache/karaf/archetypes/karaf-command-archetype/3.0.0-SNAPSHOT/maven-metadata.xml
Uploaded: https://repository.apache.org/content/repositories/snapshots/org/apache/karaf/archetypes/karaf-command-archetype/3.0.0-SNAPSHOT/maven-metadata.xml (2 KB at 5.4 KB/sec)
Uploading: https://repository.apache.org/content/repositories/snapshots/org/apache/karaf/archetypes/karaf-command-archetype/maven-metadata.xml
Uploaded: https://repository.apache.org/content/repositories/snapshots/org/apache/karaf/archetypes/karaf-command-archetype/maven-metadata.xml (780 B at 1.8 KB/sec)
[ERROR] uniqueVersion == false is not anymore supported in maven 3
[INFO] Deployment in https://repository.apache.org/content/repositories/snapshots (id=apache.snapshots.https,uniqueVersion=false)
Deploying the main artifact karaf-feature-archetype-3.0.0-SNAPSHOT.jar
Downloading: https://repository.apache.org/content/repositories/snapshots/org/apache/karaf/archetypes/karaf-feature-archetype/3.0.0-SNAPSHOT/maven-metadata.xml
Downloaded: https://repository.apache.org/content/repositories/snapshots/org/apache/karaf/archetypes/karaf-feature-archetype/3.0.0-SNAPSHOT/maven-metadata.xml (806 B at 3.3 KB/sec)
Uploading: https://repository.apache.org/content/repositories/snapshots/org/apache/karaf/archetypes/karaf-feature-archetype/3.0.0-SNAPSHOT/karaf-feature-archetype-3.0.0-20111222.160814-219.jar
Uploaded: https://repository.apache.org/content/repositories/snapshots/org/apache/karaf/archetypes/karaf-feature-archetype/3.0.0-SNAPSHOT/karaf-feature-archetype-3.0.0-20111222.160814-219.jar (14 KB at 74.0 KB/sec)
Uploading: https://repository.apache.org/content/repositories/snapshots/org/apache/karaf/archetypes/karaf-feature-archetype/3.0.0-SNAPSHOT/karaf-feature-archetype-3.0.0-20111222.160814-219.pom
Uploaded: https://repository.apache.org/content/repositories/snapshots/org/apache/karaf/archetypes/karaf-feature-archetype/3.0.0-SNAPSHOT/karaf-feature-archetype-3.0.0-20111222.160814-219.pom (5 KB at 11.7 KB/sec)
Downloading: https://repository.apache.org/content/repositories/snapshots/org/apache/karaf/archetypes/karaf-feature-archetype/maven-metadata.xml
Downloaded: https://repository.apache.org/content/repositories/snapshots/org/apache/karaf/archetypes/karaf-feature-archetype/maven-metadata.xml (450 B at 1.9 KB/sec)
Uploading: https://repository.apache.org/content/repositories/snapshots/org/apache/karaf/archetypes/karaf-feature-archetype/3.0.0-SNAPSHOT/maven-metadata.xml
Uploaded: https://repository.apache.org/content/repositories/snapshots/org/apache/karaf/archetypes/karaf-feature-archetype/3.0.0-SNAPSHOT/maven-metadata.xml (2 KB at 2.9 KB/sec)
Uploading: https://repository.apache.org/content/repositories/snapshots/org/apache/karaf/archetypes/karaf-feature-archetype/maven-metadata.xml
Uploaded: https://repository.apache.org/content/repositories/snapshots/org/apache/karaf/archetypes/karaf-feature-archetype/maven-metadata.xml (900 B at 4.0 KB/sec)
[ERROR] uniqueVersion == false is not anymore supported in maven 3
[INFO] Deployment in https://repository.apache.org/content/repositories/snapshots (id=apache.snapshots.https,uniqueVersion=false)
Deploying the main artifact karaf-kar-archetype-3.0.0-SNAPSHOT.jar
Downloading: https://repository.apache.org/content/repositories/snapshots/org/apache/karaf/archetypes/karaf-kar-archetype/3.0.0-SNAPSHOT/maven-metadata.xml
Downloaded: https://repository.apache.org/content/repositories/snapshots/org/apache/karaf/archetypes/karaf-kar-archetype/3.0.0-SNAPSHOT/maven-metadata.xml (799 B at 4.7 KB/sec)
Uploading: https://repository.apache.org/content/repositories/snapshots/org/apache/karaf/archetypes/karaf-kar-archetype/3.0.0-SNAPSHOT/karaf-kar-archetype-3.0.0-20111222.160816-29.jar
Uploaded: https://repository.apache.org/content/repositories/snapshots/org/apache/karaf/archetypes/karaf-kar-archetype/3.0.0-SNAPSHOT/karaf-kar-archetype-3.0.0-20111222.160816-29.jar (14 KB at 18.6 KB/sec)
Uploading: https://repository.apache.org/content/repositories/snapshots/org/apache/karaf/archetypes/karaf-kar-archetype/3.0.0-SNAPSHOT/karaf-kar-archetype-3.0.0-20111222.160816-29.pom
Uploaded: https://repository.apache.org/content/repositories/snapshots/org/apache/karaf/archetypes/karaf-kar-archetype/3.0.0-SNAPSHOT/karaf-kar-archetype-3.0.0-20111222.160816-29.pom (5 KB at 27.3 KB/sec)
Downloading: https://repository.apache.org/content/repositories/snapshots/org/apache/karaf/archetypes/karaf-kar-archetype/maven-metadata.xml
Downloaded: https://repository.apache.org/content/repositories/snapshots/org/apache/karaf/archetypes/karaf-kar-archetype/maven-metadata.xml (386 B at 0.6 KB/sec)
Uploading: https://repository.apache.org/content/repositories/snapshots/org/apache/karaf/archetypes/karaf-kar-archetype/3.0.0-SNAPSHOT/maven-metadata.xml
Uploaded: https://repository.apache.org/content/repositories/snapshots/org/apache/karaf/archetypes/karaf-kar-archetype/3.0.0-SNAPSHOT/maven-metadata.xml (2 KB at 3.6 KB/sec)
Uploading: https://repository.apache.org/content/repositories/snapshots/org/apache/karaf/archetypes/karaf-kar-archetype/maven-metadata.xml
Uploaded: https://repository.apache.org/content/repositories/snapshots/org/apache/karaf/archetypes/karaf-kar-archetype/maven-metadata.xml (772 B at 1.6 KB/sec)
[ERROR] uniqueVersion == false is not anymore supported in maven 3
[INFO] Deployment in https://repository.apache.org/content/repositories/snapshots (id=apache.snapshots.https,uniqueVersion=false)
Deploying the main artifact apache-karaf-3.0.0-SNAPSHOT.pom
Downloading: https://repository.apache.org/content/repositories/snapshots/org/apache/karaf/assemblies/apache-karaf/3.0.0-SNAPSHOT/maven-metadata.xml
Downloaded: https://repository.apache.org/content/repositories/snapshots/org/apache/karaf/assemblies/apache-karaf/3.0.0-SNAPSHOT/maven-metadata.xml (2 KB at 2.0 KB/sec)
Uploading: https://repository.apache.org/content/repositories/snapshots/org/apache/karaf/assemblies/apache-karaf/3.0.0-SNAPSHOT/apache-karaf-3.0.0-20111222.160819-244.pom
Uploaded: https://repository.apache.org/content/repositories/snapshots/org/apache/karaf/assemblies/apache-karaf/3.0.0-SNAPSHOT/apache-karaf-3.0.0-20111222.160819-244.pom (14 KB at 26.3 KB/sec)
Uploading: https://repository.apache.org/content/repositories/snapshots/org/apache/karaf/assemblies/apache-karaf/3.0.0-SNAPSHOT/apache-karaf-3.0.0-20111222.160819-244.pom
Uploaded: https://repository.apache.org/content/repositories/snapshots/org/apache/karaf/assemblies/apache-karaf/3.0.0-SNAPSHOT/apache-karaf-3.0.0-20111222.160819-244.pom (14 KB at 115.5 KB/sec)
Downloading: https://repository.apache.org/content/repositories/snapshots/org/apache/karaf/assemblies/apache-karaf/maven-metadata.xml
Downloaded: https://repository.apache.org/content/repositories/snapshots/org/apache/karaf/assemblies/apache-karaf/maven-metadata.xml (299 B at 2.7 KB/sec)
Uploading: https://repository.apache.org/content/repositories/snapshots/org/apache/karaf/assemblies/apache-karaf/3.0.0-SNAPSHOT/maven-metadata.xml
Uploaded: https://repository.apache.org/content/repositories/snapshots/org/apache/karaf/assemblies/apache-karaf/3.0.0-SNAPSHOT/maven-metadata.xml (3 KB at 14.7 KB/sec)
Uploading: https://repository.apache.org/content/repositories/snapshots/org/apache/karaf/assemblies/apache-karaf/maven-metadata.xml
Uploaded: https://repository.apache.org/content/repositories/snapshots/org/apache/karaf/assemblies/apache-karaf/maven-metadata.xml (598 B at 4.3 KB/sec)
Deploying the main artifact apache-karaf-3.0.0-SNAPSHOT-jettyconfig.xml
Uploading: https://repository.apache.org/content/repositories/snapshots/org/apache/karaf/assemblies/apache-karaf/3.0.0-SNAPSHOT/apache-karaf-3.0.0-20111222.160819-244-jettyconfig.xml
Uploaded: https://repository.apache.org/content/repositories/snapshots/org/apache/karaf/assemblies/apache-karaf/3.0.0-SNAPSHOT/apache-karaf-3.0.0-20111222.160819-244-jettyconfig.xml (6 KB at 25.7 KB/sec)
Uploading: https://repository.apache.org/content/repositories/snapshots/org/apache/karaf/assemblies/apache-karaf/3.0.0-SNAPSHOT/maven-metadata.xml
Uploaded: https://repository.apache.org/content/repositories/snapshots/org/apache/karaf/assemblies/apache-karaf/3.0.0-SNAPSHOT/maven-metadata.xml (3 KB at 7.1 KB/sec)
Deploying the main artifact apache-karaf-3.0.0-SNAPSHOT.tar.gz
Uploading: https://repository.apache.org/content/repositories/snapshots/org/apache/karaf/assemblies/apache-karaf/3.0.0-SNAPSHOT/apache-karaf-3.0.0-20111222.160819-244.tar.gz
Uploaded: https://repository.apache.org/content/repositories/snapshots/org/apache/karaf/assemblies/apache-karaf/3.0.0-SNAPSHOT/apache-karaf-3.0.0-20111222.160819-244.tar.gz (21815 KB at 14257.7 KB/sec)
Uploading: https://repository.apache.org/content/repositories/snapshots/org/apache/karaf/assemblies/apache-karaf/3.0.0-SNAPSHOT/maven-metadata.xml
Uploaded: https://repository.apache.org/content/repositories/snapshots/org/apache/karaf/assemblies/apache-karaf/3.0.0-SNAPSHOT/maven-metadata.xml (3 KB at 9.4 KB/sec)
Deploying the main artifact apache-karaf-3.0.0-SNAPSHOT.zip
Uploading: https://repository.apache.org/content/repositories/snapshots/org/apache/karaf/assemblies/apache-karaf/3.0.0-SNAPSHOT/apache-karaf-3.0.0-20111222.160819-244.zip
Uploaded: https://repository.apache.org/content/repositories/snapshots/org/apache/karaf/assemblies/apache-karaf/3.0.0-SNAPSHOT/apache-karaf-3.0.0-20111222.160819-244.zip (22313 KB at 17270.0 KB/sec)
Uploading: https://repository.apache.org/content/repositories/snapshots/org/apache/karaf/assemblies/apache-karaf/3.0.0-SNAPSHOT/maven-metadata.xml
Uploaded: https://repository.apache.org/content/repositories/snapshots/org/apache/karaf/assemblies/apache-karaf/3.0.0-SNAPSHOT/maven-metadata.xml (3 KB at 7.7 KB/sec)
[ERROR] uniqueVersion == false is not anymore supported in maven 3
[INFO] Deployment in https://repository.apache.org/content/repositories/snapshots (id=apache.snapshots.https,uniqueVersion=false)
Deploying the main artifact apache-karaf-minimal-3.0.0-SNAPSHOT.pom
Downloading: https://repository.apache.org/content/repositories/snapshots/org/apache/karaf/assemblies/apache-karaf-minimal/3.0.0-SNAPSHOT/maven-metadata.xml
Downloaded: https://repository.apache.org/content/repositories/snapshots/org/apache/karaf/assemblies/apache-karaf-minimal/3.0.0-SNAPSHOT/maven-metadata.xml (981 B at 1.4 KB/sec)
Uploading: https://repository.apache.org/content/repositories/snapshots/org/apache/karaf/assemblies/apache-karaf-minimal/3.0.0-SNAPSHOT/apache-karaf-minimal-3.0.0-20111222.160824-245.pom
Uploaded: https://repository.apache.org/content/repositories/snapshots/org/apache/karaf/assemblies/apache-karaf-minimal/3.0.0-SNAPSHOT/apache-karaf-minimal-3.0.0-20111222.160824-245.pom (9 KB at 47.8 KB/sec)
Uploading: https://repository.apache.org/content/repositories/snapshots/org/apache/karaf/assemblies/apache-karaf-minimal/3.0.0-SNAPSHOT/apache-karaf-minimal-3.0.0-20111222.160824-245.pom
Uploaded: https://repository.apache.org/content/repositories/snapshots/org/apache/karaf/assemblies/apache-karaf-minimal/3.0.0-SNAPSHOT/apache-karaf-minimal-3.0.0-20111222.160824-245.pom (9 KB at 29.1 KB/sec)
Downloading: https://repository.apache.org/content/repositories/snapshots/org/apache/karaf/assemblies/apache-karaf-minimal/maven-metadata.xml
Downloaded: https://repository.apache.org/content/repositories/snapshots/org/apache/karaf/assemblies/apache-karaf-minimal/maven-metadata.xml (307 B at 3.0 KB/sec)
Uploading: https://repository.apache.org/content/repositories/snapshots/org/apache/karaf/assemblies/apache-karaf-minimal/3.0.0-SNAPSHOT/maven-metadata.xml
Uploaded: https://repository.apache.org/content/repositories/snapshots/org/apache/karaf/assemblies/apache-karaf-minimal/3.0.0-SNAPSHOT/maven-metadata.xml (2 KB at 10.1 KB/sec)
Uploading: https://repository.apache.org/content/repositories/snapshots/org/apache/karaf/assemblies/apache-karaf-minimal/maven-metadata.xml
Uploaded: https://repository.apache.org/content/repositories/snapshots/org/apache/karaf/assemblies/apache-karaf-minimal/maven-metadata.xml (614 B at 2.9 KB/sec)
Deploying the main artifact apache-karaf-minimal-3.0.0-SNAPSHOT.tar.gz
Uploading: https://repository.apache.org/content/repositories/snapshots/org/apache/karaf/assemblies/apache-karaf-minimal/3.0.0-SNAPSHOT/apache-karaf-minimal-3.0.0-20111222.160824-245.tar.gz
Uploaded: https://repository.apache.org/content/repositories/snapshots/org/apache/karaf/assemblies/apache-karaf-minimal/3.0.0-SNAPSHOT/apache-karaf-minimal-3.0.0-20111222.160824-245.tar.gz (19828 KB at 13525.1 KB/sec)
Uploading: https://repository.apache.org/content/repositories/snapshots/org/apache/karaf/assemblies/apache-karaf-minimal/3.0.0-SNAPSHOT/maven-metadata.xml
Uploaded: https://repository.apache.org/content/repositories/snapshots/org/apache/karaf/assemblies/apache-karaf-minimal/3.0.0-SNAPSHOT/maven-metadata.xml (2 KB at 12.6 KB/sec)
Deploying the main artifact apache-karaf-minimal-3.0.0-SNAPSHOT.zip
Uploading: https://repository.apache.org/content/repositories/snapshots/org/apache/karaf/assemblies/apache-karaf-minimal/3.0.0-SNAPSHOT/apache-karaf-minimal-3.0.0-20111222.160824-245.zip
Uploaded: https://repository.apache.org/content/repositories/snapshots/org/apache/karaf/assemblies/apache-karaf-minimal/3.0.0-SNAPSHOT/apache-karaf-minimal-3.0.0-20111222.160824-245.zip (20230 KB at 2445.8 KB/sec)
Uploading: https://repository.apache.org/content/repositories/snapshots/org/apache/karaf/assemblies/apache-karaf-minimal/3.0.0-SNAPSHOT/maven-metadata.xml
Uploaded: https://repository.apache.org/content/repositories/snapshots/org/apache/karaf/assemblies/apache-karaf-minimal/3.0.0-SNAPSHOT/maven-metadata.xml (2 KB at 12.1 KB/sec)
[ERROR] uniqueVersion == false is not anymore supported in maven 3
[INFO] Deployment in https://repository.apache.org/content/repositories/snapshots (id=apache.snapshots.https,uniqueVersion=false)
Deploying the main artifact assemblies-3.0.0-SNAPSHOT.pom
Downloading: https://repository.apache.org/content/repositories/snapshots/org/apache/karaf/assemblies/assemblies/3.0.0-SNAPSHOT/maven-metadata.xml
Downloaded: https://repository.apache.org/content/repositories/snapshots/org/apache/karaf/assemblies/assemblies/3.0.0-SNAPSHOT/maven-metadata.xml (618 B at 3.3 KB/sec)
Uploading: https://repository.apache.org/content/repositories/snapshots/org/apache/karaf/assemblies/assemblies/3.0.0-SNAPSHOT/assemblies-3.0.0-20111222.160835-245.pom
Uploaded: https://repository.apache.org/content/repositories/snapshots/org/apache/karaf/assemblies/assemblies/3.0.0-SNAPSHOT/assemblies-3.0.0-20111222.160835-245.pom (4 KB at 21.3 KB/sec)
Uploading: https://repository.apache.org/content/repositories/snapshots/org/apache/karaf/assemblies/assemblies/3.0.0-SNAPSHOT/assemblies-3.0.0-20111222.160835-245.pom
Uploaded: https://repository.apache.org/content/repositories/snapshots/org/apache/karaf/assemblies/assemblies/3.0.0-SNAPSHOT/assemblies-3.0.0-20111222.160835-245.pom (4 KB at 11.5 KB/sec)
Downloading: https://repository.apache.org/content/repositories/snapshots/org/apache/karaf/assemblies/assemblies/maven-metadata.xml
Downloaded: https://repository.apache.org/content/repositories/snapshots/org/apache/karaf/assemblies/assemblies/maven-metadata.xml (620 B at 2.8 KB/sec)
Uploading: https://repository.apache.org/content/repositories/snapshots/org/apache/karaf/assemblies/assemblies/3.0.0-SNAPSHOT/maven-metadata.xml
Uploaded: https://repository.apache.org/content/repositories/snapshots/org/apache/karaf/assemblies/assemblies/3.0.0-SNAPSHOT/maven-metadata.xml (2 KB at 6.5 KB/sec)
Uploading: https://repository.apache.org/content/repositories/snapshots/org/apache/karaf/assemblies/assemblies/maven-metadata.xml
Uploaded: https://repository.apache.org/content/repositories/snapshots/org/apache/karaf/assemblies/assemblies/maven-metadata.xml (2 KB at 4.0 KB/sec)
[ERROR] uniqueVersion == false is not anymore supported in maven 3
[INFO] Deployment in https://repository.apache.org/content/repositories/snapshots (id=apache.snapshots.https,uniqueVersion=false)
Deploying the main artifact features-3.0.0-SNAPSHOT.pom
Downloading: https://repository.apache.org/content/repositories/snapshots/org/apache/karaf/assemblies/features/features/3.0.0-SNAPSHOT/maven-metadata.xml
Downloaded: https://repository.apache.org/content/repositories/snapshots/org/apache/karaf/assemblies/features/features/3.0.0-SNAPSHOT/maven-metadata.xml (625 B at 3.5 KB/sec)
Uploading: https://repository.apache.org/content/repositories/snapshots/org/apache/karaf/assemblies/features/features/3.0.0-SNAPSHOT/features-3.0.0-20111222.160837-245.pom
Uploaded: https://repository.apache.org/content/repositories/snapshots/org/apache/karaf/assemblies/features/features/3.0.0-SNAPSHOT/features-3.0.0-20111222.160837-245.pom (4 KB at 14.2 KB/sec)
Uploading: https://repository.apache.org/content/repositories/snapshots/org/apache/karaf/assemblies/features/features/3.0.0-SNAPSHOT/features-3.0.0-20111222.160837-245.pom
Uploaded: https://repository.apache.org/content/repositories/snapshots/org/apache/karaf/assemblies/features/features/3.0.0-SNAPSHOT/features-3.0.0-20111222.160837-245.pom (4 KB at 21.6 KB/sec)
Downloading: https://repository.apache.org/content/repositories/snapshots/org/apache/karaf/assemblies/features/features/maven-metadata.xml
Downloaded: https://repository.apache.org/content/repositories/snapshots/org/apache/karaf/assemblies/features/features/maven-metadata.xml (647 B at 3.5 KB/sec)
Uploading: https://repository.apache.org/content/repositories/snapshots/org/apache/karaf/assemblies/features/features/3.0.0-SNAPSHOT/maven-metadata.xml
Uploaded: https://repository.apache.org/content/repositories/snapshots/org/apache/karaf/assemblies/features/features/3.0.0-SNAPSHOT/maven-metadata.xml (2 KB at 4.2 KB/sec)
Uploading: https://repository.apache.org/content/repositories/snapshots/org/apache/karaf/assemblies/features/features/maven-metadata.xml
Uploaded: https://repository.apache.org/content/repositories/snapshots/org/apache/karaf/assemblies/features/features/maven-metadata.xml (2 KB at 8.4 KB/sec)
[ERROR] uniqueVersion == false is not anymore supported in maven 3
[INFO] Deployment in https://repository.apache.org/content/repositories/snapshots (id=apache.snapshots.https,uniqueVersion=false)
Deploying the main artifact demos-3.0.0-SNAPSHOT.pom
Downloading: https://repository.apache.org/content/repositories/snapshots/org/apache/karaf/demos/demos/3.0.0-SNAPSHOT/maven-metadata.xml
Downloaded: https://repository.apache.org/content/repositories/snapshots/org/apache/karaf/demos/demos/3.0.0-SNAPSHOT/maven-metadata.xml (608 B at 2.5 KB/sec)
Uploading: https://repository.apache.org/content/repositories/snapshots/org/apache/karaf/demos/demos/3.0.0-SNAPSHOT/demos-3.0.0-20111222.160838-245.pom
Uploaded: https://repository.apache.org/content/repositories/snapshots/org/apache/karaf/demos/demos/3.0.0-SNAPSHOT/demos-3.0.0-20111222.160838-245.pom (4 KB at 9.6 KB/sec)
Uploading: https://repository.apache.org/content/repositories/snapshots/org/apache/karaf/demos/demos/3.0.0-SNAPSHOT/demos-3.0.0-20111222.160838-245.pom
Uploaded: https://repository.apache.org/content/repositories/snapshots/org/apache/karaf/demos/demos/3.0.0-SNAPSHOT/demos-3.0.0-20111222.160838-245.pom (4 KB at 33.0 KB/sec)
Downloading: https://repository.apache.org/content/repositories/snapshots/org/apache/karaf/demos/demos/maven-metadata.xml
Downloaded: https://repository.apache.org/content/repositories/snapshots/org/apache/karaf/demos/demos/maven-metadata.xml (791 B at 7.7 KB/sec)
Uploading: https://repository.apache.org/content/repositories/snapshots/org/apache/karaf/demos/demos/3.0.0-SNAPSHOT/maven-metadata.xml
Uploaded: https://repository.apache.org/content/repositories/snapshots/org/apache/karaf/demos/demos/3.0.0-SNAPSHOT/maven-metadata.xml (2 KB at 0.2 KB/sec)
Uploading: https://repository.apache.org/content/repositories/snapshots/org/apache/karaf/demos/demos/maven-metadata.xml
Uploaded: https://repository.apache.org/content/repositories/snapshots/org/apache/karaf/demos/demos/maven-metadata.xml (2 KB at 9.3 KB/sec)
[ERROR] uniqueVersion == false is not anymore supported in maven 3
[INFO] Deployment in https://repository.apache.org/content/repositories/snapshots (id=apache.snapshots.https,uniqueVersion=false)
Deploying the main artifact dump-3.0.0-SNAPSHOT.jar
Downloading: https://repository.apache.org/content/repositories/snapshots/org/apache/karaf/demos/dump/3.0.0-SNAPSHOT/maven-metadata.xml
Downloaded: https://repository.apache.org/content/repositories/snapshots/org/apache/karaf/demos/dump/3.0.0-SNAPSHOT/maven-metadata.xml (782 B at 2.0 KB/sec)
Uploading: https://repository.apache.org/content/repositories/snapshots/org/apache/karaf/demos/dump/3.0.0-SNAPSHOT/dump-3.0.0-20111222.160846-245.jar
Uploaded: https://repository.apache.org/content/repositories/snapshots/org/apache/karaf/demos/dump/3.0.0-SNAPSHOT/dump-3.0.0-20111222.160846-245.jar (18 KB at 30.7 KB/sec)
Uploading: https://repository.apache.org/content/repositories/snapshots/org/apache/karaf/demos/dump/3.0.0-SNAPSHOT/dump-3.0.0-20111222.160846-245.pom
Uploaded: https://repository.apache.org/content/repositories/snapshots/org/apache/karaf/demos/dump/3.0.0-SNAPSHOT/dump-3.0.0-20111222.160846-245.pom (5 KB at 14.1 KB/sec)
Downloading: https://repository.apache.org/content/repositories/snapshots/org/apache/karaf/demos/dump/maven-metadata.xml
Downloaded: https://repository.apache.org/content/repositories/snapshots/org/apache/karaf/demos/dump/maven-metadata.xml (609 B at 6.7 KB/sec)
Uploading: https://repository.apache.org/content/repositories/snapshots/org/apache/karaf/demos/dump/3.0.0-SNAPSHOT/maven-metadata.xml
Uploaded: https://repository.apache.org/content/repositories/snapshots/org/apache/karaf/demos/dump/3.0.0-SNAPSHOT/maven-metadata.xml (2 KB at 8.6 KB/sec)
Uploading: https://repository.apache.org/content/repositories/snapshots/org/apache/karaf/demos/dump/maven-metadata.xml
Uploaded: https://repository.apache.org/content/repositories/snapshots/org/apache/karaf/demos/dump/maven-metadata.xml (2 KB at 7.7 KB/sec)
[ERROR] uniqueVersion == false is not anymore supported in maven 3
[INFO] Deployment in https://repository.apache.org/content/repositories/snapshots (id=apache.snapshots.https,uniqueVersion=false)
Deploying the main artifact my-kar-1.0.pom
Uploading: https://repository.apache.org/content/repositories/snapshots/org/apache/karaf/demos/my-kar/1.0/my-kar-1.0.pom
Uploading: https://repository.apache.org/content/repositories/snapshots/org/apache/karaf/demos/my-kar/1.0/my-kar-1.0.pom
ERROR: Failed to deploy artifacts: Could not transfer artifact org.apache.karaf.demos:my-kar:pom:1.0 from/to apache.snapshots.https (https://repository.apache.org/content/repositories/snapshots): Failed to transfer file: https://repository.apache.org/content/repositories/snapshots/org/apache/karaf/demos/my-kar/1.0/my-kar-1.0.pom. Return code is: 400
org.apache.maven.artifact.deployer.ArtifactDeploymentException: Failed to deploy artifacts: Could not transfer artifact org.apache.karaf.demos:my-kar:pom:1.0 from/to apache.snapshots.https (https://repository.apache.org/content/repositories/snapshots): Failed to transfer file: https://repository.apache.org/content/repositories/snapshots/org/apache/karaf/demos/my-kar/1.0/my-kar-1.0.pom. Return code is: 400
at org.apache.maven.artifact.deployer.DefaultArtifactDeployer.deploy(DefaultArtifactDeployer.java:141)
at hudson.maven.reporters.MavenArtifactRecord.deploy(MavenArtifactRecord.java:189)
at hudson.maven.RedeployPublisher.perform(RedeployPublisher.java:158)
at hudson.tasks.BuildStepMonitor$1.perform(BuildStepMonitor.java:19)
at hudson.model.AbstractBuild$AbstractRunner.perform(AbstractBuild.java:693)
at hudson.model.AbstractBuild$AbstractRunner.performAllBuildSteps(AbstractBuild.java:668)
at hudson.maven.MavenModuleSetBuild$RunnerImpl.post2(MavenModuleSetBuild.java:953)
at hudson.model.AbstractBuild$AbstractRunner.post(AbstractBuild.java:615)
at hudson.model.Run.run(Run.java:1401)
at hudson.maven.MavenModuleSetBuild.run(MavenModuleSetBuild.java:474)
at hudson.model.ResourceController.execute(ResourceController.java:88)
at hudson.model.Executor.run(Executor.java:230)
Caused by: org.sonatype.aether.deployment.DeploymentException: Failed to deploy artifacts: Could not transfer artifact org.apache.karaf.demos:my-kar:pom:1.0 from/to apache.snapshots.https (https://repository.apache.org/content/repositories/snapshots): Failed to transfer file: https://repository.apache.org/content/repositories/snapshots/org/apache/karaf/demos/my-kar/1.0/my-kar-1.0.pom. Return code is: 400
at org.sonatype.aether.impl.internal.DefaultDeployer.deploy(DefaultDeployer.java:284)
at org.sonatype.aether.impl.internal.DefaultDeployer.deploy(DefaultDeployer.java:215)
at org.sonatype.aether.impl.internal.DefaultRepositorySystem.deploy(DefaultRepositorySystem.java:480)
at org.apache.maven.artifact.deployer.DefaultArtifactDeployer.deploy(DefaultArtifactDeployer.java:137)
... 11 more
Caused by: org.sonatype.aether.transfer.ArtifactTransferException: Could not transfer artifact org.apache.karaf.demos:my-kar:pom:1.0 from/to apache.snapshots.https (https://repository.apache.org/content/repositories/snapshots): Failed to transfer file: https://repository.apache.org/content/repositories/snapshots/org/apache/karaf/demos/my-kar/1.0/my-kar-1.0.pom. Return code is: 400
at org.sonatype.aether.connector.wagon.WagonRepositoryConnector$4.wrap(WagonRepositoryConnector.java:949)
at org.sonatype.aether.connector.wagon.WagonRepositoryConnector$4.wrap(WagonRepositoryConnector.java:940)
at org.sonatype.aether.connector.wagon.WagonRepositoryConnector$PutTask.flush(WagonRepositoryConnector.java:864)
at org.sonatype.aether.connector.wagon.WagonRepositoryConnector.put(WagonRepositoryConnector.java:466)
at org.sonatype.aether.impl.internal.DefaultDeployer.deploy(DefaultDeployer.java:278)
... 14 more
Caused by: org.apache.maven.wagon.TransferFailedException: Failed to transfer file: https://repository.apache.org/content/repositories/snapshots/org/apache/karaf/demos/my-kar/1.0/my-kar-1.0.pom. Return code is: 400
at org.apache.maven.wagon.shared.http.AbstractHttpClientWagon.put(AbstractHttpClientWagon.java:368)
at org.apache.maven.wagon.shared.http.AbstractHttpClientWagon.put(AbstractHttpClientWagon.java:280)
at org.sonatype.aether.connector.wagon.WagonRepositoryConnector$PutTask.run(WagonRepositoryConnector.java:825)
at org.sonatype.aether.connector.wagon.WagonRepositoryConnector.put(WagonRepositoryConnector.java:465)
... 15 more
[INFO] Deployment failed after 1 min 20 sec
Build step 'Deploy artifacts to Maven repository' changed build result to FAILURE